<?xml version="1.0" encoding="UTF-8" standalone="no"?>
<svg
   xmlns:dc="http://purl.org/dc/elements/1.1/"
   xmlns:cc="http://creativecommons.org/ns#"
   xmlns:rdf="http://www.w3.org/1999/02/22-rdf-syntax-ns#"
   xmlns:svg="http://www.w3.org/2000/svg"
   xmlns="http://www.w3.org/2000/svg"
   xmlns:xlink="http://www.w3.org/1999/xlink"
   xmlns:sodipodi="http://sodipodi.sourceforge.net/DTD/sodipodi-0.dtd"
   xmlns:inkscape="http://www.inkscape.org/namespaces/inkscape"
   inkscape:version="0.92.4 (5da689c313, 2019-01-14)"
   sodipodi:docname="multi-solve-simple.svg"
   height="514.94318"
   id="svg2"
   version="1.1"
   width="480.16513">
  <sodipodi:namedview
     pagecolor="#ffffff"
     bordercolor="#666666"
     borderopacity="1"
     objecttolerance="10"
     gridtolerance="10"
     guidetolerance="10"
     inkscape:pageopacity="0"
     inkscape:pageshadow="2"
     inkscape:window-width="1920"
     inkscape:window-height="1025"
     id="namedview53"
     showgrid="false"
     showguides="true"
     inkscape:guide-bbox="true"
     inkscape:zoom="2"
     inkscape:cx="248.4067"
     inkscape:cy="258.43297"
     inkscape:window-x="0"
     inkscape:window-y="386"
     inkscape:window-maximized="1"
     inkscape:current-layer="svg2"
     fit-margin-top="0"
     fit-margin-left="0"
     fit-margin-right="0"
     fit-margin-bottom="0"
     inkscape:lockguides="false">
    <sodipodi:guide
       position="34.251192,457.35037"
       orientation="1,0"
       id="guide4613"
       inkscape:locked="false" />
    <sodipodi:guide
       position="503.19613,457.35037"
       orientation="0,1"
       id="guide4615"
       inkscape:locked="false" />
    <sodipodi:guide
       position="494.1512,-7.4199758"
       orientation="0,1"
       id="guide4617"
       inkscape:locked="false" />
    <sodipodi:guide
       position="14.074036,400.29772"
       orientation="1,0"
       id="guide4619"
       inkscape:locked="false" />
    <sodipodi:guide
       position="478.84439,392.64432"
       orientation="1,0"
       id="guide4621"
       inkscape:locked="false" />
    <sodipodi:guide
       position="468.79945,496.00892"
       orientation="1,0"
       id="guide4623"
       inkscape:locked="false" />
    <sodipodi:guide
       position="-7.1031193,457.35037"
       orientation="1,0"
       id="guide860"
       inkscape:locked="false" />
    <sodipodi:guide
       position="-7.1031193,476.52752"
       orientation="0,1"
       id="guide862"
       inkscape:locked="false" />
    <sodipodi:guide
       position="-7.1031193,446.60967"
       orientation="0,1"
       id="guide866"
       inkscape:locked="false" />
    <sodipodi:guide
       position="49.949527,136.29894"
       orientation="0,1"
       id="guide868"
       inkscape:locked="false" />
    <sodipodi:guide
       position="-18.931107,146.7354"
       orientation="0,1"
       id="guide870"
       inkscape:locked="false" />
    <sodipodi:guide
       position="-7.1031193,1.3207242"
       orientation="0,1"
       id="guide872"
       inkscape:locked="false" />
    <sodipodi:guide
       position="14.074036,466.78683"
       orientation="0,1"
       id="guide874"
       inkscape:locked="false" />
    <sodipodi:guide
       position="3.33334,391.64432"
       orientation="1,0"
       id="guide876"
       inkscape:locked="false" />
    <sodipodi:guide
       position="23.510496,486.26822"
       orientation="1,0"
       id="guide880"
       inkscape:locked="false" />
    <sodipodi:guide
       position="337.30005,476.52752"
       orientation="1,0"
       id="guide882"
       inkscape:locked="false" />
    <sodipodi:guide
       position="327.55936,476.52752"
       orientation="1,0"
       id="guide884"
       inkscape:locked="false" />
    <sodipodi:guide
       position="347.04075,476.52752"
       orientation="1,0"
       id="guide886"
       inkscape:locked="false" />
    <sodipodi:guide
       position="-120.51264,126.55824"
       orientation="0,1"
       id="guide2374"
       inkscape:locked="false" />
    <sodipodi:guide
       inkscape:locked="false"
       id="guide8366"
       orientation="0,1"
       position="-476.23608,292.33811" />
    <sodipodi:guide
       inkscape:locked="false"
       id="guide8368"
       orientation="1,0"
       position="177.1126,514.71281" />
    <sodipodi:guide
       inkscape:locked="false"
       id="guide8372"
       orientation="1,0"
       position="-253.95384,371.8296" />
    <sodipodi:guide
       inkscape:locked="false"
       id="guide8374"
       orientation="1,0"
       position="-391.61561,530.45615" />
    <sodipodi:guide
       inkscape:locked="false"
       id="guide8376"
       orientation="1,0"
       position="-253.95384,520.61656" />
    <sodipodi:guide
       inkscape:locked="false"
       id="guide8378"
       orientation="1,0"
       position="138.80492,292.33811" />
    <sodipodi:guide
       inkscape:locked="false"
       id="guide8380"
       orientation="1,0"
       position="216.38261,292.33811" />
    <sodipodi:guide
       inkscape:locked="false"
       id="guide8382"
       orientation="0,1"
       position="138.80492,323.474" />
    <sodipodi:guide
       inkscape:locked="false"
       id="guide8384"
       orientation="0,1"
       position="138.80492,263.6383" />
    <sodipodi:guide
       inkscape:locked="false"
       id="guide9029"
       orientation="0,1"
       position="347.04075,72.499988" />
    <sodipodi:guide
       position="407.36982,136.29894"
       orientation="1,0"
       id="guide9574"
       inkscape:locked="false" />
    <sodipodi:guide
       position="327.55936,11.06145"
       orientation="0,1"
       id="guide9595"
       inkscape:locked="false" />
    <sodipodi:guide
       inkscape:locked="false"
       id="guide2697"
       orientation="0,1"
       position="432.7652,286.13293" />
    <sodipodi:guide
       inkscape:locked="false"
       id="guide2713"
       orientation="1,0"
       position="386.67083,316.05078" />
    <sodipodi:guide
       inkscape:locked="false"
       id="guide2715"
       orientation="0,1"
       position="438.50525,331.35759" />
    <sodipodi:guide
       inkscape:locked="false"
       id="guide2717"
       orientation="1,0"
       position="471.55404,321.26901" />
    <sodipodi:guide
       inkscape:locked="false"
       id="guide3161"
       orientation="1,0"
       position="356.92691,146.7354" />
    <sodipodi:guide
       position="327.55936,452.12908"
       orientation="1,0"
       id="guide3491"
       inkscape:locked="false" />
    <sodipodi:guide
       position="332.3321,452.12909"
       orientation="1,0"
       id="guide3493"
       inkscape:locked="false" />
    <sodipodi:guide
       position="362.34285,449.91518"
       orientation="1,0"
       id="guide3495"
       inkscape:locked="false" />
    <sodipodi:guide
       position="368.07017,476.40527"
       orientation="1,0"
       id="guide3553"
       inkscape:locked="false" />
    <sodipodi:guide
       position="457.75,498.12499"
       orientation="0,1"
       id="guide4906"
       inkscape:locked="false" />
    <sodipodi:guide
       position="443,501.12499"
       orientation="1,0"
       id="guide4908"
       inkscape:locked="false" />
    <sodipodi:guide
       position="477.5,498.12499"
       orientation="1,0"
       id="guide4910"
       inkscape:locked="false" />
    <sodipodi:guide
       position="382.75,446.60967"
       orientation="1,0"
       id="guide2590"
       inkscape:locked="false" />
    <sodipodi:guide
       position="311.25,232.25"
       orientation="1,0"
       id="guide2592"
       inkscape:locked="false" />
    <sodipodi:guide
       position="454,234"
       orientation="1,0"
       id="guide2594"
       inkscape:locked="false" />
    <sodipodi:guide
       position="382.75,208.75"
       orientation="0,1"
       id="guide2596"
       inkscape:locked="false" />
  </sodipodi:namedview>
  <defs
     id="defs4">
    <pattern
       inkscape:stockid="Polka dots, small"
       id="Polkadots-small"
       patternTransform="translate(0,0) scale(10,10)"
       height="10"
       width="10"
       patternUnits="userSpaceOnUse"
       inkscape:collect="always">
      <circle
         id="circle1877"
         r="0.05"
         cy="0.810"
         cx="2.567"
         style="fill:black;stroke:none" />
      <circle
         id="circle1879"
         r="0.05"
         cy="2.33"
         cx="3.048"
         style="fill:black;stroke:none" />
      <circle
         id="circle1881"
         r="0.05"
         cy="2.415"
         cx="4.418"
         style="fill:black;stroke:none" />
      <circle
         id="circle1883"
         r="0.05"
         cy="3.029"
         cx="1.844"
         style="fill:black;stroke:none" />
      <circle
         id="circle1885"
         r="0.05"
         cy="1.363"
         cx="6.08"
         style="fill:black;stroke:none" />
      <circle
         id="circle1887"
         r="0.05"
         cy="4.413"
         cx="5.819"
         style="fill:black;stroke:none" />
      <circle
         id="circle1889"
         r="0.05"
         cy="4.048"
         cx="4.305"
         style="fill:black;stroke:none" />
      <circle
         id="circle1891"
         r="0.05"
         cy="3.045"
         cx="5.541"
         style="fill:black;stroke:none" />
      <circle
         id="circle1893"
         r="0.05"
         cy="5.527"
         cx="4.785"
         style="fill:black;stroke:none" />
      <circle
         id="circle1895"
         r="0.05"
         cy="5.184"
         cx="2.667"
         style="fill:black;stroke:none" />
      <circle
         id="circle1897"
         r="0.05"
         cy="1.448"
         cx="7.965"
         style="fill:black;stroke:none" />
      <circle
         id="circle1899"
         r="0.05"
         cy="5.049"
         cx="7.047"
         style="fill:black;stroke:none" />
      <circle
         id="circle1901"
         r="0.05"
         cy="0.895"
         cx="4.340"
         style="fill:black;stroke:none" />
      <circle
         id="circle1903"
         r="0.05"
         cy="0.340"
         cx="7.125"
         style="fill:black;stroke:none" />
      <circle
         id="circle1905"
         r="0.05"
         cy="1.049"
         cx="9.553"
         style="fill:black;stroke:none" />
      <circle
         id="circle1907"
         r="0.05"
         cy="2.689"
         cx="7.006"
         style="fill:black;stroke:none" />
      <circle
         id="circle1909"
         r="0.05"
         cy="2.689"
         cx="8.909"
         style="fill:black;stroke:none" />
      <circle
         id="circle1911"
         r="0.05"
         cy="4.407"
         cx="9.315"
         style="fill:black;stroke:none" />
      <circle
         id="circle1913"
         r="0.05"
         cy="3.870"
         cx="7.820"
         style="fill:black;stroke:none" />
      <circle
         id="circle1915"
         r="0.05"
         cy="5.948"
         cx="8.270"
         style="fill:black;stroke:none" />
      <circle
         id="circle1917"
         r="0.05"
         cy="7.428"
         cx="7.973"
         style="fill:black;stroke:none" />
      <circle
         id="circle1919"
         r="0.05"
         cy="8.072"
         cx="9.342"
         style="fill:black;stroke:none" />
      <circle
         id="circle1921"
         r="0.05"
         cy="9.315"
         cx="8.206"
         style="fill:black;stroke:none" />
      <circle
         id="circle1923"
         r="0.05"
         cy="9.475"
         cx="9.682"
         style="fill:black;stroke:none" />
      <circle
         id="circle1925"
         r="0.05"
         cy="6.186"
         cx="9.688"
         style="fill:black;stroke:none" />
      <circle
         id="circle1927"
         r="0.05"
         cy="6.296"
         cx="3.379"
         style="fill:black;stroke:none" />
      <circle
         id="circle1929"
         r="0.05"
         cy="8.204"
         cx="2.871"
         style="fill:black;stroke:none" />
      <circle
         id="circle1931"
         r="0.05"
         cy="8.719"
         cx="4.59"
         style="fill:black;stroke:none" />
      <circle
         id="circle1933"
         r="0.05"
         cy="9.671"
         cx="3.181"
         style="fill:black;stroke:none" />
      <circle
         id="circle1935"
         r="0.05"
         cy="7.315"
         cx="5.734"
         style="fill:black;stroke:none" />
      <circle
         id="circle1937"
         r="0.05"
         cy="6.513"
         cx="6.707"
         style="fill:black;stroke:none" />
      <circle
         id="circle1939"
         r="0.05"
         cy="9.670"
         cx="5.730"
         style="fill:black;stroke:none" />
      <circle
         id="circle1941"
         r="0.05"
         cy="8.373"
         cx="6.535"
         style="fill:black;stroke:none" />
      <circle
         id="circle1943"
         r="0.05"
         cy="7.154"
         cx="4.37"
         style="fill:black;stroke:none" />
      <circle
         id="circle1945"
         r="0.05"
         cy="7.25"
         cx="0.622"
         style="fill:black;stroke:none" />
      <circle
         id="circle1947"
         r="0.05"
         cy="5.679"
         cx="0.831"
         style="fill:black;stroke:none" />
      <circle
         id="circle1949"
         r="0.05"
         cy="8.519"
         cx="1.257"
         style="fill:black;stroke:none" />
      <circle
         id="circle1951"
         r="0.05"
         cy="6.877"
         cx="1.989"
         style="fill:black;stroke:none" />
      <circle
         id="circle1953"
         r="0.05"
         cy="3.181"
         cx="0.374"
         style="fill:black;stroke:none" />
      <circle
         id="circle1955"
         r="0.05"
         cy="1.664"
         cx="1.166"
         style="fill:black;stroke:none" />
      <circle
         id="circle1957"
         r="0.05"
         cy="0.093"
         cx="1.151"
         style="fill:black;stroke:none" />
      <circle
         id="circle1959"
         r="0.05"
         cy="10.093"
         cx="1.151"
         style="fill:black;stroke:none" />
      <circle
         id="circle1961"
         r="0.05"
         cy="4.451"
         cx="1.302"
         style="fill:black;stroke:none" />
      <circle
         id="circle1963"
         r="0.05"
         cy="3.763"
         cx="3.047"
         style="fill:black;stroke:none" />
    </pattern>
    <pattern
       inkscape:collect="always"
       xlink:href="#Packedcircles-798"
       id="pattern1109"
       patternTransform="matrix(10,0,0,10,36,44.823009)" />
    <pattern
       inkscape:collect="always"
       xlink:href="#Polkadots-med"
       id="pattern9593"
       patternTransform="matrix(10,0,0,10,-8.1732652e-8,34.934327)" />
    <pattern
       inkscape:isstock="true"
       inkscape:stockid="Polka dots, medium"
       id="Polkadots-med"
       patternTransform="translate(0,0) scale(10,10)"
       height="10"
       width="10"
       patternUnits="userSpaceOnUse"
       inkscape:collect="always">
      <circle
         id="circle5594"
         r="0.15"
         cy="0.810"
         cx="2.567"
         style="fill:black;stroke:none" />
      <circle
         id="circle5596"
         r="0.15"
         cy="2.33"
         cx="3.048"
         style="fill:black;stroke:none" />
      <circle
         id="circle5598"
         r="0.15"
         cy="2.415"
         cx="4.418"
         style="fill:black;stroke:none" />
      <circle
         id="circle5600"
         r="0.15"
         cy="3.029"
         cx="1.844"
         style="fill:black;stroke:none" />
      <circle
         id="circle5602"
         r="0.15"
         cy="1.363"
         cx="6.08"
         style="fill:black;stroke:none" />
      <circle
         id="circle5604"
         r="0.15"
         cy="4.413"
         cx="5.819"
         style="fill:black;stroke:none" />
      <circle
         id="circle5606"
         r="0.15"
         cy="4.048"
         cx="4.305"
         style="fill:black;stroke:none" />
      <circle
         id="circle5608"
         r="0.15"
         cy="3.045"
         cx="5.541"
         style="fill:black;stroke:none" />
      <circle
         id="circle5610"
         r="0.15"
         cy="5.527"
         cx="4.785"
         style="fill:black;stroke:none" />
      <circle
         id="circle5612"
         r="0.15"
         cy="5.184"
         cx="2.667"
         style="fill:black;stroke:none" />
      <circle
         id="circle5614"
         r="0.15"
         cy="1.448"
         cx="7.965"
         style="fill:black;stroke:none" />
      <circle
         id="circle5616"
         r="0.15"
         cy="5.049"
         cx="7.047"
         style="fill:black;stroke:none" />
      <circle
         id="circle5618"
         r="0.15"
         cy="0.895"
         cx="4.340"
         style="fill:black;stroke:none" />
      <circle
         id="circle5620"
         r="0.15"
         cy="0.340"
         cx="7.125"
         style="fill:black;stroke:none" />
      <circle
         id="circle5622"
         r="0.15"
         cy="1.049"
         cx="9.553"
         style="fill:black;stroke:none" />
      <circle
         id="circle5624"
         r="0.15"
         cy="2.689"
         cx="7.006"
         style="fill:black;stroke:none" />
      <circle
         id="circle5626"
         r="0.15"
         cy="2.689"
         cx="8.909"
         style="fill:black;stroke:none" />
      <circle
         id="circle5628"
         r="0.15"
         cy="4.407"
         cx="9.315"
         style="fill:black;stroke:none" />
      <circle
         id="circle5630"
         r="0.15"
         cy="3.870"
         cx="7.820"
         style="fill:black;stroke:none" />
      <circle
         id="circle5632"
         r="0.15"
         cy="5.948"
         cx="8.270"
         style="fill:black;stroke:none" />
      <circle
         id="circle5634"
         r="0.15"
         cy="7.428"
         cx="7.973"
         style="fill:black;stroke:none" />
      <circle
         id="circle5636"
         r="0.15"
         cy="8.072"
         cx="9.342"
         style="fill:black;stroke:none" />
      <circle
         id="circle5638"
         r="0.15"
         cy="9.315"
         cx="8.206"
         style="fill:black;stroke:none" />
      <circle
         id="circle5640"
         r="0.15"
         cy="9.475"
         cx="9.682"
         style="fill:black;stroke:none" />
      <circle
         id="circle5642"
         r="0.15"
         cy="6.186"
         cx="9.688"
         style="fill:black;stroke:none" />
      <circle
         id="circle5644"
         r="0.15"
         cy="6.296"
         cx="3.379"
         style="fill:black;stroke:none" />
      <circle
         id="circle5646"
         r="0.15"
         cy="8.204"
         cx="2.871"
         style="fill:black;stroke:none" />
      <circle
         id="circle5648"
         r="0.15"
         cy="8.719"
         cx="4.59"
         style="fill:black;stroke:none" />
      <circle
         id="circle5650"
         r="0.15"
         cy="9.671"
         cx="3.181"
         style="fill:black;stroke:none" />
      <circle
         id="circle5652"
         r="0.15"
         cy="7.315"
         cx="5.734"
         style="fill:black;stroke:none" />
      <circle
         id="circle5654"
         r="0.15"
         cy="6.513"
         cx="6.707"
         style="fill:black;stroke:none" />
      <circle
         id="circle5656"
         r="0.15"
         cy="9.670"
         cx="5.730"
         style="fill:black;stroke:none" />
      <circle
         id="circle5658"
         r="0.15"
         cy="8.373"
         cx="6.535"
         style="fill:black;stroke:none" />
      <circle
         id="circle5660"
         r="0.15"
         cy="7.154"
         cx="4.37"
         style="fill:black;stroke:none" />
      <circle
         id="circle5662"
         r="0.15"
         cy="7.25"
         cx="0.622"
         style="fill:black;stroke:none" />
      <circle
         id="circle5664"
         r="0.15"
         cy="5.679"
         cx="0.831"
         style="fill:black;stroke:none" />
      <circle
         id="circle5666"
         r="0.15"
         cy="8.519"
         cx="1.257"
         style="fill:black;stroke:none" />
      <circle
         id="circle5668"
         r="0.15"
         cy="6.877"
         cx="1.989"
         style="fill:black;stroke:none" />
      <circle
         id="circle5670"
         r="0.15"
         cy="3.181"
         cx="0.374"
         style="fill:black;stroke:none" />
      <circle
         id="circle5672"
         r="0.15"
         cy="1.664"
         cx="1.166"
         style="fill:black;stroke:none" />
      <circle
         id="circle5674"
         r="0.15"
         cy="0.093"
         cx="1.151"
         style="fill:black;stroke:none" />
      <circle
         id="circle5676"
         r="0.15"
         cy="10.093"
         cx="1.151"
         style="fill:black;stroke:none" />
      <circle
         id="circle5678"
         r="0.15"
         cy="4.451"
         cx="1.302"
         style="fill:black;stroke:none" />
      <circle
         id="circle5680"
         r="0.15"
         cy="3.763"
         cx="3.047"
         style="fill:black;stroke:none" />
    </pattern>
    <pattern
       patternTransform="matrix(10,0,0,10,-4.6139526e-8,44.823026)"
       id="pattern1104"
       xlink:href="#Polkadots-large-23"
       inkscape:collect="always" />
    <pattern
       inkscape:collect="always"
       patternUnits="userSpaceOnUse"
       width="10"
       height="10"
       patternTransform="translate(0,0) scale(10,10)"
       id="Polkadots-large-23"
       inkscape:stockid="Polka dots, large"
       inkscape:isstock="true">
      <circle
         style="fill:#00ff00;stroke:none;opacity:1"
         cx="2.567"
         cy="0.810"
         r="0.45"
         id="circle10037" />
      <circle
         style="fill:#00ff00;stroke:none;opacity:1"
         cx="3.048"
         cy="2.33"
         r="0.45"
         id="circle10039" />
      <circle
         style="fill:#00ff00;stroke:none;opacity:1"
         cx="4.418"
         cy="2.415"
         r="0.45"
         id="circle10041" />
      <circle
         style="fill:#00ff00;stroke:none;opacity:1"
         cx="1.844"
         cy="3.029"
         r="0.45"
         id="circle10043" />
      <circle
         style="fill:#00ff00;stroke:none;opacity:1"
         cx="6.08"
         cy="1.363"
         r="0.45"
         id="circle10045" />
      <circle
         style="fill:#00ff00;stroke:none;opacity:1"
         cx="5.819"
         cy="4.413"
         r="0.45"
         id="circle10047" />
      <circle
         style="fill:#00ff00;stroke:none;opacity:1"
         cx="4.305"
         cy="4.048"
         r="0.45"
         id="circle10049" />
      <circle
         style="fill:#00ff00;stroke:none;opacity:1"
         cx="5.541"
         cy="3.045"
         r="0.45"
         id="circle10051" />
      <circle
         style="fill:#00ff00;stroke:none;opacity:1"
         cx="4.785"
         cy="5.527"
         r="0.45"
         id="circle10053" />
      <circle
         style="fill:#00ff00;stroke:none;opacity:1"
         cx="2.667"
         cy="5.184"
         r="0.45"
         id="circle10055" />
      <circle
         style="fill:#00ff00;stroke:none;opacity:1"
         cx="7.965"
         cy="1.448"
         r="0.45"
         id="circle10057" />
      <circle
         style="fill:#00ff00;stroke:none;opacity:1"
         cx="7.047"
         cy="5.049"
         r="0.45"
         id="circle10059" />
      <circle
         style="fill:#00ff00;stroke:none;opacity:1"
         cx="4.340"
         cy="0.895"
         r="0.45"
         id="circle10061" />
      <circle
         style="fill:#00ff00;stroke:none;opacity:1"
         cx="7.125"
         cy="0.340"
         r="0.45"
         id="circle10063" />
      <circle
         style="fill:#00ff00;stroke:none;opacity:1"
         cx="9.553"
         cy="1.049"
         r="0.45"
         id="circle10065" />
      <circle
         style="fill:#00ff00;stroke:none;opacity:1"
         cx="7.006"
         cy="2.689"
         r="0.45"
         id="circle10067" />
      <circle
         style="fill:#00ff00;stroke:none;opacity:1"
         cx="8.909"
         cy="2.689"
         r="0.45"
         id="circle10069" />
      <circle
         style="fill:#00ff00;stroke:none;opacity:1"
         cx="9.315"
         cy="4.407"
         r="0.45"
         id="circle10071" />
      <circle
         style="fill:#00ff00;stroke:none;opacity:1"
         cx="7.820"
         cy="3.870"
         r="0.45"
         id="circle10073" />
      <circle
         style="fill:#00ff00;stroke:none;opacity:1"
         cx="8.270"
         cy="5.948"
         r="0.45"
         id="circle10075" />
      <circle
         style="fill:#00ff00;stroke:none;opacity:1"
         cx="7.973"
         cy="7.428"
         r="0.45"
         id="circle10077" />
      <circle
         style="fill:#00ff00;stroke:none;opacity:1"
         cx="9.342"
         cy="8.072"
         r="0.45"
         id="circle10079" />
      <circle
         style="fill:#00ff00;stroke:none;opacity:1"
         cx="8.206"
         cy="9.315"
         r="0.45"
         id="circle10081" />
      <circle
         style="fill:#00ff00;stroke:none;opacity:1"
         cx="9.682"
         cy="9.475"
         r="0.45"
         id="circle10083" />
      <circle
         style="fill:#00ff00;stroke:none;opacity:1"
         cx="9.688"
         cy="6.186"
         r="0.45"
         id="circle10085" />
      <circle
         style="fill:#00ff00;stroke:none;opacity:1"
         cx="3.379"
         cy="6.296"
         r="0.45"
         id="circle10087" />
      <circle
         style="fill:#00ff00;stroke:none;opacity:1"
         cx="2.871"
         cy="8.204"
         r="0.45"
         id="circle10089" />
      <circle
         style="fill:#00ff00;stroke:none;opacity:1"
         cx="4.59"
         cy="8.719"
         r="0.45"
         id="circle10091" />
      <circle
         style="fill:#00ff00;stroke:none;opacity:1"
         cx="3.181"
         cy="9.671"
         r="0.45"
         id="circle10093" />
      <circle
         style="fill:#00ff00;stroke:none;opacity:1"
         cx="5.734"
         cy="7.315"
         r="0.45"
         id="circle10095" />
      <circle
         style="fill:#00ff00;stroke:none;opacity:1"
         cx="6.707"
         cy="6.513"
         r="0.45"
         id="circle10097" />
      <circle
         style="fill:#00ff00;stroke:none;opacity:1"
         cx="5.730"
         cy="9.670"
         r="0.45"
         id="circle10099" />
      <circle
         style="fill:#00ff00;stroke:none;opacity:1"
         cx="6.535"
         cy="8.373"
         r="0.45"
         id="circle10101" />
      <circle
         style="fill:#00ff00;stroke:none;opacity:1"
         cx="4.37"
         cy="7.154"
         r="0.45"
         id="circle10103" />
      <circle
         style="fill:#00ff00;stroke:none;opacity:1"
         cx="0.622"
         cy="7.25"
         r="0.45"
         id="circle10105" />
      <circle
         style="fill:#00ff00;stroke:none;opacity:1"
         cx="0.831"
         cy="5.679"
         r="0.45"
         id="circle10107" />
      <circle
         style="fill:#00ff00;stroke:none;opacity:1"
         cx="1.257"
         cy="8.519"
         r="0.45"
         id="circle10109" />
      <circle
         style="fill:#00ff00;stroke:none;opacity:1"
         cx="1.989"
         cy="6.877"
         r="0.45"
         id="circle10111" />
      <circle
         style="fill:#00ff00;stroke:none;opacity:1"
         cx="0.374"
         cy="3.181"
         r="0.45"
         id="circle10113" />
      <circle
         style="fill:#00ff00;stroke:none;opacity:1"
         cx="1.166"
         cy="1.664"
         r="0.45"
         id="circle10115" />
      <circle
         style="fill:#00ff00;stroke:none;opacity:1"
         cx="1.151"
         cy="0.093"
         r="0.45"
         id="circle10117" />
      <circle
         style="fill:#00ff00;stroke:none;opacity:1"
         cx="1.151"
         cy="10.093"
         r="0.45"
         id="circle10119" />
      <circle
         style="fill:#00ff00;stroke:none;opacity:1"
         cx="1.302"
         cy="4.451"
         r="0.45"
         id="circle10121" />
      <circle
         style="fill:#00ff00;stroke:none;opacity:1"
         cx="3.047"
         cy="3.763"
         r="0.45"
         id="circle10123" />
    </pattern>
    <pattern
       inkscape:collect="always"
       patternUnits="userSpaceOnUse"
       width="1"
       height="1.73205080756"
       patternTransform="translate(0,0) scale(10,10)"
       id="Packedcircles-798"
       inkscape:stockid="Packed circles">
      <circle
         style="fill:#ff0000;stroke:none;opacity:1"
         cx="0"
         cy="0.5"
         r="0.5"
         id="circle3323" />
      <circle
         style="fill:#ff0000;stroke:none;opacity:1"
         cx="1"
         cy="0.5"
         r="0.5"
         id="circle3325" />
      <circle
         style="fill:#ff0000;stroke:none;opacity:1"
         cx="0.5"
         cy="1.36602540378"
         r="0.5"
         id="circle3327" />
      <circle
         style="fill:#ff0000;stroke:none;opacity:1"
         cx="0.5"
         cy="-0.366025403784"
         r="0.5"
         id="circle3329" />
    </pattern>
    <marker
       inkscape:isstock="true"
       style="overflow:visible"
       id="marker4595"
       refX="0"
       refY="0"
       orient="auto"
       inkscape:stockid="StopM">
      <path
         inkscape:connector-curvature="0"
         transform="scale(0.4)"
         style="fill:none;fill-opacity:0.75;fill-rule:evenodd;stroke:#000000;stroke-width:1.00000003pt;stroke-opacity:1"
         d="M 0,5.65 V -5.65"
         id="path4593" />
    </marker>
    <marker
       inkscape:stockid="Arrow1Mend"
       orient="auto"
       refY="0"
       refX="0"
       id="marker4683"
       style="overflow:visible"
       inkscape:isstock="true">
      <path
         inkscape:connector-curvature="0"
         id="path4681"
         d="M 0,0 5,-5 -12.5,0 5,5 Z"
         style="fill:#000000;fill-opacity:1;fill-rule:evenodd;stroke:#000000;stroke-width:1.00000003pt;stroke-opacity:1"
         transform="matrix(-0.4,0,0,-0.4,-4,0)" />
    </marker>
  </defs>
  <metadata
     id="metadata7">
    <rdf:RDF>
      <cc:Work
         rdf:about="">
        <dc:format>image/svg+xml</dc:format>
        <dc:type
           rdf:resource="http://purl.org/dc/dcmitype/StillImage" />
        <dc:title />
        <dc:title />
      </cc:Work>
    </rdf:RDF>
  </metadata>
  <path
     style="opacity:1;fill:url(#pattern9593);fill-opacity:1;fill-rule:nonzero;stroke:#000300;stroke-width:1.33333337;stroke-miterlimit:4;stroke-dasharray:none;stroke-opacity:1"
     d="M 23.510487,378.64421 H 327.55935 V 503.88173 H 23.510487 Z"
     id="rect8390"
     inkscape:connector-curvature="0"
     inkscape:export-filename="/home/marek/multi-solve.png"
     inkscape:export-xdpi="96"
     inkscape:export-ydpi="96" />
  <path
     style="opacity:1;fill:#ffffff;fill-opacity:1;fill-rule:nonzero;stroke:#000300;stroke-width:1.33333337;stroke-miterlimit:4;stroke-dasharray:none;stroke-opacity:1"
     d="m 138.80492,411.71693 h 77.57769 v 59.8357 h -77.57769 z"
     id="rect8386-3"
     inkscape:connector-curvature="0"
     inkscape:export-filename="/home/marek/multi-solve.png"
     inkscape:export-xdpi="96"
     inkscape:export-ydpi="96" />
  <path
     inkscape:connector-curvature="0"
     id="path114"
     style="font-style:normal;font-variant:normal;font-weight:bold;font-stretch:normal;font-size:32px;line-height:125%;font-family:Arial;-inkscape-font-specification:'Arial, Normal';font-variant-ligatures:normal;font-variant-caps:normal;font-variant-numeric:normal;font-feature-settings:normal;text-align:center;letter-spacing:0px;word-spacing:0px;writing-mode:lr-tb;text-anchor:middle;fill:#000000;fill-opacity:1;stroke:none;stroke-width:1px;stroke-linecap:butt;stroke-linejoin:miter;stroke-opacity:1"
     d="m 172.7059,440.84267 h -5.03125 l -2,-5.20312 h -9.15625 l -1.89062,5.20312 h -4.90625 l 8.92187,-22.90625 h 4.89063 z m -8.51562,-9.0625 -3.15625,-8.5 -3.09375,8.5 z"
     inkscape:export-filename="/home/marek/multi-solve.png"
     inkscape:export-xdpi="96"
     inkscape:export-ydpi="96" />
  <path
     inkscape:connector-curvature="0"
     id="path116"
     style="font-style:normal;font-variant:normal;font-weight:bold;font-stretch:normal;font-size:32px;line-height:125%;font-family:Arial;-inkscape-font-specification:'Arial, Normal';font-variant-ligatures:normal;font-variant-caps:normal;font-variant-numeric:normal;font-feature-settings:normal;text-align:center;letter-spacing:0px;word-spacing:0px;writing-mode:lr-tb;baseline-shift:sub;text-anchor:middle;fill:#000000;fill-opacity:1;stroke:none;stroke-width:1px;stroke-linecap:butt;stroke-linejoin:miter;stroke-opacity:1"
     d="m 173.65903,442.5083 4.40625,-0.67188 q 0.28125,1.28125 1.14062,1.95313 0.85938,0.65625 2.40625,0.65625 1.70313,0 2.5625,-0.625 0.57813,-0.4375 0.57813,-1.17188 0,-0.5 -0.3125,-0.82812 -0.32813,-0.3125 -1.46875,-0.57813 -5.3125,-1.17187 -6.73438,-2.14062 -1.96875,-1.34375 -1.96875,-3.73438 0,-2.15625 1.70313,-3.625 1.70312,-1.46875 5.28125,-1.46875 3.40625,0 5.0625,1.10938 1.65625,1.10937 2.28125,3.28125 l -4.14063,0.76562 q -0.26562,-0.96875 -1.01562,-1.48437 -0.73438,-0.51563 -2.10938,-0.51563 -1.73437,0 -2.48437,0.48438 -0.5,0.34375 -0.5,0.89062 0,0.46875 0.4375,0.79688 0.59375,0.4375 4.09375,1.23437 3.51562,0.79688 4.90625,1.95313 1.375,1.17187 1.375,3.26562 0,2.28125 -1.90625,3.92188 -1.90625,1.64062 -5.64063,1.64062 -3.39062,0 -5.375,-1.375 -1.96875,-1.375 -2.57812,-3.73437 z"
     inkscape:export-filename="/home/marek/multi-solve.png"
     inkscape:export-xdpi="96"
     inkscape:export-ydpi="96" />
  <path
     inkscape:connector-curvature="0"
     id="path118"
     style="font-style:normal;font-variant:normal;font-weight:bold;font-stretch:normal;font-size:32px;line-height:125%;font-family:Arial;-inkscape-font-specification:'Arial, Normal';font-variant-ligatures:normal;font-variant-caps:normal;font-variant-numeric:normal;font-feature-settings:normal;text-align:center;letter-spacing:0px;word-spacing:0px;writing-mode:lr-tb;baseline-shift:sub;text-anchor:middle;fill:#000000;fill-opacity:1;stroke:none;stroke-width:1px;stroke-linecap:butt;stroke-linejoin:miter;stroke-opacity:1"
     d="m 197.5809,447.24267 -6.6875,-16.59375 h 4.60938 l 3.125,8.46875 0.90625,2.82813 q 0.35937,-1.07813 0.45312,-1.42188 0.21875,-0.70312 0.46875,-1.40625 l 3.15625,-8.46875 h 4.51563 l -6.59375,16.59375 z"
     inkscape:export-filename="/home/marek/multi-solve.png"
     inkscape:export-xdpi="96"
     inkscape:export-ydpi="96" />
  <path
     style="fill:none;stroke:#000000;stroke-width:2.64147234;stroke-linecap:butt;stroke-linejoin:miter;stroke-miterlimit:4;stroke-dasharray:none;stroke-opacity:1"
     d="M 34.251192,57.592787 H 14.074036 V 513.62244 h 20.177156"
     id="path4625"
     inkscape:connector-curvature="0"
     inkscape:export-filename="/home/marek/multi-solve.png"
     inkscape:export-xdpi="96"
     inkscape:export-ydpi="96" />
  <path
     style="fill:none;stroke:#000000;stroke-width:2.64147234;stroke-linecap:butt;stroke-linejoin:miter;stroke-miterlimit:4;stroke-dasharray:none;stroke-opacity:1"
     d="m 458.66723,57.592787 h 20.17716 V 513.62244 h -20.17716"
     id="path4627"
     inkscape:connector-curvature="0"
     inkscape:export-filename="/home/marek/multi-solve.png"
     inkscape:export-xdpi="96"
     inkscape:export-ydpi="96" />
  <g
     aria-label="sparse"
     style="font-size:40px;line-height:1.25;font-family:Arial;-inkscape-font-specification:Arial"
     id="text4639"
     transform="translate(-4.6139526e-8,44.823009)"
     inkscape:export-filename="/home/marek/multi-solve.png"
     inkscape:export-xdpi="96"
     inkscape:export-ydpi="96">
    <path
       d="m 143.5968,416.13394 2.89584,-0.45833 q 0.38541,0.91666 0.95833,1.30208 0.57292,0.375 1.5625,0.375 1.02083,0 1.63542,-0.45833 0.42708,-0.3125 0.42708,-0.76042 0,-0.30208 -0.21875,-0.54167 -0.22917,-0.22916 -1.23958,-0.5625 -2.70834,-0.89583 -3.35417,-1.41666 -1.01042,-0.8125 -1.01042,-2.125 0,-1.3125 0.97917,-2.26042 1.36458,-1.32292 4.05208,-1.32292 2.13542,0 3.22917,0.78125 1.09375,0.78125 1.38542,2.11459 l -2.76042,0.47916 q -0.21875,-0.60416 -0.70833,-0.90625 -0.66667,-0.40625 -1.60417,-0.40625 -0.9375,0 -1.35417,0.3125 -0.40625,0.3125 -0.40625,0.71875 0,0.41667 0.41667,0.6875 0.26042,0.16667 1.67708,0.58334 2.1875,0.63541 2.92709,1.25 1.04166,0.86458 1.04166,2.08333 0,1.57292 -1.32291,2.72917 -1.32292,1.15625 -3.72917,1.15625 -2.39583,0 -3.70833,-0.875 -1.30209,-0.88542 -1.77084,-2.47917 z"
       style="font-style:italic;font-variant:normal;font-weight:bold;font-stretch:normal;font-size:21.33333397px;font-family:Arial;-inkscape-font-specification:'Arial Bold Italic'"
       id="path3477"
       inkscape:connector-curvature="0" />
    <path
       d="m 158.06555,408.16519 h 2.83334 l -0.23959,1.13542 q 0.90625,-0.75 1.69792,-1.07292 0.79167,-0.32292 1.69792,-0.32292 1.73958,0 2.79166,1.19792 1.0625,1.19792 1.0625,3.57292 0,2.98958 -1.82291,5.05208 -1.5625,1.76042 -3.69792,1.76042 -2.19792,0 -3.32292,-1.78125 l -1.19791,5.73958 h -2.98959 z m 1.80209,6.34375 q 0,1.29167 0.625,2.01042 0.63541,0.70833 1.48958,0.70833 0.73958,0 1.42708,-0.53125 0.6875,-0.54167 1.13542,-1.78125 0.45833,-1.25 0.45833,-2.3125 0,-1.23958 -0.59375,-1.89583 -0.59375,-0.66667 -1.51041,-0.66667 -0.85417,0 -1.5625,0.61458 -0.69792,0.60417 -1.08334,1.79167 -0.38541,1.17708 -0.38541,2.0625 z"
       style="font-style:italic;font-variant:normal;font-weight:bold;font-stretch:normal;font-size:21.33333397px;font-family:Arial;-inkscape-font-specification:'Arial Bold Italic'"
       id="path3479"
       inkscape:connector-curvature="0" />
    <path
       d="m 173.0968,411.30061 -2.91666,-0.25 q 0.5,-1.47917 1.73958,-2.3125 1.25,-0.83334 3.30208,-0.83334 2.13542,0 3.15625,0.86459 1.02084,0.85416 1.02084,2.09375 0,0.5 -0.0937,1.0625 -0.0833,0.5625 -0.61459,2.95833 -0.4375,1.97917 -0.4375,2.77083 0,0.70834 0.25,1.57292 h -2.90625 q -0.17708,-0.60417 -0.21875,-1.25 -0.65625,0.72917 -1.51041,1.125 -0.85417,0.38542 -1.71875,0.38542 -1.375,0 -2.27084,-0.89584 -0.89583,-0.90625 -0.89583,-2.32291 0,-1.58334 0.97917,-2.53125 0.98958,-0.94792 3.52083,-1.14584 2.13542,-0.17708 2.85417,-0.42708 0.1875,-0.625 0.1875,-1 0,-0.47917 -0.38542,-0.80208 -0.38542,-0.32292 -1.14583,-0.32292 -0.80209,0 -1.27084,0.33333 -0.45833,0.32292 -0.625,0.92709 z m 2.84375,2.77083 q -0.27083,0.0729 -0.71875,0.13542 -2.25,0.27083 -2.9375,0.79166 -0.48958,0.375 -0.48958,1.01042 0,0.52083 0.375,0.88542 0.375,0.35416 0.98958,0.35416 0.67709,0 1.27084,-0.32291 0.60416,-0.33334 0.89583,-0.84375 0.30208,-0.52084 0.53125,-1.61459 z"
       style="font-style:italic;font-variant:normal;font-weight:bold;font-stretch:normal;font-size:21.33333397px;font-family:Arial;-inkscape-font-specification:'Arial Bold Italic'"
       id="path3481"
       inkscape:connector-curvature="0" />
    <path
       d="m 182.88847,408.16519 h 2.79167 l -0.44792,2.14583 q 1.5625,-2.40625 3.38542,-2.40625 0.64583,0 1.38541,0.32292 l -1.14583,2.44792 q -0.40625,-0.14584 -0.86458,-0.14584 -0.77084,0 -1.57292,0.58334 -0.79167,0.58333 -1.23958,1.5625 -0.44792,0.96875 -0.88542,3.08333 l -0.72917,3.46875 h -2.98958 z"
       style="font-style:italic;font-variant:normal;font-weight:bold;font-stretch:normal;font-size:21.33333397px;font-family:Arial;-inkscape-font-specification:'Arial Bold Italic'"
       id="path3483"
       inkscape:connector-curvature="0" />
    <path
       d="m 188.6593,416.13394 2.89584,-0.45833 q 0.38541,0.91666 0.95833,1.30208 0.57292,0.375 1.5625,0.375 1.02083,0 1.63542,-0.45833 0.42708,-0.3125 0.42708,-0.76042 0,-0.30208 -0.21875,-0.54167 -0.22917,-0.22916 -1.23958,-0.5625 -2.70834,-0.89583 -3.35417,-1.41666 -1.01042,-0.8125 -1.01042,-2.125 0,-1.3125 0.97917,-2.26042 1.36458,-1.32292 4.05208,-1.32292 2.13542,0 3.22917,0.78125 1.09375,0.78125 1.38542,2.11459 l -2.76042,0.47916 q -0.21875,-0.60416 -0.70833,-0.90625 -0.66667,-0.40625 -1.60417,-0.40625 -0.9375,0 -1.35417,0.3125 -0.40625,0.3125 -0.40625,0.71875 0,0.41667 0.41667,0.6875 0.26042,0.16667 1.67708,0.58334 2.1875,0.63541 2.92709,1.25 1.04166,0.86458 1.04166,2.08333 0,1.57292 -1.32291,2.72917 -1.32292,1.15625 -3.72917,1.15625 -2.39583,0 -3.70833,-0.875 -1.30209,-0.88542 -1.77084,-2.47917 z"
       style="font-style:italic;font-variant:normal;font-weight:bold;font-stretch:normal;font-size:21.33333397px;font-family:Arial;-inkscape-font-specification:'Arial Bold Italic'"
       id="path3485"
       inkscape:connector-curvature="0" />
    <path
       d="m 211.68014,414.62352 h -7.5 q -0.0104,0.17709 -0.0104,0.27084 0,1.10416 0.625,1.78125 0.63542,0.67708 1.54167,0.67708 1.48958,0 2.32291,-1.54167 l 2.67709,0.44792 q -0.78125,1.61458 -2.09375,2.42708 -1.30209,0.80209 -2.92709,0.80209 -2.22916,0 -3.625,-1.40625 -1.39583,-1.41667 -1.39583,-3.73959 0,-2.27083 1.26042,-4.04166 1.71875,-2.39584 4.90625,-2.39584 2.03125,0 3.22916,1.26042 1.19792,1.25 1.19792,3.51042 0,1.08333 -0.20833,1.94791 z m -2.52084,-1.82291 q 0.0104,-0.19792 0.0104,-0.30209 0,-1.22916 -0.55208,-1.84375 -0.55209,-0.61458 -1.47917,-0.61458 -0.92708,0 -1.66667,0.69792 -0.72916,0.69791 -0.98958,2.0625 z"
       style="font-style:italic;font-variant:normal;font-weight:bold;font-stretch:normal;font-size:21.33333397px;font-family:Arial;-inkscape-font-specification:'Arial Bold Italic'"
       id="path3487"
       inkscape:connector-curvature="0" />
  </g>
  <path
     style="fill:none;stroke:#00ff00;stroke-width:6.66666651;stroke-linecap:butt;stroke-linejoin:miter;stroke-miterlimit:4;stroke-dasharray:none;stroke-opacity:1"
     d="M 3.33334,68.333502 V 368.20777"
     id="path878"
     inkscape:connector-curvature="0"
     inkscape:export-filename="/home/marek/multi-solve.png"
     inkscape:export-xdpi="96"
     inkscape:export-ydpi="96" />
  <path
     style="fill:none;stroke:#00fa00;stroke-width:6.66666651;stroke-linecap:butt;stroke-linejoin:miter;stroke-miterlimit:4;stroke-dasharray:none;stroke-opacity:1"
     d="M 23.510496,48.156342 H 327.55936"
     id="path888"
     inkscape:connector-curvature="0"
     inkscape:export-filename="/home/marek/multi-solve.png"
     inkscape:export-xdpi="96"
     inkscape:export-ydpi="96" />
  <path
     style="fill:none;stroke:#fd0000;stroke-width:6.66666651;stroke-linecap:butt;stroke-linejoin:miter;stroke-miterlimit:4;stroke-dasharray:none;stroke-opacity:1"
     d="m 347.04075,48.156342 h 121.7587"
     id="path890"
     inkscape:connector-curvature="0"
     inkscape:export-filename="/home/marek/multi-solve.png"
     inkscape:export-xdpi="96"
     inkscape:export-ydpi="96" />
  <path
     style="fill:none;stroke:#ff0000;stroke-width:6.66666651;stroke-linecap:butt;stroke-linejoin:miter;stroke-miterlimit:4;stroke-dasharray:none;stroke-opacity:1"
     d="M 3.3333333,378.64424 V 503.88175"
     id="path892"
     inkscape:connector-curvature="0"
     inkscape:export-filename="/home/marek/multi-solve.png"
     inkscape:export-xdpi="96"
     inkscape:export-ydpi="96" />
  <path
     style="opacity:1;fill:url(#pattern1104);fill-opacity:1;fill-rule:nonzero;stroke:#000300;stroke-width:1.29021597;stroke-linecap:butt;stroke-linejoin:miter;stroke-miterlimit:4;stroke-dasharray:none;stroke-opacity:1"
     d="M 23.510496,68.333515 V 368.20778 H 327.55936 Z"
     id="path96"
     inkscape:connector-curvature="0"
     inkscape:export-filename="/home/marek/multi-solve.png"
     inkscape:export-xdpi="96"
     inkscape:export-ydpi="96" />
  <path
     inkscape:connector-curvature="0"
     style="opacity:1;fill:#ffffff;fill-opacity:1;fill-rule:nonzero;stroke:#000300;stroke-width:1.64957023;stroke-miterlimit:4;stroke-dasharray:none;stroke-opacity:1"
     d="m 130.10786,191.46918 h 94.62391 v 75.08627 h -94.62391 z"
     id="rect8386"
     inkscape:export-filename="/home/marek/multi-solve.png"
     inkscape:export-xdpi="96"
     inkscape:export-ydpi="96" />
  <path
     inkscape:connector-curvature="0"
     id="path1071"
     style="font-style:normal;font-variant:normal;font-weight:bold;font-stretch:normal;font-size:32px;line-height:1.25;font-family:Arial;-inkscape-font-specification:'Arial Bold';letter-spacing:0px;word-spacing:0px;baseline-shift:baseline;fill:#000000;fill-opacity:1;stroke:none"
     d="m 156.82544,221.24351 v -22.71875 h 4.625 v 18.85937 h 11.5 v 3.85938 z"
     inkscape:export-filename="/home/marek/multi-solve.png"
     inkscape:export-xdpi="96"
     inkscape:export-ydpi="96" />
  <path
     inkscape:connector-curvature="0"
     id="path1073"
     style="font-style:normal;font-weight:normal;font-size:26px;line-height:1.25;font-family:sans-serif;letter-spacing:0px;word-spacing:0px;baseline-shift:sub;fill:#000000;fill-opacity:1;stroke:none"
     d="m 178.37778,227.64351 -4.34687,-10.78594 h 2.99609 l 2.03125,5.50469 0.58906,1.83828 q 0.2336,-0.70078 0.29454,-0.92422 0.14218,-0.45703 0.30468,-0.91406 l 2.05157,-5.50469 h 2.93515 l -4.28594,10.78594 z"
     inkscape:export-filename="/home/marek/multi-solve.png"
     inkscape:export-xdpi="96"
     inkscape:export-ydpi="96" />
  <path
     inkscape:connector-curvature="0"
     id="path1075"
     style="font-style:normal;font-weight:normal;font-size:26px;line-height:1.25;font-family:sans-serif;letter-spacing:0px;word-spacing:0px;baseline-shift:sub;fill:#000000;fill-opacity:1;stroke:none"
     d="m 189.94575,227.64351 -4.34687,-10.78594 h 2.99609 l 2.03125,5.50469 0.58906,1.83828 q 0.2336,-0.70078 0.29453,-0.92422 0.14219,-0.45703 0.30469,-0.91406 l 2.05156,-5.50469 h 2.93516 l -4.28594,10.78594 z"
     inkscape:export-filename="/home/marek/multi-solve.png"
     inkscape:export-xdpi="96"
     inkscape:export-ydpi="96" />
  <g
     transform="translate(-4.6139526e-8,44.823017)"
     aria-label="sparse with fill-in"
     style="font-style:italic;font-variant:normal;font-weight:bold;font-stretch:normal;font-size:40px;line-height:1.25;font-family:Arial;-inkscape-font-specification:'Arial Bold Italic';letter-spacing:0px;word-spacing:0px;fill:#000000;fill-opacity:1;stroke:none"
     id="text9853"
     inkscape:export-filename="/home/marek/multi-solve.png"
     inkscape:export-xdpi="96"
     inkscape:export-ydpi="96">
    <path
       inkscape:connector-curvature="0"
       d="m 147.32958,194.74063 2.53385,-0.40104 q 0.33724,0.80208 0.83855,1.13932 0.5013,0.32813 1.36718,0.32813 0.89323,0 1.43099,-0.40104 0.3737,-0.27344 0.3737,-0.66537 0,-0.26432 -0.1914,-0.47396 -0.20053,-0.20052 -1.08464,-0.49218 -2.36979,-0.78386 -2.9349,-1.23959 -0.88411,-0.71093 -0.88411,-1.85937 0,-1.14844 0.85677,-1.97787 1.19401,-1.15755 3.54557,-1.15755 1.86849,0 2.82552,0.6836 0.95703,0.68359 1.21224,1.85026 l -2.41536,0.41927 q -0.19141,-0.52865 -0.61979,-0.79297 -0.58334,-0.35547 -1.40365,-0.35547 -0.82031,0 -1.18489,0.27344 -0.35547,0.27343 -0.35547,0.6289 0,0.36459 0.36458,0.60157 0.22786,0.14583 1.46745,0.51041 1.91406,0.55599 2.5612,1.09375 0.91145,0.75651 0.91145,1.82292 0,1.3763 -1.15755,2.38802 -1.15755,1.01172 -3.26302,1.01172 -2.09635,0 -3.24479,-0.76563 -1.13932,-0.77474 -1.54948,-2.16927 z"
       style="font-size:18.66666603px;line-height:0px;text-align:center;text-anchor:middle"
       id="path1036" />
    <path
       inkscape:connector-curvature="0"
       d="m 159.98974,187.76798 h 2.47916 l -0.20963,0.99349 q 0.79297,-0.65625 1.48567,-0.93881 0.69271,-0.28255 1.48568,-0.28255 1.52214,0 2.44271,1.04818 0.92969,1.04818 0.92969,3.1263 0,2.61589 -1.59505,4.42057 -1.36719,1.54037 -3.23568,1.54037 -1.92318,0 -2.90755,-1.55859 l -1.04818,5.02213 h -2.61589 z m 1.57682,5.55078 q 0,1.13021 0.54687,1.75911 0.55599,0.61979 1.30339,0.61979 0.64713,0 1.2487,-0.46484 0.60156,-0.47396 0.99349,-1.55859 0.40104,-1.09375 0.40104,-2.02344 0,-1.08464 -0.51953,-1.65885 -0.51953,-0.58334 -1.32162,-0.58334 -0.74739,0 -1.36718,0.53776 -0.61068,0.52865 -0.94792,1.56771 -0.33724,1.02995 -0.33724,1.80469 z"
       style="font-size:18.66666603px;line-height:0px;text-align:center;text-anchor:middle"
       id="path1038" />
    <path
       inkscape:connector-curvature="0"
       d="M 173.14208,190.51147 170.59,190.29272 q 0.4375,-1.29427 1.52213,-2.02344 1.09375,-0.72917 2.88932,-0.72917 1.86849,0 2.76172,0.75651 0.89323,0.7474 0.89323,1.83203 0,0.4375 -0.082,0.92969 -0.0729,0.49219 -0.53776,2.58854 -0.38281,1.73177 -0.38281,2.42448 0,0.61979 0.21875,1.3763 h -2.54297 q -0.15495,-0.52864 -0.19141,-1.09375 -0.57422,0.63803 -1.32161,0.98438 -0.7474,0.33724 -1.50391,0.33724 -1.20312,0 -1.98698,-0.78386 -0.78385,-0.79296 -0.78385,-2.03255 0,-1.38541 0.85677,-2.21484 0.86589,-0.82943 3.08073,-1.00261 1.86849,-0.15494 2.4974,-0.37369 0.16406,-0.54688 0.16406,-0.875 0,-0.41927 -0.33724,-0.70183 -0.33724,-0.28255 -1.00261,-0.28255 -0.70182,0 -1.11198,0.29167 -0.40104,0.28255 -0.54687,0.8112 z m 2.48828,2.42448 q -0.23698,0.0638 -0.62891,0.11849 -1.96875,0.23697 -2.57031,0.6927 -0.42838,0.32813 -0.42838,0.88412 0,0.45573 0.32812,0.77474 0.32813,0.30989 0.86589,0.30989 0.59245,0 1.11198,-0.28255 0.52864,-0.29167 0.78385,-0.73828 0.26432,-0.45573 0.46484,-1.41276 z"
       style="font-size:18.66666603px;line-height:0px;text-align:center;text-anchor:middle"
       id="path1040" />
    <path
       inkscape:connector-curvature="0"
       d="m 181.70979,187.76798 h 2.44271 l -0.39193,1.8776 q 1.36719,-2.10547 2.96224,-2.10547 0.5651,0 1.21224,0.28255 l -1.00261,2.14193 q -0.35546,-0.1276 -0.75651,-0.1276 -0.67448,0 -1.3763,0.51041 -0.69271,0.51042 -1.08463,1.36719 -0.39193,0.84766 -0.77474,2.69792 l -0.63802,3.03515 h -2.61589 z"
       style="font-size:18.66666603px;line-height:0px;text-align:center;text-anchor:middle"
       id="path1042" />
    <path
       inkscape:connector-curvature="0"
       d="m 186.75927,194.74063 2.53385,-0.40104 q 0.33724,0.80208 0.83854,1.13932 0.50131,0.32813 1.36719,0.32813 0.89323,0 1.43099,-0.40104 0.3737,-0.27344 0.3737,-0.66537 0,-0.26432 -0.19141,-0.47396 -0.20052,-0.20052 -1.08463,-0.49218 -2.36979,-0.78386 -2.9349,-1.23959 -0.88411,-0.71093 -0.88411,-1.85937 0,-1.14844 0.85677,-1.97787 1.19401,-1.15755 3.54557,-1.15755 1.86849,0 2.82552,0.6836 0.95703,0.68359 1.21224,1.85026 l -2.41536,0.41927 q -0.19141,-0.52865 -0.6198,-0.79297 -0.58333,-0.35547 -1.40364,-0.35547 -0.82031,0 -1.1849,0.27344 -0.35547,0.27343 -0.35547,0.6289 0,0.36459 0.36459,0.60157 0.22786,0.14583 1.46745,0.51041 1.91406,0.55599 2.56119,1.09375 0.91146,0.75651 0.91146,1.82292 0,1.3763 -1.15755,2.38802 -1.15755,1.01172 -3.26302,1.01172 -2.09636,0 -3.24479,-0.76563 -1.13933,-0.77474 -1.54948,-2.16927 z"
       style="font-size:18.66666603px;line-height:0px;text-align:center;text-anchor:middle"
       id="path1044" />
    <path
       inkscape:connector-curvature="0"
       d="m 206.90249,193.41902 h -6.5625 q -0.009,0.15495 -0.009,0.23698 0,0.96614 0.54688,1.55859 0.55598,0.59245 1.34895,0.59245 1.30339,0 2.03256,-1.34896 l 2.34244,0.39193 q -0.68359,1.41276 -1.83203,2.1237 -1.13932,0.70182 -2.5612,0.70182 -1.95052,0 -3.17187,-1.23047 -1.22135,-1.23958 -1.22135,-3.27214 0,-1.98697 1.10286,-3.53645 1.50391,-2.09636 4.29297,-2.09636 1.77734,0 2.82552,1.10287 1.04818,1.09375 1.04818,3.07161 0,0.94792 -0.1823,1.70443 z m -2.20572,-1.59505 q 0.009,-0.17318 0.009,-0.26433 0,-1.07552 -0.48307,-1.61328 -0.48308,-0.53776 -1.29427,-0.53776 -0.8112,0 -1.45834,0.61068 -0.63802,0.61068 -0.86588,1.80469 z"
       style="font-size:18.66666603px;line-height:0px;text-align:center;text-anchor:middle"
       id="path1046" />
    <path
       inkscape:connector-curvature="0"
       d="m 144.33544,217.02766 h -2.46094 l -0.47396,-6.16145 -2.95312,6.16145 h -2.42448 l -1.21224,-9.67968 h 2.32422 l 0.67448,6.48958 3.01693,-6.48958 h 2.3789 l 0.32813,6.48958 2.99869,-6.48958 h 2.625 z"
       style="font-size:18.66666603px;line-height:0px;text-align:center;text-anchor:middle"
       id="path1048" />
    <path
       inkscape:connector-curvature="0"
       d="m 151.52685,203.66569 h 2.61588 l -0.49219,2.36979 h -2.61588 z m -0.76563,3.68229 h 2.61589 l -2.02344,9.67968 h -2.61589 z"
       style="font-size:18.66666603px;line-height:0px;text-align:center;text-anchor:middle"
       id="path1050" />
    <path
       inkscape:connector-curvature="0"
       d="m 154.58023,209.28938 0.40104,-1.9414 h 1.27604 l 0.31902,-1.54948 2.99869,-1.80469 -0.70182,3.35417 h 1.59505 l -0.40104,1.9414 h -1.60417 l -0.84765,4.05599 q -0.22787,1.10287 -0.22787,1.25782 0,0.30078 0.19141,0.47395 0.19141,0.16407 0.69271,0.16407 0.17317,0 0.86588,-0.0638 l -0.41015,1.94141 q -0.67448,0.13672 -1.38542,0.13672 -1.38542,0 -2.01432,-0.52865 -0.62891,-0.53776 -0.62891,-1.48567 0,-0.44662 0.33724,-2.0599 l 0.8112,-3.89193 z"
       style="font-size:18.66666603px;line-height:0px;text-align:center;text-anchor:middle"
       id="path1052" />
    <path
       inkscape:connector-curvature="0"
       d="m 162.79247,217.02766 h -2.61589 l 2.79818,-13.36197 h 2.61589 l -1.00261,4.75781 q 0.88412,-0.69271 1.64974,-0.99349 0.76563,-0.3099 1.64063,-0.3099 1.17578,0 1.85937,0.67448 0.6836,0.67448 0.6836,1.76823 0,0.58333 -0.25521,1.80469 l -1.1849,5.66015 h -2.61588 l 1.21224,-5.76953 q 0.1914,-0.9388 0.1914,-1.20312 0,-0.48307 -0.30078,-0.77474 -0.30078,-0.29167 -0.82031,-0.29167 -0.65625,0 -1.25781,0.45573 -0.78386,0.60156 -1.19401,1.47656 -0.22787,0.48308 -0.60157,2.26953 z"
       style="font-size:18.66666603px;line-height:0px;text-align:center;text-anchor:middle"
       id="path1054" />
    <path
       inkscape:connector-curvature="0"
       d="m 183.47346,207.34798 -0.40104,1.91406 h -1.85026 l -1.6224,7.76562 h -2.61588 l 1.62239,-7.76562 h -1.45833 l 0.40104,-1.91406 h 1.45833 l 0.20964,-0.99349 q 0.25521,-1.22136 0.48307,-1.64974 0.3099,-0.58334 0.92057,-0.92057 0.6198,-0.34636 1.61329,-0.34636 1.20312,0 2.53385,0.4375 l -0.51042,1.86849 q -0.9388,-0.31901 -1.52213,-0.31901 -0.44662,0 -0.66537,0.28255 -0.14583,0.18229 -0.30078,0.95703 l -0.14583,0.6836 z"
       style="font-size:18.66666603px;line-height:0px;text-align:center;text-anchor:middle"
       id="path1056" />
    <path
       inkscape:connector-curvature="0"
       d="m 185.73388,203.66569 h 2.61588 l -0.49218,2.36979 h -2.61589 z m -0.76563,3.68229 h 2.61589 l -2.02344,9.67968 h -2.61588 z"
       style="font-size:18.66666603px;line-height:0px;text-align:center;text-anchor:middle"
       id="path1058" />
    <path
       inkscape:connector-curvature="0"
       d="m 188.11278,217.02766 2.79818,-13.36197 h 2.60677 l -2.78906,13.36197 z"
       style="font-size:18.66666603px;line-height:0px;text-align:center;text-anchor:middle"
       id="path1060" />
    <path
       inkscape:connector-curvature="0"
       d="m 193.29898,217.02766 2.79818,-13.36197 h 2.60677 l -2.78906,13.36197 z"
       style="font-size:18.66666603px;line-height:0px;text-align:center;text-anchor:middle"
       id="path1062" />
    <path
       inkscape:connector-curvature="0"
       d="m 199.00471,210.94824 h 5.07682 l -0.52864,2.52474 h -5.07682 z"
       style="font-size:18.66666603px;line-height:0px;text-align:center;text-anchor:middle"
       id="path1064" />
    <path
       inkscape:connector-curvature="0"
       d="m 207.50861,203.66569 h 2.61589 l -0.49219,2.36979 h -2.61589 z m -0.76562,3.68229 h 2.61588 l -2.02343,9.67968 h -2.61589 z"
       style="font-size:18.66666603px;line-height:0px;text-align:center;text-anchor:middle"
       id="path1066" />
    <path
       inkscape:connector-curvature="0"
       d="m 211.96565,207.34798 h 2.47917 l -0.25521,1.25781 q 0.92968,-0.80208 1.73177,-1.13932 0.8112,-0.34636 1.70442,-0.34636 1.19402,0 1.87761,0.6836 0.69271,0.68359 0.69271,1.8138 0,0.51041 -0.30078,1.93229 l -1.13933,5.47786 h -2.61588 l 1.14844,-5.49609 q 0.2552,-1.23047 0.2552,-1.46745 0,-0.5013 -0.30078,-0.78385 -0.29166,-0.29167 -0.82031,-0.29167 -0.57422,0 -1.27604,0.48307 -0.70182,0.48308 -1.10287,1.27605 -0.29166,0.5651 -0.65625,2.30599 l -0.82942,3.97395 h -2.61589 z"
       style="font-size:18.66666603px;line-height:0px;text-align:center;text-anchor:middle"
       id="path1068" />
  </g>
  <path
     style="opacity:1;fill:url(#Polkadots-small);fill-opacity:1.0;fill-rule:nonzero;stroke:#ff6600;stroke-width:6;stroke-miterlimit:4;stroke-dasharray:none;stroke-dashoffset:0;stroke-opacity:1"
     d="m 373.30005,68.333507 h 19.62687 V 368.20778 h -19.62687 z"
     id="rect1896"
     inkscape:connector-curvature="0"
     inkscape:export-filename="/home/marek/multi-solve.png"
     inkscape:export-xdpi="96"
     inkscape:export-ydpi="96" />
  <path
     style="opacity:1;fill:url(#pattern1109);fill-opacity:1;fill-rule:nonzero;stroke:#000000;stroke-width:1.33299994;stroke-miterlimit:4;stroke-dasharray:none;stroke-opacity:1"
     d="m 373.30005,378.64424 h 19.62686 v 125.23749 h -19.62686 z"
     id="rect3163"
     inkscape:connector-curvature="0"
     inkscape:export-filename="/home/marek/multi-solve.png"
     inkscape:export-xdpi="96"
     inkscape:export-ydpi="96" />
  <path
     inkscape:connector-curvature="0"
     id="rect2664"
     d="M 311.25001,177.96917 H 454 v 102.224 H 311.25001 Z"
     style="opacity:1;fill:#ffffff;fill-opacity:1;fill-rule:nonzero;stroke:#000300;stroke-width:1.07981765;stroke-miterlimit:4;stroke-dasharray:none;stroke-opacity:1"
     inkscape:export-filename="/home/marek/multi-solve.png"
     inkscape:export-xdpi="96"
     inkscape:export-ydpi="96" />
  <path
     d="m 374.58967,204.73215 h -4.54296 l -1.8059,-4.69815 h -8.2676 l -1.70714,4.69815 h -4.43009 l 8.05598,-20.68314 h 4.41598 z m -7.68917,-8.18296 -2.84992,-7.67506 -2.7935,7.67506 z"
     style="font-style:normal;font-variant:normal;font-weight:bold;font-stretch:normal;font-size:22.70636749px;line-height:1.25;font-family:Arial;-inkscape-font-specification:'Arial Bold';letter-spacing:0px;word-spacing:0px;fill:#000000;fill-opacity:1;stroke:none;stroke-width:0.72235799"
     id="path3454"
     inkscape:connector-curvature="0"
     inkscape:export-filename="/home/marek/multi-solve.png"
     inkscape:export-xdpi="96"
     inkscape:export-ydpi="96" />
  <path
     d="m 375.14272,207.73234 2.5861,-0.39434 q 0.16506,0.75199 0.66945,1.14632 0.50438,0.38517 1.41227,0.38517 0.99959,0 1.50397,-0.36683 0.33931,-0.25677 0.33931,-0.68779 0,-0.29345 -0.18342,-0.48604 -0.19258,-0.18342 -0.86203,-0.33931 -3.11799,-0.68779 -3.95251,-1.25636 -1.15549,-0.78867 -1.15549,-2.19177 0,-1.26554 0.99959,-2.12757 0.99959,-0.86204 3.09965,-0.86204 1.99919,0 2.97127,0.65112 0.97208,0.65111 1.33889,1.92582 l -2.43019,0.44935 q -0.1559,-0.56858 -0.59609,-0.87121 -0.43101,-0.30262 -1.23802,-0.30262 -1.01794,0 -1.45812,0.28428 -0.29347,0.20176 -0.29347,0.52273 0,0.27512 0.25678,0.4677 0.34848,0.25677 2.40269,0.72447 2.06338,0.46769 2.87956,1.14632 0.80701,0.68779 0.80701,1.91665 0,1.3389 -1.11882,2.3018 -1.1188,0.96292 -3.31056,0.96292 -1.99002,0 -3.15468,-0.80701 -1.15549,-0.80701 -1.51314,-2.19176 z"
     style="font-style:italic;font-variant:normal;font-weight:bold;font-stretch:normal;font-size:14.75913906px;line-height:1.25;font-family:Arial;-inkscape-font-specification:'Arial Bold Italic';letter-spacing:0px;word-spacing:0px;baseline-shift:sub;fill:#000000;fill-opacity:1;stroke:none;stroke-width:0.72235799"
     id="path3456"
     inkscape:connector-curvature="0"
     inkscape:export-filename="/home/marek/multi-solve.png"
     inkscape:export-xdpi="96"
     inkscape:export-ydpi="96" />
  <path
     d="m 389.17368,210.51101 -3.925,-9.73913 h 2.70532 l 1.83411,4.97044 0.53188,1.65988 q 0.21092,-0.63278 0.26595,-0.83452 0.1284,-0.41268 0.27512,-0.82536 l 1.85246,-4.97044 h 2.65029 l -3.86998,9.73913 z"
     style="font-style:italic;font-variant:normal;font-weight:bold;font-stretch:normal;font-size:14.75913906px;line-height:1.25;font-family:Arial;-inkscape-font-specification:'Arial Bold Italic';letter-spacing:0px;word-spacing:0px;baseline-shift:sub;fill:#000000;fill-opacity:1;stroke:none;stroke-width:0.72235799"
     id="path3458"
     inkscape:connector-curvature="0"
     inkscape:export-filename="/home/marek/multi-solve.png"
     inkscape:export-xdpi="96"
     inkscape:export-ydpi="96" />
  <path
     d="m 396.94115,205.23018 v -2.38435 h 2.57692 v 2.38435 z m 0,11.05969 v -9.73913 h 2.57692 v 9.73913 z"
     style="font-style:italic;font-variant:normal;font-weight:bold;font-stretch:normal;font-size:22.70636749px;line-height:1.25;font-family:Arial;-inkscape-font-specification:'Arial Bold Italic';letter-spacing:0px;word-spacing:0px;fill:#000000;fill-opacity:1;stroke:none;stroke-width:0.72235799"
     id="path3460"
     inkscape:connector-curvature="0"
     inkscape:export-filename="/home/marek/multi-solve.png"
     inkscape:export-xdpi="96"
     inkscape:export-ydpi="96" />
  <path
     d="m 405.20381,193.17442 v -11.16974 h -3.98918 v -2.2743 h 10.6837 v 2.2743 h -3.98003 v 11.16974 z"
     style="font-style:italic;font-variant:normal;font-weight:bold;font-stretch:normal;font-size:14.75913906px;line-height:1.25;font-family:Arial;-inkscape-font-specification:'Arial Bold Italic';letter-spacing:0px;word-spacing:0px;baseline-shift:super;fill:#000000;fill-opacity:1;stroke:none;stroke-width:0.72235799"
     id="path3462"
     inkscape:connector-curvature="0"
     inkscape:export-filename="/home/marek/multi-solve.png"
     inkscape:export-xdpi="96"
     inkscape:export-ydpi="96" />
  <g
     id="g1123"
     transform="matrix(1.2015267,0,0,1.2015267,-76.186484,-34.212288)"
     inkscape:export-filename="/home/marek/multi-solve.png"
     inkscape:export-xdpi="96"
     inkscape:export-ydpi="96">
    <path
       inkscape:connector-curvature="0"
       id="rect8386-3-6"
       d="m 358.97674,377.27978 h 48.18473 v 39.01949 h -48.18473 z"
       style="opacity:1;fill:#ffffff;fill-opacity:1;fill-rule:nonzero;stroke:#000300;stroke-width:0.84856606;stroke-miterlimit:4;stroke-dasharray:none;stroke-opacity:1" />
    <g
       transform="matrix(0.62111585,0,0,0.65211055,131.22805,138.82617)"
       id="text4643"
       style="font-size:40px;line-height:1.25;font-family:Arial;-inkscape-font-specification:Arial"
       aria-label="dense">
      <path
         inkscape:connector-curvature="0"
         id="path3465"
         style="font-style:italic;font-variant:normal;font-weight:bold;font-stretch:normal;font-size:21.33333397px;font-family:Arial;-inkscape-font-specification:'Arial Bold Italic'"
         d="m 385.2819,420.01074 h -2.83333 l 0.25,-1.19791 q -0.8125,0.78125 -1.60417,1.125 -0.78125,0.33333 -1.77083,0.33333 -1.71875,0 -2.79167,-1.16667 -1.0625,-1.17708 -1.0625,-3.46875 0,-2.65625 1.5,-4.80208 1.5,-2.14583 3.96875,-2.14583 2.22917,0 3.34375,1.77083 l 1.19792,-5.71875 h 2.98958 z m -6.90625,-4.5 q 0,1.1875 0.59375,1.85417 0.60417,0.66667 1.47917,0.66667 0.8125,0 1.51041,-0.55209 0.70834,-0.5625 1.125,-1.70833 0.42709,-1.14583 0.42709,-2.19792 0,-1.19791 -0.64584,-1.9375 -0.64583,-0.73958 -1.48958,-0.73958 -1.3125,0 -2.15625,1.45833 -0.84375,1.45834 -0.84375,3.15625 z" />
      <path
         inkscape:connector-curvature="0"
         id="path3467"
         style="font-style:italic;font-variant:normal;font-weight:bold;font-stretch:normal;font-size:21.33333397px;font-family:Arial;-inkscape-font-specification:'Arial Bold Italic'"
         d="m 398.86523,415.40658 h -7.5 q -0.0104,0.17708 -0.0104,0.27083 0,1.10417 0.625,1.78125 0.63541,0.67708 1.54166,0.67708 1.48959,0 2.32292,-1.54166 l 2.67708,0.44791 q -0.78125,1.61459 -2.09375,2.42709 -1.30208,0.80208 -2.92708,0.80208 -2.22917,0 -3.625,-1.40625 -1.39583,-1.41667 -1.39583,-3.73958 0,-2.27084 1.26041,-4.04167 1.71875,-2.39583 4.90625,-2.39583 2.03125,0 3.22917,1.26041 1.19792,1.25 1.19792,3.51042 0,1.08333 -0.20834,1.94792 z m -2.52083,-1.82292 q 0.0104,-0.19792 0.0104,-0.30208 0,-1.22917 -0.55209,-1.84375 -0.55208,-0.61459 -1.47916,-0.61459 -0.92709,0 -1.66667,0.69792 -0.72917,0.69792 -0.98958,2.0625 z" />
      <path
         inkscape:connector-curvature="0"
         id="path3469"
         style="font-style:italic;font-variant:normal;font-weight:bold;font-stretch:normal;font-size:21.33333397px;font-family:Arial;-inkscape-font-specification:'Arial Bold Italic'"
         d="m 402.31315,408.94824 h 2.83334 l -0.29167,1.4375 q 1.0625,-0.91666 1.97917,-1.30208 0.92708,-0.39583 1.94791,-0.39583 1.36459,0 2.14584,0.78125 0.79166,0.78125 0.79166,2.07291 0,0.58334 -0.34375,2.20834 l -1.30208,6.26041 h -2.98958 l 1.3125,-6.28125 q 0.29166,-1.40625 0.29166,-1.67708 0,-0.57292 -0.34375,-0.89583 -0.33333,-0.33334 -0.9375,-0.33334 -0.65625,0 -1.45833,0.55209 -0.80208,0.55208 -1.26042,1.45833 -0.33333,0.64583 -0.75,2.63542 l -0.94791,4.54166 h -2.98959 z" />
      <path
         inkscape:connector-curvature="0"
         id="path3471"
         style="font-style:italic;font-variant:normal;font-weight:bold;font-stretch:normal;font-size:21.33333397px;font-family:Arial;-inkscape-font-specification:'Arial Bold Italic'"
         d="m 412.60482,416.91699 2.89583,-0.45833 q 0.38542,0.91667 0.95834,1.30208 0.57291,0.375 1.5625,0.375 1.02083,0 1.63541,-0.45833 0.42709,-0.3125 0.42709,-0.76042 0,-0.30208 -0.21875,-0.54166 -0.22917,-0.22917 -1.23959,-0.5625 -2.70833,-0.89584 -3.35416,-1.41667 -1.01042,-0.8125 -1.01042,-2.125 0,-1.3125 0.97917,-2.26042 1.36458,-1.32291 4.05208,-1.32291 2.13542,0 3.22917,0.78125 1.09375,0.78125 1.38541,2.11458 l -2.76041,0.47917 q -0.21875,-0.60417 -0.70834,-0.90625 -0.66666,-0.40625 -1.60416,-0.40625 -0.9375,0 -1.35417,0.3125 -0.40625,0.3125 -0.40625,0.71875 0,0.41666 0.41667,0.6875 0.26041,0.16666 1.67708,0.58333 2.1875,0.63542 2.92708,1.25 1.04167,0.86458 1.04167,2.08333 0,1.57292 -1.32292,2.72917 -1.32291,1.15625 -3.72916,1.15625 -2.39584,0 -3.70834,-0.875 -1.30208,-0.88542 -1.77083,-2.47917 z" />
      <path
         inkscape:connector-curvature="0"
         id="path3473"
         style="font-style:italic;font-variant:normal;font-weight:bold;font-stretch:normal;font-size:21.33333397px;font-family:Arial;-inkscape-font-specification:'Arial Bold Italic'"
         d="m 435.62565,415.40658 h -7.5 q -0.0104,0.17708 -0.0104,0.27083 0,1.10417 0.625,1.78125 0.63541,0.67708 1.54166,0.67708 1.48959,0 2.32292,-1.54166 l 2.67708,0.44791 q -0.78125,1.61459 -2.09375,2.42709 -1.30208,0.80208 -2.92708,0.80208 -2.22917,0 -3.625,-1.40625 -1.39583,-1.41667 -1.39583,-3.73958 0,-2.27084 1.26041,-4.04167 1.71875,-2.39583 4.90625,-2.39583 2.03125,0 3.22917,1.26041 1.19792,1.25 1.19792,3.51042 0,1.08333 -0.20834,1.94792 z m -2.52083,-1.82292 q 0.0104,-0.19792 0.0104,-0.30208 0,-1.22917 -0.55209,-1.84375 -0.55208,-0.61459 -1.47916,-0.61459 -0.92709,0 -1.66667,0.69792 -0.72917,0.69792 -0.98958,2.0625 z" />
    </g>
    <g
       id="text3518"
       style="font-style:normal;font-variant:normal;font-weight:bold;font-stretch:normal;font-size:25.45698166px;line-height:1.25;font-family:Arial;-inkscape-font-specification:'Arial Bold';letter-spacing:0px;word-spacing:0px;fill:#000000;fill-opacity:1;stroke:none;stroke-width:0.63642454"
       transform="matrix(0.97594577,0,0,1.0246471,36,0)"
       aria-label="Si">
      <path
         inkscape:connector-curvature="0"
         id="path3522"
         style="stroke-width:0.63642454"
         d="m 345.38043,383.51032 3.57989,-0.34804 q 0.32319,1.80237 1.30517,2.64763 0.99441,0.84525 2.67249,0.84525 1.77751,0 2.67248,-0.74581 0.9074,-0.75824 0.9074,-1.76509 0,-0.64637 -0.38533,-1.09385 -0.37291,-0.45992 -1.3176,-0.79553 -0.64637,-0.22375 -2.94595,-0.79553 -2.95838,-0.73338 -4.15167,-1.80238 -1.67808,-1.50405 -1.67808,-3.6669 0,-1.39218 0.7831,-2.5979 0.79553,-1.21816 2.27472,-1.8521 1.49162,-0.63393 3.59232,-0.63393 3.43073,0 5.15852,1.50405 1.74022,1.50405 1.82724,4.01494 l -3.67933,0.16159 q -0.23618,-1.40461 -1.01928,-2.01369 -0.77067,-0.6215 -2.32444,-0.6215 -1.60349,0 -2.51089,0.6588 -0.58422,0.42262 -0.58422,1.13114 0,0.64637 0.54693,1.10629 0.69609,0.58421 3.381,1.21815 2.68492,0.63394 3.96523,1.3176 1.29273,0.67123 2.01368,1.85209 0.73338,1.16844 0.73338,2.89623 0,1.5662 -0.87011,2.93352 -0.87011,1.36732 -2.46117,2.03855 -1.59106,0.6588 -3.96522,0.6588 -3.45559,0 -5.30769,-1.59106 -1.85209,-1.60349 -2.21257,-4.66132 z" />
      <path
         inkscape:connector-curvature="0"
         id="path3524"
         style="font-size:16.54703903px;baseline-shift:sub;stroke-width:0.63642454"
         d="m 362.62791,384.7869 v -2.1007 h 2.27037 v 2.1007 z m 0,9.74401 v -8.58054 h 2.27037 v 8.58054 z" />
    </g>
  </g>
  <g
     aria-label="nBEM nc"
     style="font-style:normal;font-variant:normal;font-weight:normal;font-stretch:normal;font-size:18.66666603px;line-height:1.25;font-family:Arial;-inkscape-font-specification:Arial;letter-spacing:0px;word-spacing:0px;fill:#000000;fill-opacity:1;stroke:none"
     id="text1103-5"
     inkscape:export-filename="/home/marek/multi-solve.png"
     inkscape:export-xdpi="96"
     inkscape:export-ydpi="96">
    <path
       d="M 443.06316,9.898437 V 0.21874985 h 1.47656 V 1.5950519 Q 445.60613,-1.3969839e-7 447.62045,-1.3969839e-7 q 0.875,0 1.60416,0.31901040969839 0.73829,0.30989582 1.10287,0.82031243 0.36458,0.5104167 0.51042,1.2122396 0.0911,0.4557291 0.0911,1.595052 V 9.898437 h -1.64062 V 4.0104164 q 0,-1.0026041 -0.19141,-1.4947916 -0.19141,-0.5013021 -0.68359,-0.7929687 -0.48308,-0.3007813 -1.13933,-0.3007813 -1.04817,0 -1.8138,0.6653646 -0.75651,0.6653645 -0.75651,2.5247395 V 9.898437 Z"
       style="line-height:0;text-align:center;text-anchor:middle"
       id="path4932" />
    <path
       d="M 453.10287,13.63177 V 4.9464844 h 3.25846 q 0.99531,0 1.59369,0.2666016 0.60429,0.260677 0.94199,0.8116536 0.34362,0.545052 0.34362,1.1434243 0,0.556901 -0.30215,1.0486328 -0.30215,0.4917317 -0.91237,0.7938801 0.78796,0.2310547 1.20859,0.7879557 0.42657,0.5569005 0.42657,1.3152345 0,0.610221 -0.26068,1.1375 -0.25475,0.521354 -0.63392,0.805729 -0.37917,0.284375 -0.95384,0.432487 -0.56875,0.142187 -1.39818,0.142187 z m 1.14935,-5.0358067 h 1.87806 q 0.76426,0 1.09603,-0.1007161 0.43841,-0.1303386 0.65761,-0.432487 0.22513,-0.3021484 0.22513,-0.7583333 0,-0.4324869 -0.20735,-0.7583332 -0.20736,-0.3317708 -0.59245,-0.4502604 -0.38509,-0.124414 -1.32116,-0.124414 h -1.73587 z m 0,4.0108717 h 2.16243 q 0.5569,0 0.78203,-0.04147 0.39694,-0.07109 0.66355,-0.236979 0.2666,-0.165886 0.43841,-0.479883 0.17181,-0.319922 0.17181,-0.734635 0,-0.485808 -0.24883,-0.841276 -0.24883,-0.3613935 -0.69317,-0.5035809 -0.43841,-0.148112 -1.26783,-0.148112 h -2.0084 z"
       style="font-size:64.99999762%;line-height:0;text-align:center;baseline-shift:sub;text-anchor:middle"
       id="path4934" />
    <path
       d="M 461.2668,13.63177 V 4.9464844 h 6.27995 v 1.0249349 h -5.1306 v 2.6600909 h 4.80475 v 1.0190103 h -4.80475 v 2.9563145 h 5.33203 v 1.024935 z"
       style="font-size:64.99999762%;line-height:0;text-align:center;baseline-shift:sub;text-anchor:middle"
       id="path4936" />
    <path
       d="M 469.30039,13.63177 V 4.9464844 h 1.72995 l 2.0558,6.1496086 q 0.28437,0.85905 0.41471,1.285612 0.14811,-0.473958 0.46211,-1.392252 l 2.07949,-6.0429686 h 1.54629 V 13.63177 h -1.10788 V 6.3624348 l -2.52382,7.2693352 h -1.03679 L 470.40827,6.2380208 V 13.63177 Z"
       style="font-size:64.99999762%;line-height:0;text-align:center;baseline-shift:sub;text-anchor:middle"
       id="path4938" />
    <path
       d="m 453.17624,29.23177 v -9.679688 h 1.47656 v 1.376302 q 1.06641,-1.595052 3.08073,-1.595052 0.875,0 1.60417,0.319011 0.73828,0.309896 1.10286,0.820312 0.36459,0.510417 0.51042,1.21224 0.0911,0.455729 0.0911,1.595052 v 5.951823 h -1.64063 v -5.888021 q 0,-1.002604 -0.1914,-1.494792 -0.19141,-0.501302 -0.6836,-0.792968 -0.48307,-0.300782 -1.13932,-0.300782 -1.04818,0 -1.8138,0.665365 -0.75651,0.665364 -0.75651,2.524739 v 5.286459 z"
       style="line-height:0;text-align:center;text-anchor:middle"
       id="path4940" />
    <path
       d="m 467.23275,30.66048 1.04863,0.136263 q -0.17181,1.08418 -0.88274,1.700326 -0.70502,0.610221 -1.73588,0.610221 -1.29153,0 -2.07949,-0.841276 -0.78203,-0.8472 -0.78203,-2.423112 0,-1.01901 0.3377,-1.783268 0.33769,-0.764257 1.02493,-1.143424 0.69316,-0.385091 1.50482,-0.385091 1.02493,0 1.67663,0.521354 0.65169,0.51543 0.83535,1.469271 l -1.03679,0.159961 q -0.14811,-0.63392 -0.52727,-0.953841 -0.37325,-0.319922 -0.90645,-0.319922 -0.80573,0 -1.30931,0.580599 -0.50358,0.574674 -0.50358,1.824739 0,1.267838 0.48581,1.842513 0.4858,0.574674 1.26784,0.574674 0.62799,0 1.04863,-0.385091 0.42064,-0.385091 0.5332,-1.184896 z"
       style="font-size:64.99999762%;line-height:0;text-align:center;baseline-shift:sub;text-anchor:middle"
       id="path4942" />
  </g>
  <path
     style="fill:none;stroke:#000000;stroke-width:1.33299994;stroke-linecap:butt;stroke-linejoin:miter;stroke-miterlimit:4;stroke-dasharray:none;stroke-opacity:1;marker-start:url(#marker4595);marker-end:url(#marker4683)"
     d="m 347.04075,38.415657 h 121.7587"
     id="path4585"
     inkscape:connector-curvature="0"
     inkscape:export-filename="/home/marek/multi-solve.png"
     inkscape:export-xdpi="96"
     inkscape:export-ydpi="96" />
  <g
     aria-label="1"
     style="font-style:normal;font-variant:normal;font-weight:normal;font-stretch:normal;font-size:18.66666603px;line-height:1.25;font-family:Arial;-inkscape-font-specification:Arial;letter-spacing:0px;word-spacing:0px;fill:#000000;fill-opacity:1;stroke:none"
     id="text4773"
     inkscape:export-filename="/home/marek/multi-solve.png"
     inkscape:export-xdpi="96"
     inkscape:export-ydpi="96">
    <path
       d="m 349.53957,31.989256 h -1.64062 V 21.534829 q -0.59245,0.565104 -1.5586,1.130208 -0.95703,0.565105 -1.72265,0.847657 v -1.585938 q 1.3763,-0.647135 2.40625,-1.567708 1.02994,-0.920573 1.45833,-1.786458 h 1.05729 z"
       style=""
       id="path4929" />
  </g>
  <g
     aria-label="i"
     style="font-style:normal;font-variant:normal;font-weight:normal;font-stretch:normal;font-size:18.66666603px;line-height:1.25;font-family:Arial;-inkscape-font-specification:Arial;letter-spacing:0px;word-spacing:0px;fill:#000000;fill-opacity:1;stroke:none"
     id="text4777"
     inkscape:export-filename="/home/marek/multi-solve.png"
     inkscape:export-xdpi="96"
     inkscape:export-ydpi="96">
    <path
       d="m 406.81957,18.273723 h 2.61589 l -0.49219,2.369792 h -2.61589 z m -0.76563,3.682292 h 2.61589 l -2.02344,9.679687 h -2.61588 z"
       style="font-style:italic;font-variant:normal;font-weight:bold;font-stretch:normal;font-family:Arial;-inkscape-font-specification:'Arial Bold Italic'"
       id="path4926" />
  </g>
  <path
     style="fill:none;stroke:#000000;stroke-width:1px;stroke-linecap:butt;stroke-linejoin:miter;stroke-opacity:1"
     d="m 443,16.818187 h 34.5"
     id="path4912"
     inkscape:connector-curvature="0"
     inkscape:export-filename="/home/marek/multi-solve.png"
     inkscape:export-xdpi="96"
     inkscape:export-ydpi="96" />
  <g
     aria-label="sparse but"
     style="font-style:italic;font-variant:normal;font-weight:bold;font-stretch:normal;font-size:16px;line-height:1.25;font-family:Arial;-inkscape-font-specification:'Arial Bold Italic';letter-spacing:0px;word-spacing:0px;fill:#000000;fill-opacity:1;stroke:none"
     id="text2558"
     inkscape:export-filename="/home/marek/multi-solve.png"
     inkscape:export-xdpi="96"
     inkscape:export-ydpi="96">
    <path
       d="m 357.26401,224.86286 2.17187,-0.34375 q 0.28907,0.6875 0.71875,0.97657 0.42969,0.28125 1.17188,0.28125 0.76562,0 1.22656,-0.34375 0.32031,-0.23438 0.32031,-0.57032 0,-0.22656 -0.16406,-0.40625 -0.17187,-0.17187 -0.92969,-0.42187 -2.03125,-0.67188 -2.51562,-1.0625 -0.75781,-0.60938 -0.75781,-1.59375 0,-0.98438 0.73437,-1.69531 1.02344,-0.99219 3.03906,-0.99219 1.60157,0 2.42188,0.58594 0.82031,0.58593 1.03906,1.58593 l -2.07031,0.35938 q -0.16406,-0.45313 -0.53125,-0.67969 -0.5,-0.30469 -1.20313,-0.30469 -0.70312,0 -1.01562,0.23438 -0.30469,0.23437 -0.30469,0.53906 0,0.3125 0.3125,0.51563 0.19531,0.125 1.25781,0.4375 1.64063,0.47656 2.19532,0.9375 0.78125,0.64843 0.78125,1.5625 0,1.17968 -0.99219,2.04687 -0.99219,0.86719 -2.79688,0.86719 -1.79687,0 -2.78125,-0.65625 -0.97656,-0.66406 -1.32812,-1.85938 z"
       style="text-align:center;text-anchor:middle"
       id="path2646" />
    <path
       d="m 368.11557,218.8863 h 2.125 l -0.17969,0.85156 q 0.67969,-0.5625 1.27344,-0.80468 0.59375,-0.24219 1.27344,-0.24219 1.30469,0 2.09375,0.89844 0.79687,0.89843 0.79687,2.67968 0,2.24219 -1.36718,3.78907 -1.17188,1.32031 -2.77344,1.32031 -1.64844,0 -2.49219,-1.33594 l -0.89844,4.30469 h -2.24218 z m 1.35156,4.75781 q 0,0.96875 0.46875,1.50782 0.47657,0.53125 1.11719,0.53125 0.55469,0 1.07031,-0.39844 0.51563,-0.40625 0.85157,-1.33594 0.34375,-0.9375 0.34375,-1.73437 0,-0.92969 -0.44532,-1.42188 -0.44531,-0.5 -1.13281,-0.5 -0.64062,0 -1.17187,0.46094 -0.52344,0.45312 -0.8125,1.34375 -0.28907,0.88281 -0.28907,1.54687 z"
       style="text-align:center;text-anchor:middle"
       id="path2648" />
    <path
       d="m 379.38901,221.23786 -2.1875,-0.1875 q 0.375,-1.10937 1.30469,-1.73437 0.9375,-0.625 2.47656,-0.625 1.60156,0 2.36719,0.64844 0.76562,0.64062 0.76562,1.57031 0,0.375 -0.0703,0.79687 -0.0625,0.42188 -0.46094,2.21875 -0.32812,1.48438 -0.32812,2.07813 0,0.53125 0.1875,1.17969 h -2.17969 q -0.13281,-0.45313 -0.16406,-0.9375 -0.49219,0.54687 -1.13282,0.84375 -0.64062,0.28906 -1.28906,0.28906 -1.03125,0 -1.70312,-0.67188 -0.67188,-0.67968 -0.67188,-1.74218 0,-1.1875 0.73438,-1.89844 0.74218,-0.71094 2.64062,-0.85938 1.60156,-0.13281 2.14063,-0.32031 0.14062,-0.46875 0.14062,-0.75 0,-0.35937 -0.28906,-0.60156 -0.28906,-0.24219 -0.85938,-0.24219 -0.60156,0 -0.95312,0.25 -0.34375,0.24219 -0.46875,0.69531 z m 2.13281,2.07813 q -0.20312,0.0547 -0.53906,0.10156 -1.6875,0.20313 -2.20313,0.59375 -0.36718,0.28125 -0.36718,0.75781 0,0.39063 0.28125,0.66407 0.28125,0.26562 0.74218,0.26562 0.50782,0 0.95313,-0.24219 0.45312,-0.25 0.67187,-0.63281 0.22657,-0.39062 0.39844,-1.21094 z"
       style="text-align:center;text-anchor:middle"
       id="path2650" />
    <path
       d="m 386.73276,218.8863 h 2.09375 l -0.33594,1.60938 q 1.17188,-1.80469 2.53906,-1.80469 0.48438,0 1.03907,0.24219 l -0.85938,1.83593 q -0.30469,-0.10937 -0.64844,-0.10937 -0.57812,0 -1.17968,0.4375 -0.59375,0.4375 -0.92969,1.17187 -0.33594,0.72657 -0.66406,2.3125 l -0.54688,2.60157 h -2.24219 z"
       style="text-align:center;text-anchor:middle"
       id="path2652" />
    <path
       d="m 391.06088,224.86286 2.17188,-0.34375 q 0.28906,0.6875 0.71875,0.97657 0.42969,0.28125 1.17187,0.28125 0.76563,0 1.22657,-0.34375 0.32031,-0.23438 0.32031,-0.57032 0,-0.22656 -0.16406,-0.40625 -0.17188,-0.17187 -0.92969,-0.42187 -2.03125,-0.67188 -2.51563,-1.0625 -0.75781,-0.60938 -0.75781,-1.59375 0,-0.98438 0.73438,-1.69531 1.02343,-0.99219 3.03906,-0.99219 1.60156,0 2.42187,0.58594 0.82032,0.58593 1.03907,1.58593 l -2.07032,0.35938 q -0.16406,-0.45313 -0.53125,-0.67969 -0.5,-0.30469 -1.20312,-0.30469 -0.70313,0 -1.01563,0.23438 -0.30468,0.23437 -0.30468,0.53906 0,0.3125 0.3125,0.51563 0.19531,0.125 1.25781,0.4375 1.64062,0.47656 2.19531,0.9375 0.78125,0.64843 0.78125,1.5625 0,1.17968 -0.99219,2.04687 -0.99218,0.86719 -2.79687,0.86719 -1.79688,0 -2.78125,-0.65625 -0.97656,-0.66406 -1.32813,-1.85938 z"
       style="text-align:center;text-anchor:middle"
       id="path2654" />
    <path
       d="m 408.32651,223.73005 h -5.625 q -0.008,0.13281 -0.008,0.20313 0,0.82812 0.46875,1.33593 0.47656,0.50782 1.15625,0.50782 1.11718,0 1.74218,-1.15625 l 2.00782,0.33593 q -0.58594,1.21094 -1.57032,1.82032 -0.97656,0.60156 -2.19531,0.60156 -1.67187,0 -2.71875,-1.05469 -1.04687,-1.0625 -1.04687,-2.80469 0,-1.70312 0.94531,-3.03125 1.28906,-1.79687 3.67969,-1.79687 1.52343,0 2.42187,0.94531 0.89844,0.9375 0.89844,2.63281 0,0.8125 -0.15625,1.46094 z m -1.89063,-1.36719 q 0.008,-0.14843 0.008,-0.22656 0,-0.92187 -0.41407,-1.38281 -0.41406,-0.46094 -1.10937,-0.46094 -0.69531,0 -1.25,0.52344 -0.54688,0.52344 -0.74219,1.54687 z"
       style="text-align:center;text-anchor:middle"
       id="path2656" />
    <path
       d="m 372.11948,241.48204 2.39062,-11.45312 h 1.41406 l -0.85156,4.09375 q 0.67188,-0.61719 1.21875,-0.86719 0.54688,-0.25781 1.14063,-0.25781 1.16406,0 1.9375,0.86719 0.78125,0.86718 0.78125,2.52343 0,1.10157 -0.3125,2.01563 -0.3125,0.91406 -0.77344,1.53906 -0.46094,0.61719 -0.95313,0.99219 -0.49218,0.36719 -1.00781,0.54687 -0.51562,0.1875 -0.99219,0.1875 -0.82031,0 -1.44531,-0.42968 -0.625,-0.4375 -0.97656,-1.32813 l -0.32813,1.57031 z m 2.09375,-3.40625 -0.008,0.26563 q 0,1.0625 0.50782,1.61719 0.50781,0.55468 1.26562,0.55468 0.74219,0 1.35938,-0.51562 0.625,-0.52344 1.02343,-1.625 0.39844,-1.10156 0.39844,-2.03125 0,-1.04688 -0.50781,-1.625 -0.5,-0.57813 -1.24219,-0.57813 -0.76562,0 -1.40625,0.59375 -0.64062,0.58594 -1.07031,1.8125 -0.32031,0.91407 -0.32031,1.53125 z"
       style="font-style:italic;font-variant:normal;font-weight:normal;font-stretch:normal;font-family:Arial;-inkscape-font-specification:'Arial Italic';text-align:center;text-anchor:middle"
       id="path2658" />
    <path
       d="m 386.68198,239.98204 q -1.49219,1.6875 -3.05469,1.6875 -0.96094,0 -1.55469,-0.54687 -0.58594,-0.55469 -0.58594,-1.35156 0,-0.52344 0.26563,-1.79688 l 1,-4.78906 h 1.41406 l -1.10937,5.30469 q -0.14063,0.66406 -0.14063,1.03125 0,0.46875 0.28125,0.73437 0.28906,0.25781 0.84375,0.25781 0.59375,0 1.15625,-0.28906 0.57031,-0.28906 0.97656,-0.78125 0.41407,-0.49219 0.67188,-1.16406 0.17187,-0.42969 0.39844,-1.50781 l 0.75,-3.58594 h 1.41406 l -1.73438,8.29687 h -1.30468 z"
       style="font-style:italic;font-variant:normal;font-weight:normal;font-stretch:normal;font-family:Arial;-inkscape-font-specification:'Arial Italic';text-align:center;text-anchor:middle"
       id="path2660" />
    <path
       d="m 393.22104,240.33361 -0.23438,1.15625 q -0.50781,0.13281 -0.98437,0.13281 -0.84375,0 -1.34375,-0.41406 -0.375,-0.3125 -0.375,-0.85157 0,-0.27343 0.20312,-1.25781 l 1.00782,-4.82031 h -1.11719 l 0.22656,-1.09375 h 1.11719 l 0.42969,-2.03906 1.61718,-0.97657 -0.63281,3.01563 h 1.39063 l -0.23438,1.09375 h -1.38281 l -0.96094,4.58594 q -0.17969,0.875 -0.17969,1.04687 0,0.25 0.14063,0.38281 0.14844,0.13282 0.47656,0.13282 0.46875,0 0.83594,-0.0937 z"
       style="font-style:italic;font-variant:normal;font-weight:normal;font-stretch:normal;font-family:Arial;-inkscape-font-specification:'Arial Italic';text-align:center;text-anchor:middle"
       id="path2662" />
  </g>
  <g
     aria-label="Y ← (LvvLvvT)-1AsviT"
     style="font-style:italic;font-variant:normal;font-weight:bold;font-stretch:normal;font-size:16px;line-height:1.25;font-family:Arial;-inkscape-font-specification:'Arial Bold Italic';letter-spacing:0px;word-spacing:0px;fill:#000000;fill-opacity:1;stroke:none"
     id="text2564"
     inkscape:export-filename="/home/marek/multi-solve.png"
     inkscape:export-xdpi="96"
     inkscape:export-ydpi="96">
    <path
       d="m 318.6723,258.04306 v -4.82031 l -4.19531,-6.63281 h 2.71094 l 2.69531,4.53125 2.64062,-4.53125 h 2.66407 l -4.21094,6.64843 v 4.80469 z"
       style="font-style:normal;font-variant:normal;font-weight:bold;font-stretch:normal;font-family:Arial;-inkscape-font-specification:'Arial Bold'"
       id="path2609" />
    <path
       d="m 333.1723,251.19931 h 0.59375 q -0.46094,0.92188 -0.69531,1.29688 -0.23438,0.36718 -0.82813,1.11718 h 12.46094 v 0.78907 h -12.46094 q 0.8125,0.84375 1.54688,2.41406 h -0.60938 q -1.00781,-1.125 -1.73437,-1.70313 -0.72656,-0.58593 -1.5,-0.96093 v -0.35157 q 0.67969,-0.28906 1.4375,-0.88281 0.75781,-0.59375 1.78906,-1.71875 z"
       style="font-style:normal;font-variant:normal;font-weight:bold;font-stretch:normal;font-family:Arial;-inkscape-font-specification:'Arial Bold'"
       id="path2611" />
    <path
       d="m 354.56293,261.41025 h -1.50782 q -1.19531,-1.80469 -1.82031,-3.75 -0.625,-1.94531 -0.625,-3.76563 0,-2.25781 0.77344,-4.27343 0.67187,-1.75 1.70312,-3.22657 h 1.5 q -1.07031,2.36719 -1.47656,4.03125 -0.39844,1.65625 -0.39844,3.51563 0,1.28125 0.23438,2.625 0.24219,1.34375 0.65625,2.55469 0.27344,0.79687 0.96094,2.28906 z"
       style="font-style:normal;font-variant:normal;font-weight:bold;font-stretch:normal;font-family:Arial;-inkscape-font-specification:'Arial Bold'"
       id="path2613" />
    <path
       d="m 356.32855,258.04306 v -11.35937 h 2.3125 v 9.42968 h 5.75 v 1.92969 z"
       style="font-style:normal;font-variant:normal;font-weight:bold;font-stretch:normal;font-family:Arial;-inkscape-font-specification:'Arial Bold'"
       id="path2615" />
    <path
       d="m 367.10472,261.24306 -2.17343,-5.39297 h 1.49804 l 1.01563,2.75235 0.29453,0.91914 q 0.1168,-0.35039 0.14727,-0.46211 0.0711,-0.22852 0.15234,-0.45703 l 1.02578,-2.75235 h 1.46758 l -2.14297,5.39297 z"
       style="font-size:64.99999762%;baseline-shift:sub"
       id="path2617" />
    <path
       d="m 372.88871,261.24306 -2.17344,-5.39297 h 1.49805 l 1.01562,2.75235 0.29453,0.91914 q 0.1168,-0.35039 0.14727,-0.46211 0.0711,-0.22852 0.15234,-0.45703 l 1.02579,-2.75235 h 1.46757 l -2.14297,5.39297 z"
       style="font-size:64.99999762%;baseline-shift:sub"
       id="path2619" />
    <path
       d="m 377.66996,258.04306 v -11.35937 h 2.3125 v 9.42968 h 5.75 v 1.92969 z"
       style="font-style:normal;font-variant:normal;font-weight:bold;font-stretch:normal;font-family:Arial;-inkscape-font-specification:'Arial Bold'"
       id="path2621" />
    <path
       d="m 388.44613,261.24306 -2.17344,-5.39297 h 1.49805 l 1.01563,2.75235 0.29453,0.91914 q 0.11679,-0.35039 0.14726,-0.46211 0.0711,-0.22852 0.15235,-0.45703 l 1.02578,-2.75235 h 1.46758 l -2.14297,5.39297 z"
       style="font-size:64.99999762%;baseline-shift:sub"
       id="path2623" />
    <path
       d="m 394.23011,261.24306 -2.17343,-5.39297 h 1.49804 l 1.01563,2.75235 0.29453,0.91914 q 0.1168,-0.35039 0.14726,-0.46211 0.0711,-0.22852 0.15235,-0.45703 l 1.02578,-2.75235 h 1.46758 l -2.14297,5.39297 z"
       style="font-size:64.99999762%;baseline-shift:sub"
       id="path2625" />
    <path
       d="m 400.21723,251.64306 v -6.18516 h -2.20899 v -1.25937 h 5.91602 v 1.25937 h -2.20391 v 6.18516 z"
       style="font-size:64.99999762%;baseline-shift:super"
       id="path2627" />
    <path
       d="m 404.6766,261.41025 q 0.64844,-1.39063 0.91406,-2.13281 0.26563,-0.74219 0.49219,-1.71094 0.22656,-0.96875 0.33594,-1.83594 0.10937,-0.875 0.10937,-1.78906 0,-1.85938 -0.39844,-3.51563 -0.39843,-1.66406 -1.46875,-4.03125 h 1.49219 q 1.17969,1.67969 1.82813,3.5625 0.65625,1.88282 0.65625,3.82032 0,1.63281 -0.51563,3.5 -0.58594,2.09375 -1.92969,4.13281 z"
       style="font-style:normal;font-variant:normal;font-weight:bold;font-stretch:normal;font-family:Arial;-inkscape-font-specification:'Arial Bold'"
       id="path2629" />
    <path
       d="m 410.04964,249.65751 v -1.42695 h 2.80313 v 1.42695 z"
       style="font-size:64.99999762%;baseline-shift:super"
       id="path2631" />
    <path
       d="m 417.02191,251.64306 h -1.42695 v -5.37773 q -0.78204,0.73125 -1.84336,1.08164 v -1.29493 q 0.55859,-0.18281 1.21367,-0.69062 0.65508,-0.51289 0.89883,-1.19336 h 1.15781 z"
       style="font-size:64.99999762%;baseline-shift:super"
       id="path2633" />
    <path
       d="m 430.20512,258.04306 h -2.51563 l -1,-2.60156 h -4.57812 l -0.94532,2.60156 h -2.45312 l 4.46094,-11.45312 h 2.44531 z m -4.25782,-4.53125 -1.57812,-4.25 -1.54688,4.25 z"
       style="font-style:normal;font-variant:normal;font-weight:bold;font-stretch:normal;font-family:Arial;-inkscape-font-specification:'Arial Bold'"
       id="path2635" />
    <path
       d="m 430.51137,259.70439 1.43203,-0.21836 q 0.0914,0.41641 0.3707,0.63476 0.2793,0.21329 0.78203,0.21329 0.55352,0 0.83281,-0.20313 0.18789,-0.14219 0.18789,-0.38086 0,-0.1625 -0.10156,-0.26914 -0.10664,-0.10156 -0.47734,-0.18789 -1.72656,-0.38086 -2.18867,-0.6957 -0.63985,-0.43672 -0.63985,-1.21367 0,-0.70079 0.55352,-1.17813 0.55351,-0.47734 1.7164,-0.47734 1.10704,0 1.64532,0.36054 0.53828,0.36055 0.7414,1.06641 l -1.3457,0.24883 q -0.0863,-0.31485 -0.33008,-0.48242 -0.23867,-0.16758 -0.68554,-0.16758 -0.56368,0 -0.80743,0.15742 -0.1625,0.11172 -0.1625,0.28945 0,0.15235 0.14219,0.25899 0.19297,0.14218 1.33047,0.40117 1.14258,0.25898 1.59453,0.63476 0.44688,0.38086 0.44688,1.06133 0,0.74141 -0.61954,1.27461 -0.61953,0.53321 -1.8332,0.53321 -1.10195,0 -1.74687,-0.44688 -0.63985,-0.44687 -0.83789,-1.21367 z"
       style="font-size:64.99999762%;baseline-shift:sub"
       id="path2637" />
    <path
       d="m 438.28089,261.24306 -2.17343,-5.39297 h 1.49804 l 1.01563,2.75235 0.29453,0.91914 q 0.1168,-0.35039 0.14727,-0.46211 0.0711,-0.22852 0.15234,-0.45703 l 1.02578,-2.75235 h 1.46758 l -2.14297,5.39297 z"
       style="font-size:64.99999762%;baseline-shift:sub"
       id="path2639" />
    <path
       d="m 442.58206,258.31884 v -1.32031 h 1.42696 v 1.32031 z m 0,6.12422 v -5.39297 h 1.42696 v 5.39297 z"
       style=""
       id="path2641" />
    <path
       d="m 447.15746,251.64306 v -6.18516 h -2.20899 v -1.25937 h 5.91602 v 1.25937 h -2.20391 v 6.18516 z"
       style="font-size:64.99999762%;baseline-shift:super"
       id="path2643" />
  </g>
  <g
     aria-label="dense"
     style="font-style:italic;font-variant:normal;font-weight:bold;font-stretch:normal;font-size:16px;line-height:1.25;font-family:Arial;-inkscape-font-specification:'Arial Bold Italic';letter-spacing:0px;word-spacing:0px;fill:#000000;fill-opacity:1;stroke:none"
     id="text2588"
     inkscape:export-filename="/home/marek/multi-solve.png"
     inkscape:export-xdpi="96"
     inkscape:export-ydpi="96">
    <path
       d="m 367.40439,277.19318 h -2.125 l 0.1875,-0.89844 q -0.60938,0.58594 -1.20313,0.84375 -0.58593,0.25 -1.32812,0.25 -1.28906,0 -2.09375,-0.875 -0.79688,-0.88281 -0.79688,-2.60156 0,-1.99219 1.125,-3.60157 1.125,-1.60937 2.97657,-1.60937 1.67187,0 2.50781,1.32812 l 0.89844,-4.28906 h 2.24218 z m -5.17969,-3.375 q 0,0.89062 0.44531,1.39062 0.45313,0.5 1.10938,0.5 0.60937,0 1.13281,-0.41406 0.53125,-0.42188 0.84375,-1.28125 0.32031,-0.85938 0.32031,-1.64844 0,-0.89844 -0.48437,-1.45312 -0.48438,-0.55469 -1.11719,-0.55469 -0.98437,0 -1.61719,1.09375 -0.63281,1.09375 -0.63281,2.36719 z"
       style=""
       id="path2598" />
    <path
       d="m 377.59189,273.74005 h -5.625 q -0.008,0.13281 -0.008,0.20313 0,0.82812 0.46875,1.33593 0.47656,0.50782 1.15625,0.50782 1.11718,0 1.74218,-1.15625 l 2.00782,0.33593 q -0.58594,1.21094 -1.57032,1.82032 -0.97656,0.60156 -2.19531,0.60156 -1.67187,0 -2.71875,-1.05469 -1.04687,-1.0625 -1.04687,-2.80469 0,-1.70312 0.94531,-3.03125 1.28906,-1.79687 3.67969,-1.79687 1.52343,0 2.42187,0.94531 0.89844,0.9375 0.89844,2.63281 0,0.8125 -0.15625,1.46094 z m -1.89063,-1.36719 q 0.008,-0.14843 0.008,-0.22656 0,-0.92187 -0.41407,-1.38281 -0.41406,-0.46094 -1.10937,-0.46094 -0.69531,0 -1.25,0.52344 -0.54688,0.52344 -0.74219,1.54687 z"
       style=""
       id="path2600" />
    <path
       d="m 380.17783,268.8963 h 2.125 l -0.21875,1.07813 q 0.79687,-0.6875 1.48437,-0.97657 0.69531,-0.29687 1.46094,-0.29687 1.02344,0 1.60937,0.58594 0.59375,0.58593 0.59375,1.55468 0,0.4375 -0.25781,1.65625 l -0.97656,4.69532 h -2.24219 l 0.98438,-4.71094 q 0.21875,-1.05469 0.21875,-1.25781 0,-0.42969 -0.25782,-0.67188 -0.25,-0.25 -0.70312,-0.25 -0.49219,0 -1.09375,0.41406 -0.60156,0.41407 -0.94531,1.09375 -0.25,0.48438 -0.5625,1.97657 l -0.71094,3.40625 h -2.24219 z"
       style=""
       id="path2602" />
    <path
       d="m 387.89658,274.87286 2.17187,-0.34375 q 0.28906,0.6875 0.71875,0.97657 0.42969,0.28125 1.17188,0.28125 0.76562,0 1.22656,-0.34375 0.32031,-0.23438 0.32031,-0.57032 0,-0.22656 -0.16406,-0.40625 -0.17188,-0.17187 -0.92969,-0.42187 -2.03125,-0.67188 -2.51562,-1.0625 -0.75782,-0.60938 -0.75782,-1.59375 0,-0.98438 0.73438,-1.69531 1.02344,-0.99219 3.03906,-0.99219 1.60156,0 2.42188,0.58594 0.82031,0.58593 1.03906,1.58593 l -2.07031,0.35938 q -0.16407,-0.45313 -0.53125,-0.67969 -0.5,-0.30469 -1.20313,-0.30469 -0.70312,0 -1.01562,0.23438 -0.30469,0.23437 -0.30469,0.53906 0,0.3125 0.3125,0.51563 0.19531,0.125 1.25781,0.4375 1.64063,0.47656 2.19531,0.9375 0.78125,0.64843 0.78125,1.5625 0,1.17968 -0.99218,2.04687 -0.99219,0.86719 -2.79688,0.86719 -1.79687,0 -2.78125,-0.65625 -0.97656,-0.66406 -1.32812,-1.85938 z"
       style=""
       id="path2604" />
    <path
       d="m 405.1622,273.74005 h -5.625 q -0.008,0.13281 -0.008,0.20313 0,0.82812 0.46875,1.33593 0.47656,0.50782 1.15625,0.50782 1.11719,0 1.74219,-1.15625 l 2.00781,0.33593 q -0.58594,1.21094 -1.57031,1.82032 -0.97657,0.60156 -2.19532,0.60156 -1.67187,0 -2.71875,-1.05469 -1.04687,-1.0625 -1.04687,-2.80469 0,-1.70312 0.94531,-3.03125 1.28906,-1.79687 3.67969,-1.79687 1.52344,0 2.42187,0.94531 0.89844,0.9375 0.89844,2.63281 0,0.8125 -0.15625,1.46094 z m -1.89062,-1.36719 q 0.008,-0.14843 0.008,-0.22656 0,-0.92187 -0.41406,-1.38281 -0.41407,-0.46094 -1.10938,-0.46094 -0.69531,0 -1.25,0.52344 -0.54687,0.52344 -0.74219,1.54687 z"
       style=""
       id="path2606" />
  </g>
</svg>
