<?xml version="1.0" encoding="UTF-8" standalone="no"?>
<!-- Created with Inkscape (http://www.inkscape.org/) -->

<svg
   xmlns:dc="http://purl.org/dc/elements/1.1/"
   xmlns:cc="http://creativecommons.org/ns#"
   xmlns:rdf="http://www.w3.org/1999/02/22-rdf-syntax-ns#"
   xmlns:svg="http://www.w3.org/2000/svg"
   xmlns="http://www.w3.org/2000/svg"
   xmlns:sodipodi="http://sodipodi.sourceforge.net/DTD/sodipodi-0.dtd"
   xmlns:inkscape="http://www.inkscape.org/namespaces/inkscape"
   width="63.557873mm"
   height="37.82238mm"
   viewBox="0 0 63.557873 37.82238"
   version="1.1"
   id="svg8"
   inkscape:version="0.92.4 (5da689c313, 2019-01-14)"
   sodipodi:docname="black-box-distributed.svg">
  <defs
     id="defs2">
    <inkscape:path-effect
       effect="perspective-envelope"
       up_left_point="85.01,72.519685"
       up_right_point="98.64,76.139685"
       down_left_point="84.11,97.639685"
       down_right_point="97.74,102.93969"
       id="path-effect5193"
       is_visible="true"
       deform_type="perspective"
       horizontal_mirror="false"
       vertical_mirror="false"
       overflow_perspective="false" />
    <inkscape:path-effect
       overflow_perspective="false"
       vertical_mirror="false"
       horizontal_mirror="false"
       deform_type="perspective"
       is_visible="true"
       id="path-effect5181"
       down_right_point="95,102.93969"
       down_left_point="82,97.639685"
       up_right_point="99,76.139685"
       up_left_point="85.01,75.519685"
       effect="perspective-envelope" />
    <inkscape:path-effect
       overflow_perspective="true"
       vertical_mirror="false"
       horizontal_mirror="false"
       deform_type="perspective"
       is_visible="true"
       id="path-effect5169"
       down_right_point="97.74,102.93969"
       down_left_point="84.11,97.639685"
       up_right_point="98.64,76.139685"
       up_left_point="85.01,72.519685"
       effect="perspective-envelope" />
    <inkscape:path-effect
       overflow_perspective="false"
       vertical_mirror="false"
       horizontal_mirror="false"
       deform_type="perspective"
       is_visible="true"
       id="path-effect5157"
       down_right_point="106.1,97.719685"
       down_left_point="81.61,107.36969"
       up_right_point="98.84,68.419685"
       up_left_point="85.31069,76.909685"
       effect="perspective-envelope" />
    <inkscape:path-effect
       effect="perspective-envelope"
       up_left_point="85.01,72.519685"
       up_right_point="98.64,76.139685"
       down_left_point="84.11,97.639685"
       down_right_point="97.74,102.93969"
       id="path-effect5145"
       is_visible="true"
       deform_type="perspective"
       horizontal_mirror="false"
       vertical_mirror="false"
       overflow_perspective="false" />
  </defs>
  <sodipodi:namedview
     id="base"
     pagecolor="#ffffff"
     bordercolor="#666666"
     borderopacity="1.0"
     inkscape:pageopacity="0.0"
     inkscape:pageshadow="2"
     inkscape:zoom="1.979899"
     inkscape:cx="8.8886015"
     inkscape:cy="-12.122272"
     inkscape:document-units="mm"
     inkscape:current-layer="layer1"
     showgrid="false"
     showguides="true"
     inkscape:guide-bbox="true"
     inkscape:window-width="1920"
     inkscape:window-height="1025"
     inkscape:window-x="0"
     inkscape:window-y="0"
     inkscape:window-maximized="1"
     fit-margin-top="0"
     fit-margin-left="0"
     fit-margin-right="0"
     fit-margin-bottom="0">
    <sodipodi:guide
       position="31.572116,32.918698"
       orientation="0,1"
       id="guide40"
       inkscape:locked="false" />
    <sodipodi:guide
       position="31.572116,-46.593982"
       orientation="0,1"
       id="guide42"
       inkscape:locked="false" />
    <sodipodi:guide
       position="31.572116,32.918708"
       orientation="1,0"
       id="guide44"
       inkscape:locked="false" />
    <sodipodi:guide
       position="65.782616,13.007118"
       orientation="1,0"
       id="guide46"
       inkscape:locked="false" />
    <sodipodi:guide
       position="-2.7720192,13.007118"
       orientation="1,0"
       id="guide48"
       inkscape:locked="false" />
    <sodipodi:guide
       position="65.782616,13.007128"
       orientation="0,1"
       id="guide50"
       inkscape:locked="false" />
    <sodipodi:guide
       position="65.782616,-26.682401"
       orientation="0,1"
       id="guide52"
       inkscape:locked="false" />
    <sodipodi:guide
       position="31.572116,-6.9044617"
       orientation="0,1"
       id="guide57"
       inkscape:locked="false" />
  </sodipodi:namedview>
  <metadata
     id="metadata5">
    <rdf:RDF>
      <cc:Work
         rdf:about="">
        <dc:format>image/svg+xml</dc:format>
        <dc:type
           rdf:resource="http://purl.org/dc/dcmitype/StillImage" />
        <dc:title></dc:title>
      </cc:Work>
    </rdf:RDF>
  </metadata>
  <g
     inkscape:label="Calque 1"
     inkscape:groupmode="layer"
     id="layer1"
     transform="translate(-76.137504,-28.56856)">
    <text
       xml:space="preserve"
       style="font-style:normal;font-variant:normal;font-weight:normal;font-stretch:normal;font-size:4.23333311px;line-height:1.25;font-family:sans-serif;-inkscape-font-specification:sans-serif;letter-spacing:0px;word-spacing:0px;fill:#000000;fill-opacity:1;stroke:none;stroke-width:0.26458332"
       x="75.637276"
       y="64.609138"
       id="text861"><tspan
         sodipodi:role="line"
         id="tspan859"
         x="75.637276"
         y="64.609138"
         style="font-style:italic;font-variant:normal;font-weight:bold;font-stretch:normal;font-size:8.46666622px;font-family:Arial;-inkscape-font-specification:'Arial Bold Italic';fill:#000000;stroke-width:0.26458332">distrib. memory</tspan></text>
    <g
       id="g981"
       transform="matrix(0.38456062,0,0,0.38456062,81.877483,28.56856)">
      <g
         transform="translate(10.479,-42)"
         id="g840">
        <path
           style="fill:#00ffff"
           d="m 48,45 v 3 3 3 3 h 3 3 3 3 3 v -3 -3 -3 -3 h -3 -3 -3 -3 z"
           id="rect2366"
           inkscape:connector-curvature="0"
           sodipodi:nodetypes="ccccccccccccccccccc" />
        <path
           style="fill:#808080"
           d="m 45,42 v 3 3 3 3 3 3 h 3 3 3 3 3 3 3 v -3 -3 -3 -3 -3 -3 h -3 -3 -3 -3 -3 -3 z m 3,3 h 3 3 3 3 3 v 3 3 3 3 h -3 -3 -3 -3 -3 v -3 -3 -3 z m -9,15 v 3 3 3 h 3 3 3 3 3 3 3 3 3 3 3 v -3 -3 -3 h -3 v 3 3 h -3 -3 -3 -3 -3 -3 -3 -3 -3 v -3 -3 z"
           id="rect3382"
           inkscape:connector-curvature="0"
           sodipodi:nodetypes="ccccccccccccccccccccccccccccccccccccccccccccccccccccccccccccccccccccccccccccccc" />
        <path
           style="fill:#000000"
           d="m 66,45 v 3 3 3 3 3 h 3 v -3 -3 -3 -3 -3 z m 6,15 v 3 3 3 h -3 -3 -3 -3 -3 -3 -3 -3 -3 -3 v 3 h 3 3 3 3 3 3 3 3 3 3 3 v -3 -3 -3 -3 z"
           id="rect3568"
           inkscape:connector-curvature="0"
           sodipodi:nodetypes="cccccccccccccccccccccccccccccccccccccccccccc" />
      </g>
      <g
         transform="translate(10.479,-42)"
         id="g862">
        <path
           style="fill:#800000"
           d="m 75,63 v 3 h 3 3 27 V 63 H 81 78 Z m 30,3 v 30 3 3 3 h 3 v -3 -3 -3 -30 z m 0,39 c -70,26 -35,13 0,0 z"
           id="rect2778"
           inkscape:connector-curvature="0"
           sodipodi:nodetypes="cccccccccccccccccccccc" />
        <path
           sodipodi:nodetypes="cccccccccccccccccccccc"
           inkscape:connector-curvature="0"
           id="path835"
           d="m 75,106.01111 v -3 h 3 3 27 v 3 H 81 78 Z m 30,-3 v -30.000003 -3 -3 -3 h 3 v 3 3 3 30.000003 z m 0,-39.000003 c -70,-26 -35,-13 0,0 z"
           style="fill:#800000" />
      </g>
      <g
         transform="translate(10.479,-2)"
         id="g848">
        <path
           sodipodi:nodetypes="ccccccccccccccccccc"
           inkscape:connector-curvature="0"
           id="path842"
           d="m 48,45 v 3 3 3 3 h 3 3 3 3 3 v -3 -3 -3 -3 h -3 -3 -3 -3 z"
           style="fill:#00ffff" />
        <path
           sodipodi:nodetypes="ccccccccccccccccccccccccccccccccccccccccccccccccccccccccccccccccccccccccccccccc"
           inkscape:connector-curvature="0"
           id="path844"
           d="m 45,42 v 3 3 3 3 3 3 h 3 3 3 3 3 3 3 v -3 -3 -3 -3 -3 -3 h -3 -3 -3 -3 -3 -3 z m 3,3 h 3 3 3 3 3 v 3 3 3 3 h -3 -3 -3 -3 -3 v -3 -3 -3 z m -9,15 v 3 3 3 h 3 3 3 3 3 3 3 3 3 3 3 v -3 -3 -3 h -3 v 3 3 h -3 -3 -3 -3 -3 -3 -3 -3 -3 v -3 -3 z"
           style="fill:#808080" />
        <path
           sodipodi:nodetypes="cccccccccccccccccccccccccccccccccccccccccccc"
           inkscape:connector-curvature="0"
           id="path846"
           d="m 66,45 v 3 3 3 3 3 h 3 v -3 -3 -3 -3 -3 z m 6,15 v 3 3 3 h -3 -3 -3 -3 -3 -3 -3 -3 -3 -3 v 3 h 3 3 3 3 3 3 3 3 3 3 3 v -3 -3 -3 -3 z"
           style="fill:#000000" />
      </g>
      <g
         transform="matrix(-1,0,0,1,124.479,-42)"
         id="g868">
        <path
           sodipodi:nodetypes="cccccccccccccccccccccc"
           inkscape:connector-curvature="0"
           id="path864"
           d="m 75,63 v 3 h 3 3 27 V 63 H 81 78 Z m 30,3 v 30 3 3 3 h 3 v -3 -3 -3 -30 z m 0,39 c -70,26 -35,13 0,0 z"
           style="fill:#800000" />
        <path
           style="fill:#800000"
           d="m 75,106.01111 v -3 h 3 3 27 v 3 H 81 78 Z m 30,-3 v -30.000003 -3 -3 -3 h 3 v 3 3 3 30.000003 z m 0,-39.000003 c -70,-26 -35,-13 0,0 z"
           id="path866"
           inkscape:connector-curvature="0"
           sodipodi:nodetypes="cccccccccccccccccccccc" />
      </g>
      <g
         transform="translate(10.479,-42)"
         id="g945">
        <g
           transform="translate(48.921363,27.676409)"
           id="g856">
          <path
             sodipodi:nodetypes="ccccccccccccccccccc"
             inkscape:connector-curvature="0"
             id="path850"
             d="m 48,45 v 3 3 3 3 h 3 3 3 3 3 v -3 -3 -3 -3 h -3 -3 -3 -3 z"
             style="fill:#00ffff" />
          <path
             sodipodi:nodetypes="ccccccccccccccccccccccccccccccccccccccccccccccccccccccccccccccccccccccccccccccc"
             inkscape:connector-curvature="0"
             id="path852"
             d="m 45,42 v 3 3 3 3 3 3 h 3 3 3 3 3 3 3 v -3 -3 -3 -3 -3 -3 h -3 -3 -3 -3 -3 -3 z m 3,3 h 3 3 3 3 3 v 3 3 3 3 h -3 -3 -3 -3 -3 v -3 -3 -3 z m -9,15 v 3 3 3 h 3 3 3 3 3 3 3 3 3 3 3 v -3 -3 -3 h -3 v 3 3 h -3 -3 -3 -3 -3 -3 -3 -3 -3 v -3 -3 z"
             style="fill:#808080" />
          <path
             sodipodi:nodetypes="cccccccccccccccccccccccccccccccccccccccccccc"
             inkscape:connector-curvature="0"
             id="path854"
             d="m 66,45 v 3 3 3 3 3 h 3 v -3 -3 -3 -3 -3 z m 6,15 v 3 3 3 h -3 -3 -3 -3 -3 -3 -3 -3 -3 -3 v 3 h 3 3 3 3 3 3 3 3 3 3 3 v -3 -3 -3 -3 z"
             style="fill:#000000" />
        </g>
        <path
           style="fill:#ffffff;fill-opacity:1;stroke:none;stroke-width:1.17203403px;stroke-linecap:butt;stroke-linejoin:miter;stroke-opacity:1"
           d="m 90.921363,87.673729 26.999997,0.0027 v 5.984608 l -26.999997,0.01539 z"
           id="path876"
           inkscape:connector-curvature="0"
           sodipodi:nodetypes="ccccc" />
      </g>
      <g
         transform="translate(10.479,-42)"
         id="g922">
        <g
           id="g891"
           transform="translate(-49.479,27.676409)">
          <path
             style="fill:#00ffff"
             d="m 48,45 v 3 3 3 3 h 3 3 3 3 3 v -3 -3 -3 -3 h -3 -3 -3 -3 z"
             id="path885"
             inkscape:connector-curvature="0"
             sodipodi:nodetypes="ccccccccccccccccccc" />
          <path
             style="fill:#808080"
             d="m 45,42 v 3 3 3 3 3 3 h 3 3 3 3 3 3 3 v -3 -3 -3 -3 -3 -3 h -3 -3 -3 -3 -3 -3 z m 3,3 h 3 3 3 3 3 v 3 3 3 3 h -3 -3 -3 -3 -3 v -3 -3 -3 z m -9,15 v 3 3 3 h 3 3 3 3 3 3 3 3 3 3 3 v -3 -3 -3 h -3 v 3 3 h -3 -3 -3 -3 -3 -3 -3 -3 -3 v -3 -3 z"
             id="path887"
             inkscape:connector-curvature="0"
             sodipodi:nodetypes="ccccccccccccccccccccccccccccccccccccccccccccccccccccccccccccccccccccccccccccccc" />
          <path
             style="fill:#000000"
             d="m 66,45 v 3 3 3 3 3 h 3 v -3 -3 -3 -3 -3 z m 6,15 v 3 3 3 h -3 -3 -3 -3 -3 -3 -3 -3 -3 -3 v 3 h 3 3 3 3 3 3 3 3 3 3 3 v -3 -3 -3 -3 z"
             id="path889"
             inkscape:connector-curvature="0"
             sodipodi:nodetypes="cccccccccccccccccccccccccccccccccccccccccccc" />
        </g>
        <path
           sodipodi:nodetypes="ccccc"
           inkscape:connector-curvature="0"
           id="path913"
           d="m -7.479,87.673729 26.999997,0.0027 v 5.984608 L -7.479,93.676427 Z"
           style="fill:#ffffff;fill-opacity:1;stroke:none;stroke-width:1.17203403px;stroke-linecap:butt;stroke-linejoin:miter;stroke-opacity:1" />
      </g>
      <path
         style="fill:#ffffff;fill-opacity:1;stroke:none;stroke-width:1.17203403px;stroke-linecap:butt;stroke-linejoin:miter;stroke-opacity:1"
         d="m 52.479,58 26.999997,0.003 v 5.98461 L 52.479,64.00301 Z"
         id="path936"
         inkscape:connector-curvature="0"
         sodipodi:nodetypes="ccccc" />
      <path
         sodipodi:nodetypes="ccccc"
         inkscape:connector-curvature="0"
         id="path938"
         d="m 52.479,18 26.999997,0.003 v 5.98461 L 52.479,24.00301 Z"
         style="fill:#ffffff;fill-opacity:1;stroke:none;stroke-width:1.17203403px;stroke-linecap:butt;stroke-linejoin:miter;stroke-opacity:1" />
    </g>
  </g>
</svg>
