<?xml version='1.0' encoding='UTF-8' ?>
<svg xmlns='http://www.w3.org/2000/svg' xmlns:xlink='http://www.w3.org/1999/xlink' class='svglite' width='360.00pt' height='360.00pt' viewBox='0 0 360.00 360.00'>
<defs>
  <style type='text/css'><![CDATA[
    .svglite line, .svglite polyline, .svglite polygon, .svglite path, .svglite rect, .svglite circle {
      fill: none;
      stroke: #000000;
      stroke-linecap: round;
      stroke-linejoin: round;
      stroke-miterlimit: 10.00;
    }
    .svglite text {
      white-space: pre;
    }
  ]]></style>
</defs>
<rect width='100%' height='100%' style='stroke: none; fill: #FFFFFF;'/>
<defs>
  <clipPath id='cpMC4wMHwzNjAuMDB8MC4wMHwzNjAuMDA='>
    <rect x='0.00' y='0.00' width='360.00' height='360.00' />
  </clipPath>
</defs>
<g clip-path='url(#cpMC4wMHwzNjAuMDB8MC4wMHwzNjAuMDA=)'>
<rect x='0.00' y='0.00' width='360.00' height='360.00' style='stroke-width: 1.07; stroke: #FFFFFF; fill: #FFFFFF;' />
</g>
<defs>
  <clipPath id='cpNDUuNjF8MzU0LjUyfDUuNDh8MjYyLjk4'>
    <rect x='45.61' y='5.48' width='308.91' height='257.51' />
  </clipPath>
</defs>
<g clip-path='url(#cpNDUuNjF8MzU0LjUyfDUuNDh8MjYyLjk4)'>
<rect x='45.61' y='5.48' width='308.91' height='257.51' style='stroke-width: 1.07; stroke: none; fill: #FFFFFF;' />
<polyline points='45.61,228.61 354.52,228.61 ' style='stroke-width: 0.53; stroke: #EBEBEB; stroke-linecap: butt;' />
<polyline points='45.61,172.41 354.52,172.41 ' style='stroke-width: 0.53; stroke: #EBEBEB; stroke-linecap: butt;' />
<polyline points='45.61,116.21 354.52,116.21 ' style='stroke-width: 0.53; stroke: #EBEBEB; stroke-linecap: butt;' />
<polyline points='45.61,60.01 354.52,60.01 ' style='stroke-width: 0.53; stroke: #EBEBEB; stroke-linecap: butt;' />
<polyline points='63.34,262.98 63.34,5.48 ' style='stroke-width: 0.53; stroke: #EBEBEB; stroke-linecap: butt;' />
<polyline points='100.30,262.98 100.30,5.48 ' style='stroke-width: 0.53; stroke: #EBEBEB; stroke-linecap: butt;' />
<polyline points='229.63,262.98 229.63,5.48 ' style='stroke-width: 0.53; stroke: #EBEBEB; stroke-linecap: butt;' />
<polyline points='200.06,262.98 200.06,5.48 ' style='stroke-width: 0.53; stroke: #EBEBEB; stroke-linecap: butt;' />
<polyline points='126.16,262.98 126.16,5.48 ' style='stroke-width: 0.53; stroke: #EBEBEB; stroke-linecap: butt;' />
<polyline points='211.15,262.98 211.15,5.48 ' style='stroke-width: 0.53; stroke: #EBEBEB; stroke-linecap: butt;' />
<polyline points='45.61,256.72 354.52,256.72 ' style='stroke-width: 1.07; stroke: #EBEBEB; stroke-linecap: butt;' />
<polyline points='45.61,200.51 354.52,200.51 ' style='stroke-width: 1.07; stroke: #EBEBEB; stroke-linecap: butt;' />
<polyline points='45.61,144.31 354.52,144.31 ' style='stroke-width: 1.07; stroke: #EBEBEB; stroke-linecap: butt;' />
<polyline points='45.61,88.11 354.52,88.11 ' style='stroke-width: 1.07; stroke: #EBEBEB; stroke-linecap: butt;' />
<polyline points='45.61,31.91 354.52,31.91 ' style='stroke-width: 1.07; stroke: #EBEBEB; stroke-linecap: butt;' />
<polyline points='81.82,262.98 81.82,5.48 ' style='stroke-width: 1.07; stroke: #EBEBEB; stroke-linecap: butt;' />
<polyline points='118.77,262.98 118.77,5.48 ' style='stroke-width: 1.07; stroke: #EBEBEB; stroke-linecap: butt;' />
<polyline points='340.48,262.98 340.48,5.48 ' style='stroke-width: 1.07; stroke: #EBEBEB; stroke-linecap: butt;' />
<polyline points='59.65,262.98 59.65,5.48 ' style='stroke-width: 1.07; stroke: #EBEBEB; stroke-linecap: butt;' />
<polyline points='192.67,262.98 192.67,5.48 ' style='stroke-width: 1.07; stroke: #EBEBEB; stroke-linecap: butt;' />
<polyline points='59.65,251.28 81.82,231.51 118.77,212.90 192.67,151.27 340.48,17.18 ' style='stroke-width: 1.07; stroke-linecap: butt;' />
<circle cx='81.82' cy='231.51' r='3.02' style='stroke-width: 0.71; stroke: none; fill: #000000;' />
<circle cx='118.77' cy='212.90' r='3.02' style='stroke-width: 0.71; stroke: none; fill: #000000;' />
<circle cx='340.48' cy='17.18' r='3.02' style='stroke-width: 0.71; stroke: none; fill: #000000;' />
<circle cx='59.65' cy='251.28' r='3.02' style='stroke-width: 0.71; stroke: none; fill: #000000;' />
<circle cx='192.67' cy='151.27' r='3.02' style='stroke-width: 0.71; stroke: none; fill: #000000;' />
<rect x='45.61' y='5.48' width='308.91' height='257.51' style='stroke-width: 1.07; stroke: #333333;' />
</g>
<g clip-path='url(#cpMC4wMHwzNjAuMDB8MC4wMHwzNjAuMDA=)'>
<text x='40.68' y='261.13' text-anchor='end' style='font-size: 12.80px;fill: #4D4D4D; font-family: "Fira Sans";' textLength='13.12px' lengthAdjust='spacingAndGlyphs'>0s</text>
<text x='40.68' y='204.92' text-anchor='end' style='font-size: 12.80px;fill: #4D4D4D; font-family: "Fira Sans";' textLength='17.30px' lengthAdjust='spacingAndGlyphs'>2m</text>
<text x='40.68' y='148.72' text-anchor='end' style='font-size: 12.80px;fill: #4D4D4D; font-family: "Fira Sans";' textLength='17.78px' lengthAdjust='spacingAndGlyphs'>4m</text>
<text x='40.68' y='92.52' text-anchor='end' style='font-size: 12.80px;fill: #4D4D4D; font-family: "Fira Sans";' textLength='17.78px' lengthAdjust='spacingAndGlyphs'>6m</text>
<text x='40.68' y='36.32' text-anchor='end' style='font-size: 12.80px;fill: #4D4D4D; font-family: "Fira Sans";' textLength='18.01px' lengthAdjust='spacingAndGlyphs'>8m</text>
<polyline points='42.87,256.72 45.61,256.72 ' style='stroke-width: 1.07; stroke: #333333; stroke-linecap: butt;' />
<polyline points='42.87,200.51 45.61,200.51 ' style='stroke-width: 1.07; stroke: #333333; stroke-linecap: butt;' />
<polyline points='42.87,144.31 45.61,144.31 ' style='stroke-width: 1.07; stroke: #333333; stroke-linecap: butt;' />
<polyline points='42.87,88.11 45.61,88.11 ' style='stroke-width: 1.07; stroke: #333333; stroke-linecap: butt;' />
<polyline points='42.87,31.91 45.61,31.91 ' style='stroke-width: 1.07; stroke: #333333; stroke-linecap: butt;' />
<polyline points='81.82,265.72 81.82,262.98 ' style='stroke-width: 1.07; stroke: #333333; stroke-linecap: butt;' />
<polyline points='118.77,265.72 118.77,262.98 ' style='stroke-width: 1.07; stroke: #333333; stroke-linecap: butt;' />
<polyline points='340.48,265.72 340.48,262.98 ' style='stroke-width: 1.07; stroke: #333333; stroke-linecap: butt;' />
<polyline points='59.65,265.72 59.65,262.98 ' style='stroke-width: 1.07; stroke: #333333; stroke-linecap: butt;' />
<polyline points='192.67,265.72 192.67,262.98 ' style='stroke-width: 1.07; stroke: #333333; stroke-linecap: butt;' />
<text transform='translate(89.46,272.33) rotate(-60)' text-anchor='end' style='font-size: 12.80px;fill: #4D4D4D; font-family: "Fira Sans";' textLength='27.42px' lengthAdjust='spacingAndGlyphs'>250K</text>
<text transform='translate(126.41,272.33) rotate(-60)' text-anchor='end' style='font-size: 12.80px;fill: #4D4D4D; font-family: "Fira Sans";' textLength='28.23px' lengthAdjust='spacingAndGlyphs'>500K</text>
<text transform='translate(348.12,272.33) rotate(-60)' text-anchor='end' style='font-size: 12.80px;fill: #4D4D4D; font-family: "Fira Sans";' textLength='16.52px' lengthAdjust='spacingAndGlyphs'>2M</text>
<text transform='translate(67.29,272.33) rotate(-60)' text-anchor='end' style='font-size: 12.80px;fill: #4D4D4D; font-family: "Fira Sans";' textLength='27.37px' lengthAdjust='spacingAndGlyphs'>100K</text>
<text transform='translate(200.31,272.33) rotate(-60)' text-anchor='end' style='font-size: 12.80px;fill: #4D4D4D; font-family: "Fira Sans";' textLength='15.73px' lengthAdjust='spacingAndGlyphs'>1M</text>
<text x='200.06' y='311.91' text-anchor='middle' style='font-size: 16.00px; font-family: "Fira Sans";' textLength='112.99px' lengthAdjust='spacingAndGlyphs'># Unknowns (𝑁)</text>
<text transform='translate(16.51,134.23) rotate(-90)' text-anchor='middle' style='font-size: 16.00px; font-family: "Fira Sans";' textLength='131.35px' lengthAdjust='spacingAndGlyphs'>Computation time</text>
<rect x='124.43' y='326.28' width='151.27' height='28.24' style='stroke-width: 1.07; stroke: #666666; fill: #FFFFFF;' />
<rect x='137.88' y='331.76' width='43.20' height='17.28' style='stroke-width: 1.07; stroke: none; fill: #FFFFFF;' />
<line x1='142.20' y1='340.40' x2='176.76' y2='340.40' style='stroke-width: 1.07; stroke-linecap: butt;' />
<circle cx='159.48' cy='340.40' r='3.02' style='stroke-width: 0.71; stroke: none; fill: #000000;' />
<text x='189.05' y='345.23' style='font-size: 14.00px; font-family: "Fira Sans";' textLength='81.17px' lengthAdjust='spacingAndGlyphs'>synchronous</text>
</g>
</svg>
