<?xml version='1.0' encoding='UTF-8' ?>
<svg xmlns='http://www.w3.org/2000/svg' xmlns:xlink='http://www.w3.org/1999/xlink' class='svglite' width='360.00pt' height='360.00pt' viewBox='0 0 360.00 360.00'>
<defs>
  <style type='text/css'><![CDATA[
    .svglite line, .svglite polyline, .svglite polygon, .svglite path, .svglite rect, .svglite circle {
      fill: none;
      stroke: #000000;
      stroke-linecap: round;
      stroke-linejoin: round;
      stroke-miterlimit: 10.00;
    }
    .svglite text {
      white-space: pre;
    }
  ]]></style>
</defs>
<rect width='100%' height='100%' style='stroke: none; fill: #FFFFFF;'/>
<defs>
  <clipPath id='cpMC4wMHwzNjAuMDB8MC4wMHwzNjAuMDA='>
    <rect x='0.00' y='0.00' width='360.00' height='360.00' />
  </clipPath>
</defs>
<g clip-path='url(#cpMC4wMHwzNjAuMDB8MC4wMHwzNjAuMDA=)'>
<rect x='0.000000000000032' y='0.00' width='360.00' height='360.00' style='stroke-width: 1.07; stroke: #FFFFFF; fill: #FFFFFF;' />
</g>
<defs>
  <clipPath id='cpNDcuNDJ8MzU0LjUyfDUuNDh8MjYyLjk4'>
    <rect x='47.42' y='5.48' width='307.10' height='257.51' />
  </clipPath>
</defs>
<g clip-path='url(#cpNDcuNDJ8MzU0LjUyfDUuNDh8MjYyLjk4)'>
<rect x='47.42' y='5.48' width='307.10' height='257.51' style='stroke-width: 1.07; stroke: none; fill: #FFFFFF;' />
<polyline points='47.42,242.52 354.52,242.52 ' style='stroke-width: 0.53; stroke: #EBEBEB; stroke-linecap: butt;' />
<polyline points='47.42,217.34 354.52,217.34 ' style='stroke-width: 0.53; stroke: #EBEBEB; stroke-linecap: butt;' />
<polyline points='47.42,192.17 354.52,192.17 ' style='stroke-width: 0.53; stroke: #EBEBEB; stroke-linecap: butt;' />
<polyline points='47.42,166.99 354.52,166.99 ' style='stroke-width: 0.53; stroke: #EBEBEB; stroke-linecap: butt;' />
<polyline points='47.42,141.81 354.52,141.81 ' style='stroke-width: 0.53; stroke: #EBEBEB; stroke-linecap: butt;' />
<polyline points='47.42,116.63 354.52,116.63 ' style='stroke-width: 0.53; stroke: #EBEBEB; stroke-linecap: butt;' />
<polyline points='47.42,91.46 354.52,91.46 ' style='stroke-width: 0.53; stroke: #EBEBEB; stroke-linecap: butt;' />
<polyline points='47.42,66.28 354.52,66.28 ' style='stroke-width: 0.53; stroke: #EBEBEB; stroke-linecap: butt;' />
<polyline points='47.42,41.10 354.52,41.10 ' style='stroke-width: 0.53; stroke: #EBEBEB; stroke-linecap: butt;' />
<polyline points='47.42,15.93 354.52,15.93 ' style='stroke-width: 0.53; stroke: #EBEBEB; stroke-linecap: butt;' />
<polyline points='61.38,262.98 61.38,5.48 ' style='stroke-width: 0.53; stroke: #EBEBEB; stroke-linecap: butt;' />
<polyline points='78.83,262.98 78.83,5.48 ' style='stroke-width: 0.53; stroke: #EBEBEB; stroke-linecap: butt;' />
<polyline points='113.73,262.98 113.73,5.48 ' style='stroke-width: 0.53; stroke: #EBEBEB; stroke-linecap: butt;' />
<polyline points='235.87,262.98 235.87,5.48 ' style='stroke-width: 0.53; stroke: #EBEBEB; stroke-linecap: butt;' />
<polyline points='207.95,262.98 207.95,5.48 ' style='stroke-width: 0.53; stroke: #EBEBEB; stroke-linecap: butt;' />
<polyline points='138.16,262.98 138.16,5.48 ' style='stroke-width: 0.53; stroke: #EBEBEB; stroke-linecap: butt;' />
<polyline points='218.42,262.98 218.42,5.48 ' style='stroke-width: 0.53; stroke: #EBEBEB; stroke-linecap: butt;' />
<polyline points='47.42,255.11 354.52,255.11 ' style='stroke-width: 1.07; stroke: #EBEBEB; stroke-linecap: butt;' />
<polyline points='47.42,229.93 354.52,229.93 ' style='stroke-width: 1.07; stroke: #EBEBEB; stroke-linecap: butt;' />
<polyline points='47.42,204.75 354.52,204.75 ' style='stroke-width: 1.07; stroke: #EBEBEB; stroke-linecap: butt;' />
<polyline points='47.42,179.58 354.52,179.58 ' style='stroke-width: 1.07; stroke: #EBEBEB; stroke-linecap: butt;' />
<polyline points='47.42,154.40 354.52,154.40 ' style='stroke-width: 1.07; stroke: #EBEBEB; stroke-linecap: butt;' />
<polyline points='47.42,129.22 354.52,129.22 ' style='stroke-width: 1.07; stroke: #EBEBEB; stroke-linecap: butt;' />
<polyline points='47.42,104.05 354.52,104.05 ' style='stroke-width: 1.07; stroke: #EBEBEB; stroke-linecap: butt;' />
<polyline points='47.42,78.87 354.52,78.87 ' style='stroke-width: 1.07; stroke: #EBEBEB; stroke-linecap: butt;' />
<polyline points='47.42,53.69 354.52,53.69 ' style='stroke-width: 1.07; stroke: #EBEBEB; stroke-linecap: butt;' />
<polyline points='47.42,28.51 354.52,28.51 ' style='stroke-width: 1.07; stroke: #EBEBEB; stroke-linecap: butt;' />
<polyline points='96.28,262.98 96.28,5.48 ' style='stroke-width: 1.07; stroke: #EBEBEB; stroke-linecap: butt;' />
<polyline points='131.18,262.98 131.18,5.48 ' style='stroke-width: 1.07; stroke: #EBEBEB; stroke-linecap: butt;' />
<polyline points='340.56,262.98 340.56,5.48 ' style='stroke-width: 1.07; stroke: #EBEBEB; stroke-linecap: butt;' />
<polyline points='75.34,262.98 75.34,5.48 ' style='stroke-width: 1.07; stroke: #EBEBEB; stroke-linecap: butt;' />
<polyline points='200.97,262.98 200.97,5.48 ' style='stroke-width: 1.07; stroke: #EBEBEB; stroke-linecap: butt;' />
<polyline points='75.34,251.28 96.28,241.82 131.18,221.08 200.97,166.35 340.56,26.74 ' style='stroke-width: 1.07; stroke-linecap: butt;' />
<circle cx='96.28' cy='241.82' r='3.02' style='stroke-width: 0.71; stroke: none; fill: #000000;' />
<circle cx='131.18' cy='221.08' r='3.02' style='stroke-width: 0.71; stroke: none; fill: #000000;' />
<circle cx='340.56' cy='26.74' r='3.02' style='stroke-width: 0.71; stroke: none; fill: #000000;' />
<circle cx='75.34' cy='251.28' r='3.02' style='stroke-width: 0.71; stroke: none; fill: #000000;' />
<circle cx='200.97' cy='166.35' r='3.02' style='stroke-width: 0.71; stroke: none; fill: #000000;' />
<line x1='47.42' y1='17.18' x2='354.52' y2='17.18' style='stroke-width: 1.07; stroke-linecap: butt;' />
<text x='61.38' y='36.78' style='font-size: 14.23px; font-family: "Fira Sans";' textLength='142.94px' lengthAdjust='spacingAndGlyphs'>Physical memory limit</text>
<text x='61.38' y='36.78' style='font-size: 14.23px; font-family: "Fira Sans";' textLength='142.94px' lengthAdjust='spacingAndGlyphs'>Physical memory limit</text>
<text x='61.38' y='36.78' style='font-size: 14.23px; font-family: "Fira Sans";' textLength='142.94px' lengthAdjust='spacingAndGlyphs'>Physical memory limit</text>
<text x='61.38' y='36.78' style='font-size: 14.23px; font-family: "Fira Sans";' textLength='142.94px' lengthAdjust='spacingAndGlyphs'>Physical memory limit</text>
<text x='61.38' y='36.78' style='font-size: 14.23px; font-family: "Fira Sans";' textLength='142.94px' lengthAdjust='spacingAndGlyphs'>Physical memory limit</text>
<rect x='47.42' y='5.48' width='307.10' height='257.51' style='stroke-width: 1.07; stroke: #333333;' />
</g>
<g clip-path='url(#cpMC4wMHwzNjAuMDB8MC4wMHwzNjAuMDA=)'>
<text x='42.49' y='259.52' text-anchor='end' style='font-size: 12.80px;fill: #4D4D4D; font-family: "Fira Sans";' textLength='7.14px' lengthAdjust='spacingAndGlyphs'>0</text>
<text x='42.49' y='234.34' text-anchor='end' style='font-size: 12.80px;fill: #4D4D4D; font-family: "Fira Sans";' textLength='13.48px' lengthAdjust='spacingAndGlyphs'>20</text>
<text x='42.49' y='209.16' text-anchor='end' style='font-size: 12.80px;fill: #4D4D4D; font-family: "Fira Sans";' textLength='13.95px' lengthAdjust='spacingAndGlyphs'>40</text>
<text x='42.49' y='183.99' text-anchor='end' style='font-size: 12.80px;fill: #4D4D4D; font-family: "Fira Sans";' textLength='13.96px' lengthAdjust='spacingAndGlyphs'>60</text>
<text x='42.49' y='158.81' text-anchor='end' style='font-size: 12.80px;fill: #4D4D4D; font-family: "Fira Sans";' textLength='14.19px' lengthAdjust='spacingAndGlyphs'>80</text>
<text x='42.49' y='133.63' text-anchor='end' style='font-size: 12.80px;fill: #4D4D4D; font-family: "Fira Sans";' textLength='19.83px' lengthAdjust='spacingAndGlyphs'>100</text>
<text x='42.49' y='108.46' text-anchor='end' style='font-size: 12.80px;fill: #4D4D4D; font-family: "Fira Sans";' textLength='19.02px' lengthAdjust='spacingAndGlyphs'>120</text>
<text x='42.49' y='83.28' text-anchor='end' style='font-size: 12.80px;fill: #4D4D4D; font-family: "Fira Sans";' textLength='19.50px' lengthAdjust='spacingAndGlyphs'>140</text>
<text x='42.49' y='58.10' text-anchor='end' style='font-size: 12.80px;fill: #4D4D4D; font-family: "Fira Sans";' textLength='19.50px' lengthAdjust='spacingAndGlyphs'>160</text>
<text x='42.49' y='32.92' text-anchor='end' style='font-size: 12.80px;fill: #4D4D4D; font-family: "Fira Sans";' textLength='19.74px' lengthAdjust='spacingAndGlyphs'>180</text>
<polyline points='44.68,255.11 47.42,255.11 ' style='stroke-width: 1.07; stroke: #333333; stroke-linecap: butt;' />
<polyline points='44.68,229.93 47.42,229.93 ' style='stroke-width: 1.07; stroke: #333333; stroke-linecap: butt;' />
<polyline points='44.68,204.75 47.42,204.75 ' style='stroke-width: 1.07; stroke: #333333; stroke-linecap: butt;' />
<polyline points='44.68,179.58 47.42,179.58 ' style='stroke-width: 1.07; stroke: #333333; stroke-linecap: butt;' />
<polyline points='44.68,154.40 47.42,154.40 ' style='stroke-width: 1.07; stroke: #333333; stroke-linecap: butt;' />
<polyline points='44.68,129.22 47.42,129.22 ' style='stroke-width: 1.07; stroke: #333333; stroke-linecap: butt;' />
<polyline points='44.68,104.05 47.42,104.05 ' style='stroke-width: 1.07; stroke: #333333; stroke-linecap: butt;' />
<polyline points='44.68,78.87 47.42,78.87 ' style='stroke-width: 1.07; stroke: #333333; stroke-linecap: butt;' />
<polyline points='44.68,53.69 47.42,53.69 ' style='stroke-width: 1.07; stroke: #333333; stroke-linecap: butt;' />
<polyline points='44.68,28.51 47.42,28.51 ' style='stroke-width: 1.07; stroke: #333333; stroke-linecap: butt;' />
<polyline points='96.28,265.72 96.28,262.98 ' style='stroke-width: 1.07; stroke: #333333; stroke-linecap: butt;' />
<polyline points='131.18,265.72 131.18,262.98 ' style='stroke-width: 1.07; stroke: #333333; stroke-linecap: butt;' />
<polyline points='340.56,265.72 340.56,262.98 ' style='stroke-width: 1.07; stroke: #333333; stroke-linecap: butt;' />
<polyline points='75.34,265.72 75.34,262.98 ' style='stroke-width: 1.07; stroke: #333333; stroke-linecap: butt;' />
<polyline points='200.97,265.72 200.97,262.98 ' style='stroke-width: 1.07; stroke: #333333; stroke-linecap: butt;' />
<text transform='translate(103.92,272.33) rotate(-60)' text-anchor='end' style='font-size: 12.80px;fill: #4D4D4D; font-family: "Fira Sans";' textLength='27.42px' lengthAdjust='spacingAndGlyphs'>250K</text>
<text transform='translate(138.81,272.33) rotate(-60)' text-anchor='end' style='font-size: 12.80px;fill: #4D4D4D; font-family: "Fira Sans";' textLength='28.23px' lengthAdjust='spacingAndGlyphs'>500K</text>
<text transform='translate(348.20,272.33) rotate(-60)' text-anchor='end' style='font-size: 12.80px;fill: #4D4D4D; font-family: "Fira Sans";' textLength='16.52px' lengthAdjust='spacingAndGlyphs'>2M</text>
<text transform='translate(82.98,272.33) rotate(-60)' text-anchor='end' style='font-size: 12.80px;fill: #4D4D4D; font-family: "Fira Sans";' textLength='27.37px' lengthAdjust='spacingAndGlyphs'>100K</text>
<text transform='translate(208.61,272.33) rotate(-60)' text-anchor='end' style='font-size: 12.80px;fill: #4D4D4D; font-family: "Fira Sans";' textLength='15.73px' lengthAdjust='spacingAndGlyphs'>1M</text>
<text x='200.97' y='311.91' text-anchor='middle' style='font-size: 16.00px; font-family: "Fira Sans";' textLength='112.99px' lengthAdjust='spacingAndGlyphs'># Unknowns (𝑁)</text>
<text transform='translate(16.51,134.23) rotate(-90)' text-anchor='middle' style='font-size: 16.00px; font-family: "Fira Sans";' textLength='156.76px' lengthAdjust='spacingAndGlyphs'>RAM usage peak [GiB]</text>
<rect x='125.34' y='326.28' width='151.27' height='28.24' style='stroke-width: 1.07; stroke: #666666; fill: #FFFFFF;' />
<rect x='138.79' y='331.76' width='43.20' height='17.28' style='stroke-width: 1.07; stroke: none; fill: #FFFFFF;' />
<line x1='143.11' y1='340.40' x2='177.67' y2='340.40' style='stroke-width: 1.07; stroke-linecap: butt;' />
<circle cx='160.39' cy='340.40' r='3.02' style='stroke-width: 0.71; stroke: none; fill: #000000;' />
<text x='189.96' y='345.23' style='font-size: 14.00px; font-family: "Fira Sans";' textLength='81.17px' lengthAdjust='spacingAndGlyphs'>synchronous</text>
</g>
</svg>
