<?xml version="1.0" encoding="UTF-8" standalone="no"?>
<!-- Created with Inkscape (http://www.inkscape.org/) -->

<svg
   width="68.554634mm"
   height="84.51268mm"
   viewBox="0 0 68.554634 84.51268"
   version="1.1"
   id="svg8"
   inkscape:version="1.1.2 (0a00cf5339, 2022-02-04)"
   sodipodi:docname="black-box-compression.svg"
   xmlns:inkscape="http://www.inkscape.org/namespaces/inkscape"
   xmlns:sodipodi="http://sodipodi.sourceforge.net/DTD/sodipodi-0.dtd"
   xmlns="http://www.w3.org/2000/svg"
   xmlns:svg="http://www.w3.org/2000/svg"
   xmlns:rdf="http://www.w3.org/1999/02/22-rdf-syntax-ns#"
   xmlns:cc="http://creativecommons.org/ns#"
   xmlns:dc="http://purl.org/dc/elements/1.1/">
  <defs
     id="defs2">
    <inkscape:path-effect
       effect="perspective-envelope"
       up_left_point="85.01,72.519685"
       up_right_point="98.64,76.139685"
       down_left_point="84.11,97.639685"
       down_right_point="97.74,102.93969"
       id="path-effect5193"
       is_visible="true"
       deform_type="perspective"
       horizontal_mirror="false"
       vertical_mirror="false"
       overflow_perspective="false" />
    <inkscape:path-effect
       overflow_perspective="false"
       vertical_mirror="false"
       horizontal_mirror="false"
       deform_type="perspective"
       is_visible="true"
       id="path-effect5181"
       down_right_point="95,102.93969"
       down_left_point="82,97.639685"
       up_right_point="99,76.139685"
       up_left_point="85.01,75.519685"
       effect="perspective-envelope" />
    <inkscape:path-effect
       overflow_perspective="true"
       vertical_mirror="false"
       horizontal_mirror="false"
       deform_type="perspective"
       is_visible="true"
       id="path-effect5169"
       down_right_point="97.74,102.93969"
       down_left_point="84.11,97.639685"
       up_right_point="98.64,76.139685"
       up_left_point="85.01,72.519685"
       effect="perspective-envelope" />
    <inkscape:path-effect
       overflow_perspective="false"
       vertical_mirror="false"
       horizontal_mirror="false"
       deform_type="perspective"
       is_visible="true"
       id="path-effect5157"
       down_right_point="106.1,97.719685"
       down_left_point="81.61,107.36969"
       up_right_point="98.84,68.419685"
       up_left_point="85.31069,76.909685"
       effect="perspective-envelope" />
    <inkscape:path-effect
       effect="perspective-envelope"
       up_left_point="85.01,72.519685"
       up_right_point="98.64,76.139685"
       down_left_point="84.11,97.639685"
       down_right_point="97.74,102.93969"
       id="path-effect5145"
       is_visible="true"
       deform_type="perspective"
       horizontal_mirror="false"
       vertical_mirror="false"
       overflow_perspective="false" />
    <filter
       inkscape:collect="always"
       style="color-interpolation-filters:sRGB"
       id="filter1410"
       x="-0.053236663"
       width="1.1064733"
       y="-0.025767942"
       height="1.0515359">
      <feGaussianBlur
         inkscape:collect="always"
         stdDeviation="0.27270085"
         id="feGaussianBlur1412" />
    </filter>
  </defs>
  <sodipodi:namedview
     id="base"
     pagecolor="#ffffff"
     bordercolor="#666666"
     borderopacity="1.0"
     inkscape:pageopacity="0.0"
     inkscape:pageshadow="2"
     inkscape:zoom="1.979899"
     inkscape:cx="211.62696"
     inkscape:cy="191.92898"
     inkscape:document-units="mm"
     inkscape:current-layer="layer1"
     showgrid="false"
     showguides="true"
     inkscape:guide-bbox="true"
     inkscape:window-width="1920"
     inkscape:window-height="1029"
     inkscape:window-x="1080"
     inkscape:window-y="0"
     inkscape:window-maximized="1"
     fit-margin-top="0"
     fit-margin-left="0"
     fit-margin-right="0"
     fit-margin-bottom="0"
     inkscape:pagecheckerboard="0">
    <sodipodi:guide
       position="34.344137,79.512679"
       orientation="0,1"
       id="guide40"
       inkscape:locked="false" />
    <sodipodi:guide
       position="34.344137,-1.5365419e-06"
       orientation="0,1"
       id="guide42"
       inkscape:locked="false" />
    <sodipodi:guide
       position="34.344137,79.512689"
       orientation="1,0"
       id="guide44"
       inkscape:locked="false" />
    <sodipodi:guide
       position="68.554637,59.601099"
       orientation="1,0"
       id="guide46"
       inkscape:locked="false" />
    <sodipodi:guide
       position="8.0749881e-07,59.601099"
       orientation="1,0"
       id="guide48"
       inkscape:locked="false" />
    <sodipodi:guide
       position="68.554637,59.601109"
       orientation="0,1"
       id="guide50"
       inkscape:locked="false" />
    <sodipodi:guide
       position="68.554637,19.911579"
       orientation="0,1"
       id="guide52"
       inkscape:locked="false" />
    <sodipodi:guide
       position="34.344137,39.689519"
       orientation="0,1"
       id="guide57"
       inkscape:locked="false" />
  </sodipodi:namedview>
  <metadata
     id="metadata5">
    <rdf:RDF>
      <cc:Work
         rdf:about="">
        <dc:format>image/svg+xml</dc:format>
        <dc:type
           rdf:resource="http://purl.org/dc/dcmitype/StillImage" />
      </cc:Work>
    </rdf:RDF>
  </metadata>
  <g
     inkscape:label="Calque 1"
     inkscape:groupmode="layer"
     id="layer1"
     transform="translate(-73.365483,-28.472242)">
    <path
       style="fill:#4d4d4d;fill-opacity:1;stroke:none;stroke-width:0.26458332px;stroke-linecap:butt;stroke-linejoin:miter;stroke-opacity:1"
       d="M 107.70962,33.472241 73.365483,53.38382 107.70962,73.295401 141.92012,53.383809 Z"
       id="path59"
       inkscape:connector-curvature="0" />
    <path
       style="fill:#333333;fill-opacity:1;stroke:none;stroke-width:0.26458332px;stroke-linecap:butt;stroke-linejoin:miter;stroke-opacity:1"
       d="M 73.365483,53.383809 V 93.073341 L 107.70962,112.98492 V 73.295401 Z"
       id="path61"
       inkscape:connector-curvature="0" />
    <path
       style="fill:#1a1a1a;fill-opacity:1;stroke:none;stroke-width:0.26458332px;stroke-linecap:butt;stroke-linejoin:miter;stroke-opacity:1"
       d="m 141.92012,53.383809 v 39.689532 l -34.2105,19.911579 V 73.295401 Z"
       id="path63"
       inkscape:connector-curvature="0" />
    <g
       id="g1418"
       transform="matrix(0.90080622,0,0,0.90080622,6.5309429,3.8478935)"
       inkscape:path-effect="#path-effect5145">
      <g
         aria-label="?"
         style="font-style:normal;font-variant:normal;font-weight:normal;font-stretch:normal;font-size:4.23333311px;line-height:1.25;font-family:sans-serif;-inkscape-font-specification:sans-serif;letter-spacing:0px;word-spacing:0px;opacity:0.6;fill:#000000;fill-opacity:1;stroke:none;stroke-width:0.26458332;stroke-opacity:1;filter:url(#filter1410)"
         id="text968">
        <path
           d="m 93.03562,94.711819 c 0,0 -2.972555,-1.067269 -2.972555,-1.067269 0.01338,-0.605947 0.02236,-0.974648 0.02695,-1.106221 0.04742,-1.35925 0.243613,-2.423138 0.5893,-3.193663 0.346616,-0.772599 1.015929,-1.552755 2.013659,-2.343999 1.006382,-0.798106 1.614123,-1.342324 1.816916,-1.627807 0.313759,-0.454535 0.482185,-1.01171 0.504672,-1.670547 0.03125,-0.915437 -0.205658,-1.77498 -0.708786,-2.575782 -0.492305,-0.805545 -1.174098,-1.333161 -2.041922,-1.584323 -0.829938,-0.240197 -1.530823,-0.106434 -2.105323,0.398005 -0.57165,0.501935 -0.982475,1.399979 -1.234316,2.694544 0,0 -2.8656,-1.403909 -2.8656,-1.403909 0.14906,-1.890791 0.767472,-3.354485 1.863061,-4.398336 1.113718,-1.051852 2.550535,-1.342725 4.324277,-0.858929 1.898598,0.51785 3.408942,1.645298 4.514762,3.389808 1.118536,1.75267 1.65053,3.588168 1.586572,5.492684 -0.03542,1.054793 -0.287231,1.984453 -0.754135,2.786501 -0.457038,0.801762 -1.41079,1.778599 -2.849209,2.92211 -0.737439,0.58631 -1.200063,1.098747 -1.391137,1.53959 -0.182912,0.442951 -0.288574,1.311796 -0.317187,2.607542 0,0 3e-6,1e-6 3e-6,1e-6 z m -3.189716,5.158264 c 0,0 0.161477,-4.629178 0.161477,-4.629178 0,0 3.280338,1.20283 3.280338,1.20283 0,0 -0.161473,4.701905 -0.161473,4.701905 0,0 -3.280342,-1.275557 -3.280342,-1.275557 z"
           style="font-style:normal;font-variant:normal;font-weight:bold;font-stretch:normal;font-size:35.27777863px;font-family:Arial;-inkscape-font-specification:'Arial Bold';fill:#000000;stroke:none;stroke-width:0.26458332;stroke-opacity:1"
           id="path5139"
           inkscape:original-d="m 95.233857,92.826835 h -4.392496 q -0.01723,-0.947401 -0.01723,-1.154107 0,-2.135959 0.706245,-3.513997 0.706244,-1.378038 2.824978,-3.100586 2.118734,-1.722548 2.532145,-2.256538 0.637343,-0.844048 0.637343,-1.860351 0,-1.412489 -1.136882,-2.411567 -1.119656,-1.016303 -3.031684,-1.016303 -1.843126,0 -3.08336,1.050754 -1.240235,1.050754 -1.705323,3.203939 L 84.12342,81.216863 q 0.18948,-3.08336 2.618273,-5.236545 2.446018,-2.153185 6.407878,-2.153185 4.168565,0 6.631809,2.187636 2.46325,2.17041 2.46325,5.064291 0,1.601969 -0.91295,3.031684 -0.89573,1.429714 -3.858515,3.892958 -1.533067,1.274685 -1.912028,2.049832 -0.361735,0.775146 -0.327284,2.773301 z m -4.392496,6.511231 v -4.840359 h 4.840359 v 4.840359 z"
           inkscape:connector-curvature="0" />
      </g>
      <g
         aria-label="?"
         style="font-style:normal;font-variant:normal;font-weight:normal;font-stretch:normal;font-size:4.23333311px;line-height:1.25;font-family:sans-serif;-inkscape-font-specification:sans-serif;letter-spacing:0px;word-spacing:0px;fill:#ffffff;fill-opacity:1;stroke:none;stroke-width:0.26458332;stroke-opacity:1"
         id="text872">
        <path
           d="m 91.645727,92.666781 c 0,0 -2.933013,-1.031812 -2.933013,-1.031812 0.01346,-0.601515 0.02249,-0.967527 0.02708,-1.098153 0.04739,-1.349474 0.241484,-2.407158 0.582988,-3.175031 0.342416,-0.769924 1.003288,-1.550241 1.988223,-2.344484 0.993417,-0.801081 1.593328,-1.346599 1.79355,-1.63172 0.309781,-0.453871 0.476208,-1.008295 0.498689,-1.662305 0.03123,-0.908732 -0.202128,-1.759631 -0.698205,-2.549908 -0.485415,-0.795107 -1.157951,-1.312755 -2.014222,-1.554425 -0.818935,-0.231133 -1.510708,-0.09224 -2.077934,0.413462 -0.56443,0.50321 -0.970309,1.398186 -1.219445,2.685351 0,0 -2.828133,-1.368238 -2.828133,-1.368238 0.14796,-1.878231 0.759081,-3.336577 1.841041,-4.38226 1.099787,-1.053713 2.518062,-1.354826 4.268369,-0.889961 1.873291,0.497529 3.363021,1.603314 4.45324,3.32485 1.102675,1.729388 1.626641,3.54602 1.56269,5.43637 -0.03542,1.046945 -0.28424,1.971665 -0.745195,2.771707 -0.451228,0.799692 -1.392584,1.77763 -2.812265,2.925427 -0.72788,0.588547 -1.184588,1.101297 -1.373322,1.540528 -0.180684,0.441254 -0.28533,1.304456 -0.314134,2.590601 0,0 2e-6,10e-7 2e-6,10e-7 z m -3.15004,5.148874 c 0,0 0.161376,-4.595823 0.161376,-4.595823 0,0 3.236659,1.163327 3.236659,1.163327 0,0 -0.161403,4.667497 -0.161403,4.667497 0,0 -3.236632,-1.235001 -3.236632,-1.235001 z"
           style="font-style:normal;font-variant:normal;font-weight:bold;font-stretch:normal;font-size:35.27777863px;font-family:Arial;-inkscape-font-specification:'Arial Bold';fill:#ffffff;stroke:none;stroke-width:0.26458332;stroke-opacity:1"
           id="path5142"
           inkscape:original-d="m 93.117189,91.239334 h -4.392497 q -0.01723,-0.947401 -0.01723,-1.154107 0,-2.135959 0.706245,-3.513998 0.706245,-1.378038 2.824978,-3.100586 2.118734,-1.722547 2.532146,-2.256537 0.637342,-0.844049 0.637342,-1.860352 0,-1.412489 -1.136881,-2.411567 -1.119656,-1.016303 -3.031684,-1.016303 -1.843127,0 -3.083361,1.050754 -1.240234,1.050754 -1.705322,3.203939 l -4.444174,-0.551215 q 0.189481,-3.083361 2.618273,-5.236545 2.446018,-2.153185 6.407878,-2.153185 4.168565,0 6.631809,2.187636 2.463249,2.17041 2.463249,5.06429 0,1.601969 -0.912956,3.031684 -0.895725,1.429715 -3.858507,3.892958 -1.533068,1.274686 -1.912028,2.049832 -0.361735,0.775147 -0.327284,2.773302 z m -4.392497,6.511231 v -4.84036 h 4.840359 v 4.84036 z"
           inkscape:connector-curvature="0" />
      </g>
    </g>
    <g
       id="g833"
       transform="matrix(0.03125,0,0,0.03125,92.709619,28.472242)">
      <path
         inkscape:connector-curvature="0"
         style="fill:#bfbf00"
         d="m 500,160 v 20 h -20 v 20 h -20 v 20 20 20 20 20 20 20 20 20 20 20 20 20 20 20 20 20 20 20 20 20 20 h 20 v -20 h 20 v -20 h 20 V 580 560 540 520 500 480 460 440 420 400 380 360 340 320 300 280 260 240 220 200 180 160 Z M 60,260 v 20 20 20 20 20 20 20 h 20 v -20 h 20 v -20 -20 -20 -20 h 20 20 20 20 20 20 20 20 20 20 20 20 20 v -20 h 20 V 260 H 360 340 320 300 280 260 240 220 200 180 160 140 120 100 80 Z m 0,200 v 20 20 20 20 20 20 20 h 20 v -20 h 20 v -20 -20 -20 -20 h 20 20 20 20 20 20 20 20 20 20 20 20 20 v -20 h 20 V 460 H 360 340 320 300 280 260 240 220 200 180 160 140 120 100 80 Z"
         id="rect2126" />
      <path
         inkscape:connector-curvature="0"
         style="fill:#ffff00"
         d="m 60,140 v 20 H 40 v 20 H 20 v 20 h 20 20 20 20 20 20 20 20 20 20 20 20 20 20 20 20 20 20 20 20 20 20 v -20 h 20 v -20 h 20 V 140 H 480 460 440 420 400 380 360 340 320 300 280 260 240 220 200 180 160 140 120 100 80 Z m -40,80 v 20 20 20 20 20 20 20 20 20 20 20 20 20 20 20 20 20 20 20 20 20 20 h 20 20 20 20 20 20 20 20 20 20 20 20 20 20 20 20 20 20 20 20 20 V 640 620 600 580 560 540 520 500 480 460 440 420 400 380 360 340 320 300 280 260 240 220 H 420 400 380 360 340 320 300 280 260 240 220 200 180 160 140 120 100 80 60 40 Z m 40,40 h 20 20 20 20 20 20 20 20 20 20 20 20 20 20 20 20 20 v 20 20 20 20 20 20 20 20 H 380 360 340 320 300 280 260 240 220 200 180 160 140 120 100 80 60 v -20 -20 -20 -20 -20 -20 -20 z m 80,60 v 20 20 20 h 20 20 20 20 20 20 20 20 20 20 20 v -20 -20 -20 h -20 -20 -20 v 20 20 H 280 260 240 220 200 180 160 V 340 320 Z M 60,460 h 20 20 20 20 20 20 20 20 20 20 20 20 20 20 20 20 20 v 20 20 20 20 20 20 20 20 H 380 360 340 320 300 280 260 240 220 200 180 160 140 120 100 80 60 v -20 -20 -20 -20 -20 -20 -20 z m 80,60 v 20 20 20 h 20 20 20 20 20 20 20 20 20 20 20 v -20 -20 -20 h -20 -20 -20 v 20 20 h -20 -20 -20 -20 -20 -20 -20 v -20 -20 z"
         id="rect2200" />
      <path
         inkscape:connector-curvature="0"
         style="fill:#ffffff"
         d="m 700,80 v 20 20 20 20 20 h 20 V 160 140 120 100 80 Z M 100,300 v 20 20 20 20 h 20 20 v -20 -20 -20 h 20 20 20 20 20 20 20 20 20 20 20 v -20 h -20 -20 -20 -20 -20 -20 -20 -20 -20 -20 -20 -20 z m 0,200 v 20 20 20 20 h 20 20 v -20 -20 -20 h 20 20 20 20 20 20 20 20 20 20 20 v -20 h -20 -20 -20 -20 -20 -20 -20 -20 -20 -20 -20 -20 z m 340,340 v 20 20 20 h 20 20 v -20 -20 -20 h -20 z m 460,0 v 20 20 20 h 20 20 v -20 -20 -20 h -20 z"
         id="rect2834" />
      <path
         inkscape:connector-curvature="0"
         style="fill:#808080"
         d="m 280,20 v 20 20 20 h 20 20 20 20 20 20 20 20 20 20 20 20 20 V 60 40 20 h -20 -20 -20 -20 -20 -20 -20 -20 -20 -20 -20 -20 z m 480,60 v 20 20 20 20 20 h 20 20 V 160 140 120 100 80 h -20 z m 60,0 v 20 20 20 20 20 h 20 V 160 140 120 100 80 Z M 680,200 v 20 20 h 20 v -20 -20 z m 60,0 v 20 h 20 v -20 z m 0,60 v 20 20 20 h 20 20 v -20 -20 -20 h -20 z m -380,20 v 20 20 20 20 20 H 340 320 300 280 260 240 220 200 180 160 140 120 100 80 v 20 h 20 20 20 20 20 20 20 20 20 20 20 20 20 20 20 v -20 -20 -20 -20 -20 -20 z m 320,0 v 20 20 20 h 20 v -20 -20 -20 z m -520,60 v 20 h 20 20 20 20 20 20 20 v -20 h -20 -20 -20 -20 -20 -20 z m 580,20 v 20 20 20 h 20 20 v -20 -20 -20 h -20 z m -60,20 v 20 20 20 h 20 v -20 -20 -20 z m 60,80 v 20 20 20 h 20 20 v -20 -20 -20 h -20 z m -380,20 v 20 20 20 20 20 H 340 320 300 280 260 240 220 200 180 160 140 120 100 80 v 20 h 20 20 20 20 20 20 20 20 20 20 20 20 20 20 20 v -20 -20 -20 -20 -20 -20 z m 320,0 v 20 20 20 h 20 v -20 -20 -20 z m -520,60 v 20 h 20 20 20 20 20 20 20 v -20 h -20 -20 -20 -20 -20 -20 z m 580,20 v 20 20 h 20 v -20 -20 z m -60,20 v 20 h 20 v -20 z m 80,40 v 20 20 20 20 20 h 20 20 v -20 -20 -20 -20 -20 h -20 z m 60,0 v 20 20 20 20 20 h 20 V 700 680 660 640 620 Z M 240,720 v 20 20 20 h 20 20 20 20 20 20 20 20 20 20 20 20 20 20 v -20 -20 -20 h -20 -20 -20 -20 -20 -20 -20 -20 -20 -20 -20 -20 -20 z m 440,20 v 20 20 20 h 20 20 v -20 -20 -20 h -20 z m 80,80 v 20 20 20 20 20 20 h 20 20 v -20 -20 -20 -20 -20 -20 h -20 z"
         id="rect2916" />
      <path
         inkscape:connector-curvature="0"
         style="fill:#c0c0c0"
         d="m 200,20 v 20 h -20 v 20 h -20 v 20 h 20 20 20 20 20 20 V 60 40 20 h -20 -20 -20 z m 340,0 v 20 20 20 20 h 20 v 20 h 20 v 20 h 20 v 20 h 20 v 20 h 20 20 20 20 V 160 140 120 100 80 H 680 660 640 620 V 60 H 600 V 40 H 580 V 20 h -20 z m 180,60 v 20 20 20 20 20 h 20 20 V 160 140 120 100 80 h -20 z m 80,0 v 20 20 20 20 20 h 20 V 160 140 120 100 80 Z M 660,200 v 20 20 h 20 v -20 -20 z m 40,0 v 20 20 h 20 20 v -20 -20 h -20 z m 100,40 v 20 h 20 v -20 z m -180,20 v 20 h 20 v -20 z m 40,20 v 20 20 20 h 20 v -20 -20 -20 z m 40,0 v 20 20 20 h 20 20 v -20 -20 -20 h -20 z m 100,60 v 20 h 20 v -20 z m -180,20 v 20 h 20 v -20 z m 20,20 v 20 h 20 v 20 20 h 20 v -20 -20 -20 h -20 z m 60,0 v 20 20 20 h 20 20 v -20 -20 -20 h -20 z m 100,60 v 20 h 20 v -20 z m -180,20 v 20 h 20 v -20 z m 20,20 v 20 h 20 v 20 20 h 20 v -20 -20 -20 h -20 z m 60,0 v 20 20 20 h 20 20 v -20 -20 -20 h -20 z m 100,60 v 20 h 20 v -20 z m -180,20 v 20 h 20 v -20 z m 20,20 v 20 h 20 v -20 z m 60,0 v 20 h 20 20 v -20 h -20 z m -100,40 v 20 h -20 v 20 h -20 v 20 h -20 v 20 h -20 v 20 20 20 20 h 20 20 v -20 h 20 v -20 h 20 v -20 h 20 20 20 20 20 20 20 20 v -20 -20 -20 -20 -20 h -20 -20 -20 -20 -20 -20 -20 z m 200,0 v 20 20 20 20 20 h 20 V 700 680 660 640 620 Z M 160,720 v 20 h 20 v 20 h 20 v 20 h 20 20 v -20 -20 -20 h -20 -20 -20 z m 560,20 v 20 20 20 h 20 20 v -20 -20 -20 h -20 z m -80,80 v 20 h -20 v 20 20 20 20 h 20 v 20 h 20 20 20 20 20 20 v -20 -20 -20 -20 -20 -20 h -20 -20 -20 -20 -20 z m 160,20 v 20 20 20 20 h 20 v -20 -20 -20 -20 z m -300,40 v 20 h 20 20 20 20 20 v -20 h -20 -20 -20 -20 z m 340,0 v 20 h 20 20 v -20 h -20 z m -400,20 v 20 20 h 20 20 v -20 -20 h -20 z m 460,0 v 20 20 h 20 20 v -20 -20 h -20 z"
         id="rect2924" />
      <path
         inkscape:connector-curvature="0"
         style="fill:#000000"
         d="m 200,0 v 20 h 20 20 20 20 20 20 20 20 20 20 20 20 20 20 20 20 20 20 20 V 0 h -20 -20 -20 -20 -20 -20 -20 -20 -20 -20 -20 -20 -20 -20 -20 -20 -20 -20 z m 380,20 v 20 h 20 V 20 Z m 20,20 v 20 h 20 V 40 Z m 20,20 v 20 h 20 20 20 20 20 20 20 20 20 20 20 V 60 h -20 -20 -20 -20 -20 -20 -20 -20 -20 -20 z m 220,20 v 20 20 20 20 20 h 20 V 160 140 120 100 80 Z m 0,100 h -20 -20 -20 -20 -20 -20 -20 -20 -20 -20 -20 v 20 h 20 20 20 20 20 20 20 v 20 h -20 v 20 h -20 -20 -20 -20 -20 -20 v 20 h 20 v 20 h 20 20 20 20 20 v -20 h 20 20 20 v -20 h 20 v -20 h -20 -20 v -20 h 20 20 20 z m -220,0 v -20 h -20 v 20 z m -20,-20 v -20 h -20 v 20 z m -20,-20 v -20 h -20 v 20 z m -20,-20 v -20 h -20 v 20 z m -20,0 H 520 500 480 460 440 420 400 380 360 340 320 300 280 260 240 220 200 180 160 140 120 100 80 60 v 20 h 20 20 20 20 20 20 20 20 20 20 20 20 20 20 20 20 20 20 20 20 20 20 v 20 h 20 v 20 20 20 20 20 20 20 20 20 20 20 20 20 20 20 20 20 20 20 20 20 20 h 20 v -20 -20 -20 -20 -20 -20 -20 -20 -20 -20 -20 -20 -20 -20 -20 -20 -20 -20 -20 -20 -20 -20 -20 z m -20,480 h -20 v 20 h 20 z m -20,20 h -20 v 20 h 20 z m -20,20 H 460 V 620 600 580 560 540 520 500 480 460 440 420 400 380 360 340 320 300 280 260 240 220 200 H 440 420 400 380 360 340 320 300 280 260 240 220 200 180 160 140 120 100 80 60 40 20 V 180 H 0 v 20 20 20 20 20 20 20 20 20 20 20 20 20 20 20 20 20 20 20 20 20 20 20 20 20 h 20 20 20 20 20 20 20 20 20 20 20 20 20 20 20 20 20 20 20 20 20 20 20 v -20 h 20 z M 20,180 H 40 V 160 H 20 Z M 40,160 H 60 V 140 H 40 Z m 420,40 h 20 v -20 h -20 z m 20,-20 h 20 v -20 h -20 z m 60,-80 V 80 H 520 500 480 460 440 420 400 380 360 340 320 300 280 260 240 220 200 180 160 V 60 h -20 v 20 20 h 20 20 20 20 20 20 20 20 20 20 20 20 20 20 20 20 20 20 20 z M 160,60 h 20 V 40 h -20 z m 20,-20 h 20 V 20 H 180 Z M 20,220 h 20 20 20 20 20 20 20 20 20 20 20 20 20 20 20 20 20 20 20 20 20 v 20 20 20 20 20 20 20 20 20 20 20 20 20 20 20 20 20 20 20 20 20 20 H 420 400 380 360 340 320 300 280 260 240 220 200 180 160 140 120 100 80 60 40 20 v -20 -20 -20 -20 -20 -20 -20 -20 -20 -20 -20 -20 -20 -20 -20 -20 -20 -20 -20 -20 -20 z m 360,40 v 20 20 20 20 20 20 20 H 360 340 320 300 280 260 240 220 200 180 160 140 120 100 80 60 v 20 h 20 20 20 20 20 20 20 20 20 20 20 20 20 20 20 20 20 v -20 -20 -20 -20 -20 -20 -20 -20 z m -220,60 v 20 h 20 20 20 20 20 20 20 v -20 h -20 -20 -20 -20 -20 -20 z m 580,0 v 20 h -20 -20 -20 -20 -20 -20 v 20 h 20 v 20 h 20 20 20 20 20 v -20 h 20 20 20 v -20 h 20 v -20 h -20 -20 -20 z m 0,100 v 20 h -20 -20 -20 -20 -20 -20 v 20 h 20 v 20 h 20 20 20 20 20 v -20 h 20 20 20 v -20 h 20 v -20 h -20 -20 -20 z m -360,40 v 20 20 20 20 20 20 20 H 360 340 320 300 280 260 240 220 200 180 160 140 120 100 80 60 v 20 h 20 20 20 20 20 20 20 20 20 20 20 20 20 20 20 20 20 v -20 -20 -20 -20 -20 -20 -20 -20 z m -220,60 v 20 h 20 20 20 20 20 20 20 v -20 h -20 -20 -20 -20 -20 -20 z m 580,0 v 20 h -20 -20 -20 -20 -20 -20 v 20 h 20 v 20 h 20 v 20 h -20 -20 -20 v 20 h 20 20 20 20 20 20 20 20 20 20 20 20 v -20 h -20 -20 -20 v -20 -20 h 20 v -20 h 20 v -20 h -20 -20 -20 z m 100,100 v 20 20 20 20 20 h 20 v -20 -20 -20 -20 -20 z m 0,100 h -20 -20 -20 -20 -20 -20 -20 -20 -20 -20 -20 -20 v 20 h 20 20 20 v 20 20 20 h -20 v 20 h 20 20 20 20 20 20 20 20 v -20 h -20 v -20 -20 -20 h 20 20 20 z m -40,100 v 20 h 20 v -20 z m 20,20 v 20 20 20 20 h 20 20 20 v 20 h 20 v -20 -20 -20 -20 -20 h -20 v 20 h -20 -20 v -20 z m 80,0 h 20 20 v -20 h -20 -20 z m 40,0 v 20 20 20 20 20 h 20 v -20 -20 -20 -20 -20 z m 0,100 h -20 -20 v 20 h 20 20 z M 820,920 h -20 v 20 h 20 z m -20,20 h -20 -20 -20 -20 -20 -20 -20 -20 v 20 h 20 20 20 20 20 20 20 20 z m -160,0 v -20 h -20 v 20 z m -20,-20 v -20 -20 -20 -20 h -20 v 20 h -20 -20 -20 -20 -20 v -20 h -20 v 20 20 20 20 20 h 20 v -20 h 20 20 20 20 20 z m -140,20 h -20 -20 v 20 h 20 20 z m -40,0 v -20 -20 -20 -20 -20 h -20 v 20 20 20 20 20 z m 0,-100 h 20 20 v -20 h -20 -20 z m 180,0 h 20 V 820 H 620 Z M 600,740 h -20 v 20 h 20 z m -20,20 h -20 v 20 h 20 z m -20,20 h -20 -20 -20 -20 -20 -20 -20 -20 -20 -20 -20 -20 -20 -20 -20 -20 -20 -20 v 20 h 20 20 20 20 20 20 20 20 20 20 20 20 20 20 20 20 20 20 z m -360,0 v -20 h -20 v 20 z m -20,-20 v -20 h -20 v 20 z m -20,-20 v -20 h 20 20 20 20 20 20 20 20 20 20 20 20 20 20 20 20 20 20 v -20 h -20 -20 -20 -20 -20 -20 -20 -20 -20 -20 -20 -20 -20 -20 -20 -20 -20 -20 -20 v 20 20 z m 360,-40 h 20 v -20 h -20 z m 20,-20 h 20 v -20 h -20 z m 20,-20 h 20 v -20 h -20 z m 20,-20 h 20 v -20 h -20 z m 160,-80 h 20 v 20 20 h -20 -20 -20 -20 v -20 h 20 20 20 z m -60,180 h 20 20 20 20 v 20 20 20 H 740 720 700 680 V 780 760 Z M 500,880 h 20 20 20 20 20 v 20 h -20 -20 -20 -20 -20 z m 340,0 h 20 20 v 20 h -20 -20 z"
         id="rect2950" />
    </g>
    <g
       aria-label="low-rank"
       id="text861"
       style="font-size:4.23333px;line-height:1.25;-inkscape-font-specification:sans-serif;letter-spacing:0px;word-spacing:0px;fill:#ffffff;stroke-width:0.264583">
      <path
         d="m 89.999652,65.945488 1.269173,-6.060614 h 1.182358 l -1.26504,6.060614 z"
         style="font-style:italic;font-weight:bold;font-size:8.46667px;font-family:Arial;-inkscape-font-specification:'Arial Bold Italic'"
         id="path4367" />
      <path
         d="m 92.533865,64.122343 q 0,-1.219565 0.686263,-1.943035 0.690398,-0.727604 1.810743,-0.727604 0.971517,0 1.517221,0.537435 0.545703,0.533301 0.545703,1.438672 0,1.066602 -0.682129,1.843816 -0.682129,0.777214 -1.827279,0.777214 -0.620118,0 -1.099675,-0.248047 -0.479558,-0.248047 -0.715202,-0.7028 -0.235645,-0.454753 -0.235645,-0.975651 z m 3.381707,-0.847494 q 0,-0.42168 -0.248047,-0.673861 -0.243913,-0.256315 -0.63252,-0.256315 -0.384473,0 -0.682129,0.239778 -0.297656,0.235645 -0.463021,0.690398 -0.165365,0.450619 -0.165365,0.830957 0,0.47129 0.256316,0.748275 0.256315,0.276986 0.644922,0.276986 0.487825,0 0.818555,-0.417546 0.471289,-0.591178 0.471289,-1.438672 z"
         style="font-style:italic;font-weight:bold;font-size:8.46667px;font-family:Arial;-inkscape-font-specification:'Arial Bold Italic'"
         id="path4369" />
      <path
         d="m 102.12088,65.945488 h -1.11621 l -0.21497,-2.794663 -1.339458,2.794663 h -1.099675 l -0.549838,-4.390431 h 1.0542 l 0.305924,2.94349 1.368397,-2.94349 h 1.079 l 0.14883,2.94349 1.36012,-2.94349 h 1.19063 z"
         style="font-style:italic;font-weight:bold;font-size:8.46667px;font-family:Arial;-inkscape-font-specification:'Arial Bold Italic'"
         id="path4371" />
      <path
         d="m 104.34504,63.188032 h 2.3027 l -0.23978,1.145151 h -2.3027 z"
         style="font-style:italic;font-weight:bold;font-size:8.46667px;font-family:Arial;-inkscape-font-specification:'Arial Bold Italic'"
         id="path4373" />
      <path
         d="m 107.78875,61.555057 h 1.10795 l -0.17777,0.851627 q 0.62012,-0.95498 1.34359,-0.95498 0.25631,0 0.54984,0.128157 l -0.45476,0.971518 q -0.16123,-0.05788 -0.34313,-0.05788 -0.30592,0 -0.62425,0.23151 -0.31419,0.231511 -0.49196,0.620118 -0.17777,0.384473 -0.3514,1.223698 l -0.28939,1.376661 h -1.18649 z"
         style="font-style:italic;font-weight:bold;font-size:8.46667px;font-family:Arial;-inkscape-font-specification:'Arial Bold Italic'"
         id="path4375" />
      <path
         d="m 111.90633,62.799426 -1.15755,-0.09922 q 0.19844,-0.587045 0.6904,-0.917774 0.49609,-0.330729 1.31051,-0.330729 0.8475,0 1.25264,0.343131 0.40514,0.338998 0.40514,0.830958 0,0.198437 -0.0372,0.421679 -0.0331,0.223243 -0.24392,1.17409 -0.17363,0.785482 -0.17363,1.099674 0,0.28112 0.0992,0.624252 h -1.15342 q -0.0703,-0.239779 -0.0868,-0.496094 -0.26044,0.289388 -0.59944,0.446485 -0.339,0.152962 -0.68213,0.152962 -0.5457,0 -0.90124,-0.355534 -0.35553,-0.359668 -0.35553,-0.921908 0,-0.628386 0.3886,-1.00459 0.39275,-0.376205 1.39734,-0.454753 0.84749,-0.07028 1.13274,-0.169499 0.0744,-0.248047 0.0744,-0.396875 0,-0.190169 -0.15296,-0.318327 -0.15297,-0.128158 -0.45476,-0.128158 -0.31832,0 -0.50436,0.132292 -0.1819,0.128158 -0.24805,0.367937 z m 1.12862,1.099674 q -0.10749,0.02894 -0.28526,0.05374 -0.89297,0.107487 -1.16582,0.314193 -0.1943,0.148828 -0.1943,0.401009 0,0.206706 0.14883,0.3514 0.14883,0.14056 0.39274,0.14056 0.26872,0 0.50436,-0.128158 0.23978,-0.132291 0.35553,-0.334863 0.11989,-0.206706 0.21084,-0.640788 z"
         style="font-style:italic;font-weight:bold;font-size:8.46667px;font-family:Arial;-inkscape-font-specification:'Arial Bold Italic'"
         id="path4377" />
      <path
         d="m 115.87509,61.555057 h 1.12448 l -0.11576,0.570508 q 0.42168,-0.363803 0.78548,-0.516765 0.36794,-0.157096 0.77308,-0.157096 0.54157,0 0.85163,0.310058 0.31419,0.310059 0.31419,0.822689 0,0.231511 -0.13642,0.876433 l -0.51677,2.484604 h -1.18649 l 0.5209,-2.492872 q 0.11575,-0.558106 0.11575,-0.665593 0,-0.227376 -0.13642,-0.355534 -0.13229,-0.132292 -0.37207,-0.132292 -0.26045,0 -0.57878,0.219109 -0.31832,0.219108 -0.50023,0.578776 -0.13229,0.256315 -0.29765,1.045931 l -0.37621,1.802475 h -1.18649 z"
         style="font-style:italic;font-weight:bold;font-size:8.46667px;font-family:Arial;-inkscape-font-specification:'Arial Bold Italic'"
         id="path4379" />
      <path
         d="m 120.09188,65.945488 1.26918,-6.060614 h 1.18649 l -0.66146,3.15433 1.54616,-1.484147 h 1.54203 l -1.76527,1.595768 0.93844,2.794663 h -1.18649 l -0.60358,-2.029851 -0.80202,0.711068 -0.27698,1.318783 z"
         style="font-style:italic;font-weight:bold;font-size:8.46667px;font-family:Arial;-inkscape-font-specification:'Arial Bold Italic'"
         id="path4381" />
    </g>
  </g>
</svg>
