<?xml version="1.0" encoding="UTF-8" standalone="no"?>
<!-- Created with Inkscape (http://www.inkscape.org/) -->

<svg
   width="61.052631mm"
   height="32.445988mm"
   viewBox="0 0 61.052631 32.445988"
   version="1.1"
   id="svg8"
   inkscape:version="1.1.2 (0a00cf5339, 2022-02-04)"
   sodipodi:docname="distributed-3.svg"
   xmlns:inkscape="http://www.inkscape.org/namespaces/inkscape"
   xmlns:sodipodi="http://sodipodi.sourceforge.net/DTD/sodipodi-0.dtd"
   xmlns="http://www.w3.org/2000/svg"
   xmlns:svg="http://www.w3.org/2000/svg"
   xmlns:rdf="http://www.w3.org/1999/02/22-rdf-syntax-ns#"
   xmlns:cc="http://creativecommons.org/ns#"
   xmlns:dc="http://purl.org/dc/elements/1.1/">
  <defs
     id="defs2">
    <inkscape:path-effect
       effect="perspective-envelope"
       up_left_point="85.01,72.519685"
       up_right_point="98.64,76.139685"
       down_left_point="84.11,97.639685"
       down_right_point="97.74,102.93969"
       id="path-effect5193"
       is_visible="true"
       deform_type="perspective"
       horizontal_mirror="false"
       vertical_mirror="false"
       overflow_perspective="false" />
    <inkscape:path-effect
       overflow_perspective="false"
       vertical_mirror="false"
       horizontal_mirror="false"
       deform_type="perspective"
       is_visible="true"
       id="path-effect5181"
       down_right_point="95,102.93969"
       down_left_point="82,97.639685"
       up_right_point="99,76.139685"
       up_left_point="85.01,75.519685"
       effect="perspective-envelope" />
    <inkscape:path-effect
       overflow_perspective="true"
       vertical_mirror="false"
       horizontal_mirror="false"
       deform_type="perspective"
       is_visible="true"
       id="path-effect5169"
       down_right_point="97.74,102.93969"
       down_left_point="84.11,97.639685"
       up_right_point="98.64,76.139685"
       up_left_point="85.01,72.519685"
       effect="perspective-envelope" />
    <inkscape:path-effect
       overflow_perspective="false"
       vertical_mirror="false"
       horizontal_mirror="false"
       deform_type="perspective"
       is_visible="true"
       id="path-effect5157"
       down_right_point="106.1,97.719685"
       down_left_point="81.61,107.36969"
       up_right_point="98.84,68.419685"
       up_left_point="85.31069,76.909685"
       effect="perspective-envelope" />
    <inkscape:path-effect
       effect="perspective-envelope"
       up_left_point="85.01,72.519685"
       up_right_point="98.64,76.139685"
       down_left_point="84.11,97.639685"
       down_right_point="97.74,102.93969"
       id="path-effect5145"
       is_visible="true"
       deform_type="perspective"
       horizontal_mirror="false"
       vertical_mirror="false"
       overflow_perspective="false" />
  </defs>
  <sodipodi:namedview
     id="base"
     pagecolor="#ffffff"
     bordercolor="#666666"
     borderopacity="1.0"
     inkscape:pageopacity="0.0"
     inkscape:pageshadow="2"
     inkscape:zoom="2.8"
     inkscape:cx="68.214286"
     inkscape:cy="51.071429"
     inkscape:document-units="mm"
     inkscape:current-layer="layer1"
     showgrid="false"
     showguides="true"
     inkscape:guide-bbox="true"
     inkscape:window-width="1920"
     inkscape:window-height="1029"
     inkscape:window-x="1080"
     inkscape:window-y="0"
     inkscape:window-maximized="1"
     fit-margin-top="0"
     fit-margin-left="0"
     fit-margin-right="0"
     fit-margin-bottom="0"
     inkscape:pagecheckerboard="0">
    <sodipodi:guide
       position="30.611645,27.542304"
       orientation="0,1"
       id="guide40"
       inkscape:locked="false" />
    <sodipodi:guide
       position="30.611645,-51.970374"
       orientation="0,1"
       id="guide42"
       inkscape:locked="false" />
    <sodipodi:guide
       position="30.611645,27.542314"
       orientation="1,0"
       id="guide44"
       inkscape:locked="false" />
    <sodipodi:guide
       position="64.822144,7.6307246"
       orientation="1,0"
       id="guide46"
       inkscape:locked="false" />
    <sodipodi:guide
       position="-3.7324896,7.6307246"
       orientation="1,0"
       id="guide48"
       inkscape:locked="false" />
    <sodipodi:guide
       position="64.822144,-32.058794"
       orientation="0,1"
       id="guide52"
       inkscape:locked="false" />
    <sodipodi:guide
       position="30.611645,-12.280855"
       orientation="0,1"
       id="guide57"
       inkscape:locked="false" />
  </sodipodi:namedview>
  <metadata
     id="metadata5">
    <rdf:RDF>
      <cc:Work
         rdf:about="">
        <dc:format>image/svg+xml</dc:format>
        <dc:type
           rdf:resource="http://purl.org/dc/dcmitype/StillImage" />
      </cc:Work>
    </rdf:RDF>
  </metadata>
  <g
     inkscape:label="Calque 1"
     inkscape:groupmode="layer"
     id="layer1"
     transform="translate(-77.097973,-28.56856)">
    <g
       id="g981"
       transform="matrix(0.38456062,0,0,0.38456062,81.877483,28.56856)">
      <g
         transform="translate(10.479,-42)"
         id="g840">
        <path
           style="fill:#00ffff"
           d="m 48,45 v 3 3 3 3 h 3 3 3 3 3 v -3 -3 -3 -3 h -3 -3 -3 -3 z"
           id="rect2366"
           inkscape:connector-curvature="0"
           sodipodi:nodetypes="ccccccccccccccccccc" />
        <path
           style="fill:#808080"
           d="m 45,42 v 3 3 3 3 3 3 h 3 3 3 3 3 3 3 v -3 -3 -3 -3 -3 -3 h -3 -3 -3 -3 -3 -3 z m 3,3 h 3 3 3 3 3 v 3 3 3 3 h -3 -3 -3 -3 -3 v -3 -3 -3 z m -9,15 v 3 3 3 h 3 3 3 3 3 3 3 3 3 3 3 v -3 -3 -3 h -3 v 3 3 h -3 -3 -3 -3 -3 -3 -3 -3 -3 v -3 -3 z"
           id="rect3382"
           inkscape:connector-curvature="0"
           sodipodi:nodetypes="ccccccccccccccccccccccccccccccccccccccccccccccccccccccccccccccccccccccccccccccc" />
        <path
           style="fill:#000000"
           d="m 66,45 v 3 3 3 3 3 h 3 v -3 -3 -3 -3 -3 z m 6,15 v 3 3 3 h -3 -3 -3 -3 -3 -3 -3 -3 -3 -3 v 3 h 3 3 3 3 3 3 3 3 3 3 3 v -3 -3 -3 -3 z"
           id="rect3568"
           inkscape:connector-curvature="0"
           sodipodi:nodetypes="cccccccccccccccccccccccccccccccccccccccccccc" />
      </g>
      <g
         transform="translate(10.479,-42)"
         id="g862">
        <path
           style="fill:#800000"
           d="m 75,63 v 3 h 3 3 27 V 63 H 81 78 Z m 30,3 v 30 3 3 3 h 3 v -3 -3 -3 -30 z m 0,39 c -70,26 -35,13 0,0 z"
           id="rect2778"
           inkscape:connector-curvature="0"
           sodipodi:nodetypes="cccccccccccccccccccccc" />
        <path
           sodipodi:nodetypes="cccccccccccccccccccccc"
           inkscape:connector-curvature="0"
           id="path835"
           d="m 75,106.01111 v -3 h 3 3 27 v 3 H 81 78 Z m 30,-3 v -30.000003 -3 -3 -3 h 3 v 3 3 3 30.000003 z m 0,-39.000003 c -70,-26 -35,-13 0,0 z"
           style="fill:#800000" />
      </g>
      <g
         transform="translate(10.479,-2)"
         id="g848">
        <path
           sodipodi:nodetypes="ccccccccccccccccccc"
           inkscape:connector-curvature="0"
           id="path842"
           d="m 48,45 v 3 3 3 3 h 3 3 3 3 3 v -3 -3 -3 -3 h -3 -3 -3 -3 z"
           style="fill:#00ffff" />
        <path
           sodipodi:nodetypes="ccccccccccccccccccccccccccccccccccccccccccccccccccccccccccccccccccccccccccccccc"
           inkscape:connector-curvature="0"
           id="path844"
           d="m 45,42 v 3 3 3 3 3 3 h 3 3 3 3 3 3 3 v -3 -3 -3 -3 -3 -3 h -3 -3 -3 -3 -3 -3 z m 3,3 h 3 3 3 3 3 v 3 3 3 3 h -3 -3 -3 -3 -3 v -3 -3 -3 z m -9,15 v 3 3 3 h 3 3 3 3 3 3 3 3 3 3 3 v -3 -3 -3 h -3 v 3 3 h -3 -3 -3 -3 -3 -3 -3 -3 -3 v -3 -3 z"
           style="fill:#808080" />
        <path
           sodipodi:nodetypes="cccccccccccccccccccccccccccccccccccccccccccc"
           inkscape:connector-curvature="0"
           id="path846"
           d="m 66,45 v 3 3 3 3 3 h 3 v -3 -3 -3 -3 -3 z m 6,15 v 3 3 3 h -3 -3 -3 -3 -3 -3 -3 -3 -3 -3 v 3 h 3 3 3 3 3 3 3 3 3 3 3 v -3 -3 -3 -3 z"
           style="fill:#000000" />
      </g>
      <g
         transform="matrix(-1,0,0,1,124.479,-42)"
         id="g868">
        <path
           sodipodi:nodetypes="cccccccccccccccccccccc"
           inkscape:connector-curvature="0"
           id="path864"
           d="m 75,63 v 3 h 3 3 27 V 63 H 81 78 Z m 30,3 v 30 3 3 3 h 3 v -3 -3 -3 -30 z m 0,39 c -70,26 -35,13 0,0 z"
           style="fill:#800000" />
        <path
           style="fill:#800000"
           d="m 75,106.01111 v -3 h 3 3 27 v 3 H 81 78 Z m 30,-3 v -30.000003 -3 -3 -3 h 3 v 3 3 3 30.000003 z m 0,-39.000003 c -70,-26 -35,-13 0,0 z"
           id="path866"
           inkscape:connector-curvature="0"
           sodipodi:nodetypes="cccccccccccccccccccccc" />
      </g>
      <g
         transform="translate(10.479,-42)"
         id="g945">
        <g
           transform="translate(48.921363,27.676409)"
           id="g856">
          <path
             sodipodi:nodetypes="ccccccccccccccccccc"
             inkscape:connector-curvature="0"
             id="path850"
             d="m 48,45 v 3 3 3 3 h 3 3 3 3 3 v -3 -3 -3 -3 h -3 -3 -3 -3 z"
             style="fill:#00ffff" />
          <path
             sodipodi:nodetypes="ccccccccccccccccccccccccccccccccccccccccccccccccccccccccccccccccccccccccccccccc"
             inkscape:connector-curvature="0"
             id="path852"
             d="m 45,42 v 3 3 3 3 3 3 h 3 3 3 3 3 3 3 v -3 -3 -3 -3 -3 -3 h -3 -3 -3 -3 -3 -3 z m 3,3 h 3 3 3 3 3 v 3 3 3 3 h -3 -3 -3 -3 -3 v -3 -3 -3 z m -9,15 v 3 3 3 h 3 3 3 3 3 3 3 3 3 3 3 v -3 -3 -3 h -3 v 3 3 h -3 -3 -3 -3 -3 -3 -3 -3 -3 v -3 -3 z"
             style="fill:#808080" />
          <path
             sodipodi:nodetypes="cccccccccccccccccccccccccccccccccccccccccccc"
             inkscape:connector-curvature="0"
             id="path854"
             d="m 66,45 v 3 3 3 3 3 h 3 v -3 -3 -3 -3 -3 z m 6,15 v 3 3 3 h -3 -3 -3 -3 -3 -3 -3 -3 -3 -3 v 3 h 3 3 3 3 3 3 3 3 3 3 3 v -3 -3 -3 -3 z"
             style="fill:#000000" />
        </g>
        <path
           style="fill:#ffffff;fill-opacity:1;stroke:none;stroke-width:1.17203403px;stroke-linecap:butt;stroke-linejoin:miter;stroke-opacity:1"
           d="m 90.921363,87.673729 26.999997,0.0027 v 5.984608 l -26.999997,0.01539 z"
           id="path876"
           inkscape:connector-curvature="0"
           sodipodi:nodetypes="ccccc" />
      </g>
      <g
         transform="translate(10.479,-42)"
         id="g922">
        <g
           id="g891"
           transform="translate(-49.479,27.676409)">
          <path
             style="fill:#00ffff"
             d="m 48,45 v 3 3 3 3 h 3 3 3 3 3 v -3 -3 -3 -3 h -3 -3 -3 -3 z"
             id="path885"
             inkscape:connector-curvature="0"
             sodipodi:nodetypes="ccccccccccccccccccc" />
          <path
             style="fill:#808080"
             d="m 45,42 v 3 3 3 3 3 3 h 3 3 3 3 3 3 3 v -3 -3 -3 -3 -3 -3 h -3 -3 -3 -3 -3 -3 z m 3,3 h 3 3 3 3 3 v 3 3 3 3 h -3 -3 -3 -3 -3 v -3 -3 -3 z m -9,15 v 3 3 3 h 3 3 3 3 3 3 3 3 3 3 3 v -3 -3 -3 h -3 v 3 3 h -3 -3 -3 -3 -3 -3 -3 -3 -3 v -3 -3 z"
             id="path887"
             inkscape:connector-curvature="0"
             sodipodi:nodetypes="ccccccccccccccccccccccccccccccccccccccccccccccccccccccccccccccccccccccccccccccc" />
          <path
             style="fill:#000000"
             d="m 66,45 v 3 3 3 3 3 h 3 v -3 -3 -3 -3 -3 z m 6,15 v 3 3 3 h -3 -3 -3 -3 -3 -3 -3 -3 -3 -3 v 3 h 3 3 3 3 3 3 3 3 3 3 3 v -3 -3 -3 -3 z"
             id="path889"
             inkscape:connector-curvature="0"
             sodipodi:nodetypes="cccccccccccccccccccccccccccccccccccccccccccc" />
        </g>
        <path
           sodipodi:nodetypes="ccccc"
           inkscape:connector-curvature="0"
           id="path913"
           d="m -7.479,87.673729 26.999997,0.0027 v 5.984608 L -7.479,93.676427 Z"
           style="fill:#ffffff;fill-opacity:1;stroke:none;stroke-width:1.17203403px;stroke-linecap:butt;stroke-linejoin:miter;stroke-opacity:1" />
      </g>
      <path
         style="fill:#ffffff;fill-opacity:1;stroke:none;stroke-width:1.17203403px;stroke-linecap:butt;stroke-linejoin:miter;stroke-opacity:1"
         d="m 52.479,58 26.999997,0.003 v 5.98461 L 52.479,64.00301 Z"
         id="path936"
         inkscape:connector-curvature="0"
         sodipodi:nodetypes="ccccc" />
      <path
         sodipodi:nodetypes="ccccc"
         inkscape:connector-curvature="0"
         id="path938"
         d="m 52.479,18 26.999997,0.003 v 5.98461 L 52.479,24.00301 Z"
         style="fill:#ffffff;fill-opacity:1;stroke:none;stroke-width:1.17203403px;stroke-linecap:butt;stroke-linejoin:miter;stroke-opacity:1" />
    </g>
    <g
       aria-label="Network"
       id="text868"
       style="font-size:4.23333px;line-height:1.25;-inkscape-font-specification:sans-serif;letter-spacing:0px;word-spacing:0px;stroke-width:0.264583">
      <path
         d="m 83.891108,60.16275 h -0.484037 l -0.682129,-1.69671 -0.354845,1.69671 h -0.484036 l 0.5271,-2.525256 h 0.485759 l 0.683851,1.68982 0.353123,-1.68982 h 0.482314 z"
         style="font-style:italic;font-weight:bold;font-size:3.52778px;font-family:Arial;-inkscape-font-specification:'Arial Bold Italic';text-align:center;text-anchor:middle"
         id="path75" />
      <path
         d="m 86.197601,59.401384 h -1.240236 q -0.0017,0.02928 -0.0017,0.04479 0,0.18259 0.103353,0.294556 0.105075,0.111965 0.254937,0.111965 0.246325,0 0.384128,-0.254937 l 0.442696,0.07407 q -0.129192,0.266995 -0.346233,0.401354 -0.215318,0.132636 -0.484036,0.132636 -0.368625,0 -0.599447,-0.232544 -0.230822,-0.234267 -0.230822,-0.618395 0,-0.375516 0.208429,-0.668349 0.28422,-0.396186 0.81132,-0.396186 0.335897,0 0.533991,0.208428 0.198093,0.206706 0.198093,0.580499 0,0.179145 -0.03445,0.322117 z m -0.416857,-0.301446 q 0.0017,-0.03273 0.0017,-0.04995 0,-0.203261 -0.0913,-0.304891 -0.0913,-0.101631 -0.244602,-0.101631 -0.153306,0 -0.275607,0.115411 -0.120579,0.115411 -0.163643,0.341065 z"
         style="font-style:italic;font-weight:bold;font-size:3.52778px;font-family:Arial;-inkscape-font-specification:'Arial Bold Italic';text-align:center;text-anchor:middle"
         id="path77" />
      <path
         d="m 86.502492,58.700306 0.07579,-0.366903 h 0.241157 l 0.06029,-0.292833 0.566719,-0.341065 -0.132637,0.633898 h 0.301446 l -0.07579,0.366903 h -0.303168 l -0.160197,0.766535 q -0.04306,0.208428 -0.04306,0.237711 0,0.05684 0.03617,0.08957 0.03617,0.03101 0.130914,0.03101 0.03273,0 0.163642,-0.01206 l -0.07751,0.366903 q -0.127469,0.02584 -0.261828,0.02584 -0.261827,0 -0.380683,-0.09991 -0.118856,-0.10163 -0.118856,-0.280775 0,-0.0844 0.06373,-0.389296 l 0.153307,-0.735529 z"
         style="font-style:italic;font-weight:bold;font-size:3.52778px;font-family:Arial;-inkscape-font-specification:'Arial Bold Italic';text-align:center;text-anchor:middle"
         id="path79" />
      <path
         d="m 89.465276,60.16275 h -0.465088 l -0.08957,-1.164443 -0.558106,1.164443 h -0.458198 l -0.229099,-1.829347 h 0.43925 l 0.127469,1.226455 0.570164,-1.226455 h 0.449585 l 0.06201,1.226455 0.566718,-1.226455 h 0.496094 z"
         style="font-style:italic;font-weight:bold;font-size:3.52778px;font-family:Arial;-inkscape-font-specification:'Arial Bold Italic';text-align:center;text-anchor:middle"
         id="path81" />
      <path
         d="m 90.369614,59.403106 q 0,-0.508152 0.285943,-0.809598 0.287666,-0.303168 0.754476,-0.303168 0.404799,0 0.632176,0.223931 0.227376,0.222209 0.227376,0.599447 0,0.444418 -0.28422,0.768257 -0.284221,0.323839 -0.761367,0.323839 -0.258382,0 -0.458198,-0.103353 -0.199816,-0.103353 -0.298001,-0.292833 -0.09819,-0.189481 -0.09819,-0.406522 z m 1.409045,-0.353122 q 0,-0.1757 -0.103353,-0.280776 -0.101631,-0.106798 -0.26355,-0.106798 -0.160197,0 -0.284221,0.09991 -0.124023,0.09819 -0.192925,0.287666 -0.0689,0.187758 -0.0689,0.346232 0,0.196371 0.106798,0.311781 0.106798,0.115411 0.268718,0.115411 0.20326,0 0.341064,-0.173977 0.196371,-0.246325 0.196371,-0.599447 z"
         style="font-style:italic;font-weight:bold;font-size:3.52778px;font-family:Arial;-inkscape-font-specification:'Arial Bold Italic';text-align:center;text-anchor:middle"
         id="path83" />
      <path
         d="m 92.807021,58.333403 h 0.461643 l -0.07407,0.354845 q 0.258383,-0.397908 0.559829,-0.397908 0.106798,0 0.229099,0.0534 l -0.189481,0.404799 q -0.06718,-0.02412 -0.142971,-0.02412 -0.127469,0 -0.260105,0.09646 -0.130914,0.09646 -0.204983,0.258382 -0.07407,0.160197 -0.146417,0.509874 l -0.120578,0.573609 h -0.494372 z"
         style="font-style:italic;font-weight:bold;font-size:3.52778px;font-family:Arial;-inkscape-font-specification:'Arial Bold Italic';text-align:center;text-anchor:middle"
         id="path85" />
      <path
         d="m 93.816435,60.16275 0.528822,-2.525256 h 0.494372 l -0.275608,1.314304 0.644233,-0.618395 h 0.642511 l -0.735529,0.664904 0.391019,1.164443 h -0.494372 l -0.251492,-0.845771 -0.334174,0.296278 -0.115411,0.549493 z"
         style="font-style:italic;font-weight:bold;font-size:3.52778px;font-family:Arial;-inkscape-font-specification:'Arial Bold Italic';text-align:center;text-anchor:middle"
         id="path87" />
    </g>
    <path
       style="fill:none;stroke:#800000;stroke-width:0.5291667;stroke-linecap:butt;stroke-linejoin:miter;stroke-miterlimit:4;stroke-dasharray:0.52916667, 0.52916667;stroke-dashoffset:0;stroke-opacity:1"
       d="m 90.752387,57.422421 4.819197,-4.771948"
       id="path877"
       inkscape:connector-curvature="0" />
    <g
       aria-label="1"
       id="text881"
       style="font-size:4.23333px;line-height:1.25;-inkscape-font-specification:sans-serif;letter-spacing:0px;word-spacing:0px;stroke-width:0.264583">
      <path
         d="m 107.68484,33.468182 h -0.37207 v -2.370913 q -0.13436,0.128157 -0.35347,0.256315 -0.21704,0.128157 -0.39067,0.192236 v -0.359668 q 0.31212,-0.146761 0.5457,-0.355533 0.23358,-0.208773 0.33073,-0.405143 h 0.23978 z"
         id="path90" />
    </g>
    <g
       aria-label="2"
       id="text885"
       style="font-size:4.23333px;line-height:1.25;-inkscape-font-specification:sans-serif;letter-spacing:0px;word-spacing:0px;stroke-width:0.264583">
      <path
         d="m 127.04311,43.835652 v 0.357601 h -2.00297 q -0.004,-0.134359 0.0434,-0.258382 0.0765,-0.204639 0.24391,-0.403076 0.1695,-0.198438 0.48782,-0.458887 0.49403,-0.405142 0.66766,-0.640787 0.17363,-0.237711 0.17363,-0.448551 0,-0.221175 -0.15916,-0.37207 -0.15709,-0.152962 -0.41134,-0.152962 -0.26872,0 -0.42995,0.16123 -0.16123,0.161231 -0.1633,0.446484 l -0.3824,-0.03927 q 0.0393,-0.42788 0.29559,-0.651122 0.25631,-0.225309 0.68833,-0.225309 0.43614,0 0.69039,0.241845 0.25425,0.241846 0.25425,0.599446 0,0.181901 -0.0744,0.357601 -0.0744,0.1757 -0.24805,0.370003 -0.17157,0.194303 -0.57258,0.5333 -0.33486,0.28112 -0.42994,0.382406 -0.0951,0.09922 -0.1571,0.200504 z"
         id="path93" />
    </g>
    <g
       aria-label="3"
       id="text889"
       style="font-size:4.23333px;line-height:1.25;-inkscape-font-specification:sans-serif;letter-spacing:0px;word-spacing:0px;stroke-width:0.264583">
      <path
         d="m 106.28544,48.118007 0.37207,-0.04961 q 0.0641,0.31626 0.21704,0.45682 0.15503,0.138492 0.37621,0.138492 0.26251,0 0.44235,-0.1819 0.1819,-0.181901 0.1819,-0.450619 0,-0.256314 -0.16744,-0.421679 -0.16743,-0.167431 -0.42581,-0.167431 -0.10542,0 -0.26251,0.04134 l 0.0413,-0.326595 q 0.0372,0.0041 0.0599,0.0041 0.23771,0 0.42788,-0.124023 0.19017,-0.124024 0.19017,-0.382406 0,-0.204638 -0.13849,-0.338997 -0.13849,-0.134358 -0.3576,-0.134358 -0.21704,0 -0.36174,0.136425 -0.14469,0.136426 -0.18603,0.409277 l -0.37207,-0.06614 q 0.0682,-0.374137 0.31006,-0.578776 0.24184,-0.206705 0.60151,-0.206705 0.24805,0 0.45682,0.107486 0.20877,0.10542 0.31832,0.289388 0.11163,0.183968 0.11163,0.390674 0,0.19637 -0.10542,0.3576 -0.10542,0.161231 -0.31213,0.256315 0.26872,0.06201 0.41755,0.258382 0.14882,0.194303 0.14882,0.487825 0,0.396875 -0.28938,0.67386 -0.28939,0.274919 -0.73174,0.274919 -0.39894,0 -0.66353,-0.237712 -0.26251,-0.237711 -0.29972,-0.615982 z"
         id="path96" />
    </g>
    <g
       aria-label="4"
       id="text893"
       style="font-size:4.23333px;line-height:1.25;-inkscape-font-specification:sans-serif;letter-spacing:0px;word-spacing:0px;stroke-width:0.264583">
      <path
         d="M 88.482755,44.193256 V 43.46772 h -1.314647 v -0.341064 l 1.38286,-1.963703 h 0.303857 v 1.963703 h 0.409277 v 0.341064 h -0.409277 v 0.725536 z m 0,-1.0666 v -1.366324 l -0.948778,1.366324 z"
         id="path99" />
    </g>
    <g
       id="g904">
      <path
         id="rect895"
         style="opacity:1;fill:none;fill-opacity:0;stroke:#808080;stroke-width:0.396875"
         d="m 132.32977,41.027706 h 5.6224 v 4.110491 h -5.6224 z" />
      <g
         aria-label="RAM"
         id="text899"
         style="font-size:4.23333px;line-height:1.25;-inkscape-font-specification:sans-serif;letter-spacing:0px;word-spacing:0px;stroke-width:0.264583">
        <path
           d="m 132.91002,43.815281 v -1.515155 h 0.64389 q 0.24288,0 0.35243,0.04134 0.11059,0.04031 0.17674,0.144694 0.0661,0.104387 0.0661,0.238746 0,0.170532 -0.10025,0.282153 -0.10025,0.110588 -0.29972,0.139527 0.0992,0.05788 0.16329,0.127124 0.0651,0.06925 0.17467,0.24598 l 0.185,0.29559 h -0.36587 l -0.22117,-0.329696 q -0.11783,-0.176734 -0.16123,-0.222209 -0.0434,-0.04651 -0.092,-0.06305 -0.0486,-0.01757 -0.15399,-0.01757 h -0.062 v 0.632521 z m 0.30592,-0.874367 h 0.22635 q 0.22014,0 0.27492,-0.0186 0.0548,-0.0186 0.0858,-0.06408 0.031,-0.04548 0.031,-0.113688 0,-0.07648 -0.0413,-0.12299 -0.0403,-0.04754 -0.11472,-0.05995 -0.0372,-0.0052 -0.22324,-0.0052 h -0.23875 z"
           style="font-weight:bold;font-size:2.11667px;font-family:Arial;-inkscape-font-specification:'Arial Bold'"
           id="path103" />
        <path
           d="m 135.8039,43.815281 h -0.33279 l -0.13229,-0.344166 h -0.60565 l -0.12506,0.344166 h -0.32453 l 0.59015,-1.515155 h 0.32349 z m -0.56327,-0.599448 -0.20877,-0.56224 -0.20464,0.56224 z"
           style="font-weight:bold;font-size:2.11667px;font-family:Arial;-inkscape-font-specification:'Arial Bold'"
           id="path105" />
        <path
           d="m 135.96203,43.815281 v -1.515155 h 0.45786 l 0.27492,1.03353 0.27182,-1.03353 h 0.45888 v 1.515155 h -0.28422 v -1.192694 l -0.30076,1.192694 h -0.29455 l -0.29973,-1.192694 v 1.192694 z"
           style="font-weight:bold;font-size:2.11667px;font-family:Arial;-inkscape-font-specification:'Arial Bold'"
           id="path107" />
      </g>
    </g>
    <g
       id="g912"
       transform="translate(-55.033362)">
      <path
         id="rect906"
         style="opacity:1;fill:none;fill-opacity:0;stroke:#808080;stroke-width:0.396875"
         d="m 132.32977,41.027706 h 5.6224 v 4.110491 h -5.6224 z" />
      <g
         aria-label="RAM"
         id="text910"
         style="font-size:4.23333px;line-height:1.25;-inkscape-font-specification:sans-serif;letter-spacing:0px;word-spacing:0px;stroke-width:0.264583">
        <path
           d="m 132.91002,43.815281 v -1.515155 h 0.64389 q 0.24288,0 0.35243,0.04134 0.11059,0.04031 0.17674,0.144694 0.0661,0.104387 0.0661,0.238746 0,0.170532 -0.10025,0.282153 -0.10025,0.110588 -0.29972,0.139527 0.0992,0.05788 0.16329,0.127124 0.0651,0.06925 0.17467,0.24598 l 0.185,0.29559 h -0.36587 l -0.22117,-0.329696 q -0.11783,-0.176734 -0.16123,-0.222209 -0.0434,-0.04651 -0.092,-0.06305 -0.0486,-0.01757 -0.15399,-0.01757 h -0.062 v 0.632521 z m 0.30592,-0.874367 h 0.22635 q 0.22014,0 0.27492,-0.0186 0.0548,-0.0186 0.0858,-0.06408 0.031,-0.04548 0.031,-0.113688 0,-0.07648 -0.0413,-0.12299 -0.0403,-0.04754 -0.11472,-0.05995 -0.0372,-0.0052 -0.22324,-0.0052 h -0.23875 z"
           style="font-weight:bold;font-size:2.11667px;font-family:Arial;-inkscape-font-specification:'Arial Bold'"
           id="path111" />
        <path
           d="m 135.8039,43.815281 h -0.33279 l -0.13229,-0.344166 h -0.60565 l -0.12506,0.344166 h -0.32453 l 0.59015,-1.515155 h 0.32349 z m -0.56327,-0.599448 -0.20877,-0.56224 -0.20464,0.56224 z"
           style="font-weight:bold;font-size:2.11667px;font-family:Arial;-inkscape-font-specification:'Arial Bold'"
           id="path113" />
        <path
           d="m 135.96203,43.815281 v -1.515155 h 0.45786 l 0.27492,1.03353 0.27182,-1.03353 h 0.45888 v 1.515155 h -0.28422 v -1.192694 l -0.30076,1.192694 h -0.29455 l -0.29973,-1.192694 v 1.192694 z"
           style="font-weight:bold;font-size:2.11667px;font-family:Arial;-inkscape-font-specification:'Arial Bold'"
           id="path115" />
      </g>
    </g>
    <g
       transform="translate(-35.98335,-10.912712)"
       id="g920">
      <path
         id="rect914"
         style="opacity:1;fill:none;fill-opacity:0;stroke:#808080;stroke-width:0.396875"
         d="m 132.32977,41.027706 h 5.6224 v 4.110491 h -5.6224 z" />
      <g
         aria-label="RAM"
         id="text918"
         style="font-size:4.23333px;line-height:1.25;-inkscape-font-specification:sans-serif;letter-spacing:0px;word-spacing:0px;stroke-width:0.264583">
        <path
           d="m 132.91002,43.815281 v -1.515155 h 0.64389 q 0.24288,0 0.35243,0.04134 0.11059,0.04031 0.17674,0.144694 0.0661,0.104387 0.0661,0.238746 0,0.170532 -0.10025,0.282153 -0.10025,0.110588 -0.29972,0.139527 0.0992,0.05788 0.16329,0.127124 0.0651,0.06925 0.17467,0.24598 l 0.185,0.29559 h -0.36587 l -0.22117,-0.329696 q -0.11783,-0.176734 -0.16123,-0.222209 -0.0434,-0.04651 -0.092,-0.06305 -0.0486,-0.01757 -0.15399,-0.01757 h -0.062 v 0.632521 z m 0.30592,-0.874367 h 0.22635 q 0.22014,0 0.27492,-0.0186 0.0548,-0.0186 0.0858,-0.06408 0.031,-0.04548 0.031,-0.113688 0,-0.07648 -0.0413,-0.12299 -0.0403,-0.04754 -0.11472,-0.05995 -0.0372,-0.0052 -0.22324,-0.0052 h -0.23875 z"
           style="font-weight:bold;font-size:2.11667px;font-family:Arial;-inkscape-font-specification:'Arial Bold'"
           id="path119" />
        <path
           d="m 135.8039,43.815281 h -0.33279 l -0.13229,-0.344166 h -0.60565 l -0.12506,0.344166 h -0.32453 l 0.59015,-1.515155 h 0.32349 z m -0.56327,-0.599448 -0.20877,-0.56224 -0.20464,0.56224 z"
           style="font-weight:bold;font-size:2.11667px;font-family:Arial;-inkscape-font-specification:'Arial Bold'"
           id="path121" />
        <path
           d="m 135.96203,43.815281 v -1.515155 h 0.45786 l 0.27492,1.03353 0.27182,-1.03353 h 0.45888 v 1.515155 h -0.28422 v -1.192694 l -0.30076,1.192694 h -0.29455 l -0.29973,-1.192694 v 1.192694 z"
           style="font-weight:bold;font-size:2.11667px;font-family:Arial;-inkscape-font-specification:'Arial Bold'"
           id="path123" />
      </g>
    </g>
    <g
       id="g928"
       transform="translate(-27.289898,15.677914)">
      <path
         id="rect922"
         style="opacity:1;fill:none;fill-opacity:0;stroke:#808080;stroke-width:0.396875"
         d="m 132.32977,41.027706 h 5.6224 v 4.110491 h -5.6224 z" />
      <g
         aria-label="RAM"
         id="text926"
         style="font-size:4.23333px;line-height:1.25;-inkscape-font-specification:sans-serif;letter-spacing:0px;word-spacing:0px;stroke-width:0.264583">
        <path
           d="m 132.91002,43.815281 v -1.515155 h 0.64389 q 0.24288,0 0.35243,0.04134 0.11059,0.04031 0.17674,0.144694 0.0661,0.104387 0.0661,0.238746 0,0.170532 -0.10025,0.282153 -0.10025,0.110588 -0.29972,0.139527 0.0992,0.05788 0.16329,0.127124 0.0651,0.06925 0.17467,0.24598 l 0.185,0.29559 h -0.36587 l -0.22117,-0.329696 q -0.11783,-0.176734 -0.16123,-0.222209 -0.0434,-0.04651 -0.092,-0.06305 -0.0486,-0.01757 -0.15399,-0.01757 h -0.062 v 0.632521 z m 0.30592,-0.874367 h 0.22635 q 0.22014,0 0.27492,-0.0186 0.0548,-0.0186 0.0858,-0.06408 0.031,-0.04548 0.031,-0.113688 0,-0.07648 -0.0413,-0.12299 -0.0403,-0.04754 -0.11472,-0.05995 -0.0372,-0.0052 -0.22324,-0.0052 h -0.23875 z"
           style="font-weight:bold;font-size:2.11667px;font-family:Arial;-inkscape-font-specification:'Arial Bold'"
           id="path127" />
        <path
           d="m 135.8039,43.815281 h -0.33279 l -0.13229,-0.344166 h -0.60565 l -0.12506,0.344166 h -0.32453 l 0.59015,-1.515155 h 0.32349 z m -0.56327,-0.599448 -0.20877,-0.56224 -0.20464,0.56224 z"
           style="font-weight:bold;font-size:2.11667px;font-family:Arial;-inkscape-font-specification:'Arial Bold'"
           id="path129" />
        <path
           d="m 135.96203,43.815281 v -1.515155 h 0.45786 l 0.27492,1.03353 0.27182,-1.03353 h 0.45888 v 1.515155 h -0.28422 v -1.192694 l -0.30076,1.192694 h -0.29455 l -0.29973,-1.192694 v 1.192694 z"
           style="font-weight:bold;font-size:2.11667px;font-family:Arial;-inkscape-font-specification:'Arial Bold'"
           id="path131" />
      </g>
    </g>
  </g>
</svg>
