<?xml version="1.0" encoding="UTF-8" standalone="no"?>
<!-- Created with Inkscape (http://www.inkscape.org/) -->

<svg
   xmlns:dc="http://purl.org/dc/elements/1.1/"
   xmlns:cc="http://creativecommons.org/ns#"
   xmlns:rdf="http://www.w3.org/1999/02/22-rdf-syntax-ns#"
   xmlns:svg="http://www.w3.org/2000/svg"
   xmlns="http://www.w3.org/2000/svg"
   xmlns:sodipodi="http://sodipodi.sourceforge.net/DTD/sodipodi-0.dtd"
   xmlns:inkscape="http://www.inkscape.org/namespaces/inkscape"
   width="71.830833mm"
   height="51.629684mm"
   viewBox="0 0 71.830833 51.629684"
   version="1.1"
   id="svg8"
   sodipodi:docname="ooc-6.svg"
   inkscape:version="0.92.4 (5da689c313, 2019-01-14)">
  <defs
     id="defs2" />
  <sodipodi:namedview
     id="base"
     pagecolor="#ffffff"
     bordercolor="#666666"
     borderopacity="1.0"
     inkscape:pageopacity="0.0"
     inkscape:pageshadow="2"
     inkscape:zoom="2.8"
     inkscape:cx="132.84322"
     inkscape:cy="80.08396"
     inkscape:document-units="mm"
     inkscape:current-layer="layer1"
     showgrid="false"
     showguides="true"
     inkscape:guide-bbox="true"
     fit-margin-top="0"
     fit-margin-left="0"
     fit-margin-right="0"
     fit-margin-bottom="0"
     inkscape:window-width="1920"
     inkscape:window-height="1025"
     inkscape:window-x="1080"
     inkscape:window-y="0"
     inkscape:window-maximized="1">
    <sodipodi:guide
       position="11.792436,51.232801"
       orientation="1,0"
       id="guide815"
       inkscape:locked="false" />
    <sodipodi:guide
       position="11.792436,51.232811"
       orientation="0,1"
       id="guide817"
       inkscape:locked="false" />
    <sodipodi:guide
       position="33.722644,49.286361"
       orientation="0,1"
       id="guide821"
       inkscape:locked="false"
       inkscape:label=""
       inkscape:color="rgb(0,0,255)" />
    <sodipodi:guide
       position="11.792436,4.5527411"
       orientation="0,1"
       id="guide823"
       inkscape:locked="false" />
    <sodipodi:guide
       position="30.649043,46.886081"
       orientation="1,0"
       id="guide825"
       inkscape:locked="false" />
    <sodipodi:guide
       position="11.792436,19.510681"
       orientation="0,1"
       id="guide847"
       inkscape:locked="false" />
    <sodipodi:guide
       position="7.1293258,4.5527411"
       orientation="1,0"
       id="guide871"
       inkscape:locked="false" />
    <sodipodi:guide
       position="7.1293254,34.396361"
       orientation="0,1"
       id="guide875"
       inkscape:locked="false"
       inkscape:label=""
       inkscape:color="rgb(0,0,255)" />
    <sodipodi:guide
       position="7.1293255,12.031361"
       orientation="0,1"
       id="guide881"
       inkscape:locked="false"
       inkscape:label=""
       inkscape:color="rgb(0,0,255)" />
    <sodipodi:guide
       position="6.1464172,27.018691"
       orientation="1,0"
       id="guide887"
       inkscape:locked="false" />
  </sodipodi:namedview>
  <metadata
     id="metadata5">
    <rdf:RDF>
      <cc:Work
         rdf:about="">
        <dc:format>image/svg+xml</dc:format>
        <dc:type
           rdf:resource="http://purl.org/dc/dcmitype/StillImage" />
        <dc:title />
      </cc:Work>
    </rdf:RDF>
  </metadata>
  <g
     inkscape:label="Calque 1"
     inkscape:groupmode="layer"
     id="layer1"
     transform="translate(-2.7596468,-17.656676)">
    <rect
       style="opacity:1;fill:#00ffff;fill-opacity:1;fill-rule:nonzero;stroke:none;stroke-width:0.62619686;stroke-linecap:butt;stroke-miterlimit:10;stroke-dasharray:none;stroke-dashoffset:0;stroke-opacity:0.93401017"
       id="rect829"
       width="18.856607"
       height="26.347334"
       x="14.552083"
       y="38.38628" />
    <rect
       style="opacity:1;fill:none;fill-opacity:1;fill-rule:nonzero;stroke:#000000;stroke-width:0.79374999;stroke-linecap:butt;stroke-miterlimit:10;stroke-dasharray:none;stroke-dashoffset:0;stroke-opacity:0.93401017"
       id="rect819"
       width="18.898809"
       height="46.68008"
       x="14.552083"
       y="18.053551" />
    <text
       xml:space="preserve"
       style="font-style:normal;font-variant:normal;font-weight:normal;font-stretch:normal;font-size:4.23333311px;line-height:1.25;font-family:sans-serif;-inkscape-font-specification:sans-serif;letter-spacing:0px;word-spacing:0px;fill:#000000;fill-opacity:1;stroke:none;stroke-width:0.26458332"
       x="19.10977"
       y="69.286362"
       id="text833"><tspan
         sodipodi:role="line"
         x="19.10977"
         y="69.286362"
         style="stroke-width:0.26458332"
         id="tspan835">RAM</tspan></text>
    <text
       xml:space="preserve"
       style="font-style:normal;font-variant:normal;font-weight:normal;font-stretch:normal;font-size:4.23333311px;line-height:1.25;font-family:sans-serif;-inkscape-font-specification:sans-serif;letter-spacing:0px;word-spacing:0px;fill:#000000;fill-opacity:1;stroke:none;stroke-width:0.26458332"
       x="19.911581"
       y="56.591061"
       id="text841"><tspan
         sodipodi:role="line"
         id="tspan839"
         x="19.911581"
         y="56.591061"
         style="stroke-width:0.26458332">55%</tspan></text>
    <text
       xml:space="preserve"
       style="font-style:normal;font-variant:normal;font-weight:normal;font-stretch:normal;font-size:4.23333311px;line-height:1.25;font-family:sans-serif;-inkscape-font-specification:sans-serif;letter-spacing:0px;word-spacing:0px;fill:#000000;fill-opacity:1;stroke:none;stroke-width:0.26458332"
       x="21.381563"
       y="60.733738"
       id="text845"><tspan
         sodipodi:role="line"
         id="tspan843"
         x="21.381563"
         y="60.733738"
         style="stroke-width:0.26458332">full</tspan></text>
    <g
       transform="matrix(0.18115942,0,0,0.18115942,49.047,29.166441)"
       id="g834">
      <path
         style="fill:#00ff00"
         d="m 99,60 v 3 h 3 3 3 3 v -3 h -3 -3 -3 z"
         id="rect686"
         inkscape:connector-curvature="0" />
      <path
         style="fill:#008000"
         d="m 99,63 v 3 h 3 3 3 3 v -3 h -3 -3 -3 z"
         id="rect778"
         inkscape:connector-curvature="0" />
      <path
         style="fill:#ffffff"
         d="m 6,54 v 3 3 3 3 3 3 3 3 3 3 3 3 3 3 3 h 3 v -3 -3 -3 -3 -3 -3 -3 -3 -3 -3 -3 -3 -3 -3 h 3 3 3 3 3 3 3 3 3 3 3 3 3 3 3 3 3 3 3 3 3 3 3 3 3 3 3 3 3 3 3 3 3 3 3 3 3 3 v -3 h -3 -3 -3 -3 -3 -3 -3 -3 -3 -3 -3 -3 -3 -3 -3 -3 -3 -3 -3 -3 -3 -3 -3 -3 -3 -3 -3 -3 -3 -3 -3 -3 -3 -3 -3 -3 -3 -3 z m 9,27 v 3 h 3 3 3 3 3 3 3 3 3 3 3 3 3 3 3 3 3 3 3 3 3 3 3 3 3 3 3 3 3 3 3 3 3 v -3 h -3 -3 -3 -3 -3 -3 -3 -3 -3 -3 -3 -3 -3 -3 -3 -3 -3 -3 -3 -3 -3 -3 -3 -3 -3 -3 -3 -3 -3 -3 -3 -3 z m 0,6 v 3 h 3 3 3 3 3 3 3 3 3 3 3 3 3 3 3 3 3 3 3 3 3 3 3 3 3 3 3 3 3 3 3 3 3 v -3 h -3 -3 -3 -3 -3 -3 -3 -3 -3 -3 -3 -3 -3 -3 -3 -3 -3 -3 -3 -3 -3 -3 -3 -3 -3 -3 -3 -3 -3 -3 -3 -3 z"
         id="rect1716"
         inkscape:connector-curvature="0" />
      <path
         style="fill:#c0c0c0"
         d="m 18,42 v 3 h -3 v 3 h -3 v 3 H 9 v 3 h 3 3 3 3 3 3 3 3 3 3 3 3 3 3 3 3 3 3 3 3 3 3 3 3 3 3 3 3 3 3 3 3 3 3 3 3 3 3 3 v -3 h 3 v -3 h 3 v -3 h 3 v -3 h -3 -3 -3 -3 -3 -3 -3 -3 -3 -3 -3 -3 -3 -3 -3 -3 -3 -3 -3 -3 -3 -3 -3 -3 -3 -3 -3 -3 -3 -3 -3 -3 -3 -3 -3 -3 -3 -3 z M 9,57 v 3 3 3 3 3 3 3 3 3 3 3 3 3 3 h 3 3 3 3 3 3 3 3 3 3 3 3 3 3 3 3 3 3 3 3 3 3 3 3 3 3 3 3 3 3 3 3 3 3 3 3 3 3 v -3 -3 -3 -3 -3 -3 -3 -3 -3 -3 -3 -3 -3 -3 h -3 -3 -3 -3 -3 -3 -3 -3 -3 -3 -3 -3 -3 -3 -3 -3 -3 -3 -3 -3 -3 -3 -3 -3 -3 -3 -3 -3 -3 -3 -3 -3 -3 -3 -3 -3 -3 z m 90,3 h 3 3 3 3 v 3 3 h -3 -3 -3 -3 V 63 Z M 15,78 h 3 3 3 3 3 3 3 3 3 3 3 3 3 3 3 3 3 3 3 3 3 3 3 3 3 3 3 3 3 3 3 3 3 v 3 3 3 3 h -3 -3 -3 -3 -3 -3 -3 -3 -3 -3 -3 -3 -3 -3 -3 -3 -3 -3 -3 -3 -3 -3 -3 -3 -3 -3 -3 -3 -3 -3 -3 -3 -3 v -3 -3 -3 z"
         id="rect1792"
         inkscape:connector-curvature="0" />
      <path
         style="fill:#808080"
         d="m 18,39 v 3 h 3 3 3 3 3 3 3 3 3 3 3 3 3 3 3 3 3 3 3 3 3 3 3 3 3 3 3 3 3 3 3 3 3 3 3 3 3 3 3 v 3 h -3 v 3 h -3 v 3 h -3 v 3 h -3 v 3 3 3 3 3 3 3 3 3 3 3 3 3 3 3 h -3 -3 -3 -3 -3 -3 -3 H 99 96 93 90 87 84 81 78 75 72 69 66 63 60 57 54 51 48 45 42 39 36 33 30 27 24 21 18 15 12 9 6 V 96 93 90 87 84 81 78 75 72 69 66 63 60 57 54 H 3 v 3 3 3 3 3 3 3 3 3 3 3 3 3 3 3 3 h 3 3 3 3 3 3 3 3 3 3 3 3 3 3 3 3 3 3 3 3 3 3 3 3 3 3 3 3 3 3 3 3 3 3 3 3 3 3 3 3 3 v -3 h 3 v -3 h 3 v -3 h 3 v -3 h 3 v -3 -3 -3 -3 -3 -3 -3 -3 -3 -3 -3 -3 -3 -3 -3 -3 -3 h -3 -3 -3 -3 -3 -3 -3 -3 -3 -3 -3 -3 -3 -3 -3 -3 -3 -3 -3 -3 -3 -3 -3 -3 -3 -3 -3 -3 -3 -3 -3 -3 -3 -3 -3 -3 -3 -3 -3 z M 6,54 H 9 V 51 H 6 Z m 3,-3 h 3 V 48 H 9 Z m 3,-3 h 3 v -3 h -3 z m 3,-3 h 3 v -3 h -3 z m 0,33 v 3 h 3 3 3 3 3 3 3 3 3 3 3 3 3 3 3 3 3 3 3 3 3 3 3 3 3 3 3 3 3 3 3 3 3 v -3 h -3 -3 -3 -3 -3 -3 -3 -3 -3 -3 -3 -3 -3 -3 -3 -3 -3 -3 -3 -3 -3 -3 -3 -3 -3 -3 -3 -3 -3 -3 -3 -3 z m 0,6 v 3 h 3 3 3 3 3 3 3 3 3 3 3 3 3 3 3 3 3 3 3 3 3 3 3 3 3 3 3 3 3 3 3 3 3 v -3 h -3 -3 -3 -3 -3 -3 -3 -3 -3 -3 -3 -3 -3 -3 -3 -3 -3 -3 -3 -3 -3 -3 -3 -3 -3 -3 -3 -3 -3 -3 -3 -3 z"
         id="rect1880"
         inkscape:connector-curvature="0" />
      <path
         style="fill:#000000"
         d="m 138,42 v 3 3 3 3 3 3 3 3 3 3 3 3 3 3 3 3 h 3 v -3 -3 -3 -3 -3 -3 -3 -3 -3 -3 -3 -3 -3 -3 -3 -3 z m 0,48 h -3 v 3 h 3 z m -3,3 h -3 v 3 h 3 z m -3,3 h -3 v 3 h 3 z m -3,3 h -3 v 3 h 3 z m -3,3 h -3 -3 -3 -3 -3 -3 -3 -3 -3 -3 -3 -3 -3 -3 -3 -3 -3 -3 -3 -3 -3 -3 -3 -3 -3 -3 -3 -3 -3 -3 -3 -3 -3 -3 -3 -3 -3 -3 -3 -3 v 3 h 3 3 3 3 3 3 3 3 3 3 3 3 3 3 3 3 3 3 3 3 3 3 3 3 3 3 3 3 3 3 3 3 3 3 3 3 3 3 3 3 z"
         id="rect1962"
         inkscape:connector-curvature="0" />
    </g>
    <text
       xml:space="preserve"
       style="font-style:normal;font-variant:normal;font-weight:normal;font-stretch:normal;font-size:4.23333311px;line-height:1.25;font-family:sans-serif;-inkscape-font-specification:sans-serif;letter-spacing:0px;word-spacing:0px;fill:#000000;fill-opacity:1;stroke:none;stroke-width:0.26458332"
       x="51.121277"
       y="53.016365"
       id="text909"><tspan
         sodipodi:role="line"
         id="tspan907"
         x="51.121277"
         y="53.016365"
         style="stroke-width:0.26458332">DISK/SSD</tspan></text>
    <path
       inkscape:connector-curvature="0"
       style="fill:#800000;stroke-width:0.16536458"
       d="m 35.470647,41.859467 h 0.661458 0.661458 v -0.661458 -0.661458 h 0.661459 0.661458 v -0.661459 -0.661458 h 0.661458 0.661459 v 0.661458 0.661459 0.661458 0.661458 h 0.661458 0.661458 0.661459 0.661458 0.661459 0.661458 0.661458 0.661459 0.661458 0.661458 0.661458 0.661459 0.661458 0.661458 0.661459 0.661458 0.661458 0.661459 0.661458 0.661458 0.661459 -5.291667 v 1.322917 0 H 53.330022 52.668563 52.007105 51.345647 50.684188 50.02273 49.361272 48.699813 48.038355 47.376897 46.715438 46.05398 45.392522 44.731064 44.069605 43.408147 42.746689 42.08523 41.423772 40.762313 40.100855 39.439397 v 0.661458 0.661459 0.661458 0.661458 H 38.777938 38.11648 v -0.661458 -0.661458 h -0.661458 -0.661459 v -0.661459 -0.661458 h -0.661458 -0.661458 v -0.661458 z"
       id="rect938"
       sodipodi:nodetypes="ccccccccccccccccccccccccccccccccccccccccccccccccccccccccccccccccccccccccccccc" />
  </g>
</svg>
