<?xml version="1.0" encoding="UTF-8" standalone="no"?>
<!-- Created with Inkscape (http://www.inkscape.org/) -->

<svg
   xmlns:dc="http://purl.org/dc/elements/1.1/"
   xmlns:cc="http://creativecommons.org/ns#"
   xmlns:rdf="http://www.w3.org/1999/02/22-rdf-syntax-ns#"
   xmlns:svg="http://www.w3.org/2000/svg"
   xmlns="http://www.w3.org/2000/svg"
   xmlns:sodipodi="http://sodipodi.sourceforge.net/DTD/sodipodi-0.dtd"
   xmlns:inkscape="http://www.inkscape.org/namespaces/inkscape"
   width="68.554634mm"
   height="79.51268mm"
   viewBox="0 0 68.554634 79.51268"
   version="1.1"
   id="svg8"
   inkscape:version="0.92.4 (5da689c313, 2019-01-14)"
   sodipodi:docname="black-box.svg">
  <defs
     id="defs2">
    <inkscape:path-effect
       effect="perspective-envelope"
       up_left_point="85.01,72.519685"
       up_right_point="98.64,76.139685"
       down_left_point="84.11,97.639685"
       down_right_point="97.74,102.93969"
       id="path-effect5193"
       is_visible="true"
       deform_type="perspective"
       horizontal_mirror="false"
       vertical_mirror="false"
       overflow_perspective="false" />
    <inkscape:path-effect
       overflow_perspective="false"
       vertical_mirror="false"
       horizontal_mirror="false"
       deform_type="perspective"
       is_visible="true"
       id="path-effect5181"
       down_right_point="95,102.93969"
       down_left_point="82,97.639685"
       up_right_point="99,76.139685"
       up_left_point="85.01,75.519685"
       effect="perspective-envelope" />
    <inkscape:path-effect
       overflow_perspective="true"
       vertical_mirror="false"
       horizontal_mirror="false"
       deform_type="perspective"
       is_visible="true"
       id="path-effect5169"
       down_right_point="97.74,102.93969"
       down_left_point="84.11,97.639685"
       up_right_point="98.64,76.139685"
       up_left_point="85.01,72.519685"
       effect="perspective-envelope" />
    <inkscape:path-effect
       overflow_perspective="false"
       vertical_mirror="false"
       horizontal_mirror="false"
       deform_type="perspective"
       is_visible="true"
       id="path-effect5157"
       down_right_point="106.1,97.719685"
       down_left_point="81.61,107.36969"
       up_right_point="98.84,68.419685"
       up_left_point="85.31069,76.909685"
       effect="perspective-envelope" />
    <inkscape:path-effect
       effect="perspective-envelope"
       up_left_point="85.01,72.519685"
       up_right_point="98.64,76.139685"
       down_left_point="84.11,97.639685"
       down_right_point="97.74,102.93969"
       id="path-effect5145"
       is_visible="true"
       deform_type="perspective"
       horizontal_mirror="false"
       vertical_mirror="false"
       overflow_perspective="false" />
    <filter
       inkscape:collect="always"
       style="color-interpolation-filters:sRGB"
       id="filter1410"
       x="-0.03611692"
       width="1.0722338"
       y="-0.025654962"
       height="1.0513099">
      <feGaussianBlur
         inkscape:collect="always"
         stdDeviation="0.27270085"
         id="feGaussianBlur1412" />
    </filter>
  </defs>
  <sodipodi:namedview
     id="base"
     pagecolor="#ffffff"
     bordercolor="#666666"
     borderopacity="1.0"
     inkscape:pageopacity="0.0"
     inkscape:pageshadow="2"
     inkscape:zoom="1.979899"
     inkscape:cx="227.60217"
     inkscape:cy="91.01112"
     inkscape:document-units="mm"
     inkscape:current-layer="layer1"
     showgrid="false"
     showguides="true"
     inkscape:guide-bbox="true"
     inkscape:window-width="1920"
     inkscape:window-height="1025"
     inkscape:window-x="1080"
     inkscape:window-y="0"
     inkscape:window-maximized="1"
     fit-margin-top="0"
     fit-margin-left="0"
     fit-margin-right="0"
     fit-margin-bottom="0">
    <sodipodi:guide
       position="34.344137,79.512681"
       orientation="0,1"
       id="guide40"
       inkscape:locked="false" />
    <sodipodi:guide
       position="34.344137,-4.8283094e-07"
       orientation="0,1"
       id="guide42"
       inkscape:locked="false" />
    <sodipodi:guide
       position="34.344137,79.512691"
       orientation="1,0"
       id="guide44"
       inkscape:locked="false" />
    <sodipodi:guide
       position="68.554638,59.601101"
       orientation="1,0"
       id="guide46"
       inkscape:locked="false" />
    <sodipodi:guide
       position="8.0749882e-07,59.601101"
       orientation="1,0"
       id="guide48"
       inkscape:locked="false" />
    <sodipodi:guide
       position="68.554638,59.601111"
       orientation="0,1"
       id="guide50"
       inkscape:locked="false" />
    <sodipodi:guide
       position="68.554638,19.91158"
       orientation="0,1"
       id="guide52"
       inkscape:locked="false" />
    <sodipodi:guide
       position="34.344137,39.68952"
       orientation="0,1"
       id="guide57"
       inkscape:locked="false" />
  </sodipodi:namedview>
  <metadata
     id="metadata5">
    <rdf:RDF>
      <cc:Work
         rdf:about="">
        <dc:format>image/svg+xml</dc:format>
        <dc:type
           rdf:resource="http://purl.org/dc/dcmitype/StillImage" />
        <dc:title></dc:title>
      </cc:Work>
    </rdf:RDF>
  </metadata>
  <g
     inkscape:label="Calque 1"
     inkscape:groupmode="layer"
     id="layer1"
     transform="translate(-73.365483,-33.472241)">
    <path
       style="fill:#4d4d4d;fill-opacity:1;stroke:none;stroke-width:0.26458332px;stroke-linecap:butt;stroke-linejoin:miter;stroke-opacity:1"
       d="M 107.70962,33.472241 73.365483,53.38382 107.70962,73.295401 141.92012,53.383809 Z"
       id="path59"
       inkscape:connector-curvature="0" />
    <path
       style="fill:#333333;fill-opacity:1;stroke:none;stroke-width:0.26458332px;stroke-linecap:butt;stroke-linejoin:miter;stroke-opacity:1"
       d="M 73.365483,53.383809 V 93.073341 L 107.70962,112.98492 V 73.295401 Z"
       id="path61"
       inkscape:connector-curvature="0" />
    <path
       style="fill:#1a1a1a;fill-opacity:1;stroke:none;stroke-width:0.26458332px;stroke-linecap:butt;stroke-linejoin:miter;stroke-opacity:1"
       d="m 141.92012,53.383809 v 39.689532 l -34.2105,19.911579 V 73.295401 Z"
       id="path63"
       inkscape:connector-curvature="0" />
    <g
       id="g1418"
       transform="matrix(0.90080622,0,0,0.90080622,6.5309429,3.8478935)"
       inkscape:path-effect="#path-effect5145">
      <g
         aria-label="?"
         style="font-style:normal;font-variant:normal;font-weight:normal;font-stretch:normal;font-size:4.23333311px;line-height:1.25;font-family:sans-serif;-inkscape-font-specification:sans-serif;letter-spacing:0px;word-spacing:0px;opacity:0.6;fill:#000000;fill-opacity:1;stroke:none;stroke-width:0.26458332;stroke-opacity:1;filter:url(#filter1410)"
         id="text968">
        <path
           d="m 93.03562,94.711819 c 0,0 -2.972555,-1.067269 -2.972555,-1.067269 0.01338,-0.605947 0.02236,-0.974648 0.02695,-1.106221 0.04742,-1.35925 0.243613,-2.423138 0.5893,-3.193663 0.346616,-0.772599 1.015929,-1.552755 2.013659,-2.343999 1.006382,-0.798106 1.614123,-1.342324 1.816916,-1.627807 0.313759,-0.454535 0.482185,-1.01171 0.504672,-1.670547 0.03125,-0.915437 -0.205658,-1.77498 -0.708786,-2.575782 -0.492305,-0.805545 -1.174098,-1.333161 -2.041922,-1.584323 -0.829938,-0.240197 -1.530823,-0.106434 -2.105323,0.398005 -0.57165,0.501935 -0.982475,1.399979 -1.234316,2.694544 0,0 -2.8656,-1.403909 -2.8656,-1.403909 0.14906,-1.890791 0.767472,-3.354485 1.863061,-4.398336 1.113718,-1.051852 2.550535,-1.342725 4.324277,-0.858929 1.898598,0.51785 3.408942,1.645298 4.514762,3.389808 1.118536,1.75267 1.65053,3.588168 1.586572,5.492684 -0.03542,1.054793 -0.287231,1.984453 -0.754135,2.786501 -0.457038,0.801762 -1.41079,1.778599 -2.849209,2.92211 -0.737439,0.58631 -1.200063,1.098747 -1.391137,1.53959 -0.182912,0.442951 -0.288574,1.311796 -0.317187,2.607542 0,0 3e-6,1e-6 3e-6,1e-6 z m -3.189716,5.158264 c 0,0 0.161477,-4.629178 0.161477,-4.629178 0,0 3.280338,1.20283 3.280338,1.20283 0,0 -0.161473,4.701905 -0.161473,4.701905 0,0 -3.280342,-1.275557 -3.280342,-1.275557 z"
           style="font-style:normal;font-variant:normal;font-weight:bold;font-stretch:normal;font-size:35.27777863px;font-family:Arial;-inkscape-font-specification:'Arial Bold';fill:#000000;stroke:none;stroke-width:0.26458332;stroke-opacity:1"
           id="path5139"
           inkscape:original-d="m 95.233857,92.826835 h -4.392496 q -0.01723,-0.947401 -0.01723,-1.154107 0,-2.135959 0.706245,-3.513997 0.706244,-1.378038 2.824978,-3.100586 2.118734,-1.722548 2.532145,-2.256538 0.637343,-0.844048 0.637343,-1.860351 0,-1.412489 -1.136882,-2.411567 -1.119656,-1.016303 -3.031684,-1.016303 -1.843126,0 -3.08336,1.050754 -1.240235,1.050754 -1.705323,3.203939 L 84.12342,81.216863 q 0.18948,-3.08336 2.618273,-5.236545 2.446018,-2.153185 6.407878,-2.153185 4.168565,0 6.631809,2.187636 2.46325,2.17041 2.46325,5.064291 0,1.601969 -0.91295,3.031684 -0.89573,1.429714 -3.858515,3.892958 -1.533067,1.274685 -1.912028,2.049832 -0.361735,0.775146 -0.327284,2.773301 z m -4.392496,6.511231 v -4.840359 h 4.840359 v 4.840359 z"
           inkscape:connector-curvature="0" />
      </g>
      <g
         aria-label="?"
         style="font-style:normal;font-variant:normal;font-weight:normal;font-stretch:normal;font-size:4.23333311px;line-height:1.25;font-family:sans-serif;-inkscape-font-specification:sans-serif;letter-spacing:0px;word-spacing:0px;fill:#ffffff;fill-opacity:1;stroke:none;stroke-width:0.26458332;stroke-opacity:1"
         id="text872">
        <path
           d="m 91.645727,92.666781 c 0,0 -2.933013,-1.031812 -2.933013,-1.031812 0.01346,-0.601515 0.02249,-0.967527 0.02708,-1.098153 0.04739,-1.349474 0.241484,-2.407158 0.582988,-3.175031 0.342416,-0.769924 1.003288,-1.550241 1.988223,-2.344484 0.993417,-0.801081 1.593328,-1.346599 1.79355,-1.63172 0.309781,-0.453871 0.476208,-1.008295 0.498689,-1.662305 0.03123,-0.908732 -0.202128,-1.759631 -0.698205,-2.549908 -0.485415,-0.795107 -1.157951,-1.312755 -2.014222,-1.554425 -0.818935,-0.231133 -1.510708,-0.09224 -2.077934,0.413462 -0.56443,0.50321 -0.970309,1.398186 -1.219445,2.685351 0,0 -2.828133,-1.368238 -2.828133,-1.368238 0.14796,-1.878231 0.759081,-3.336577 1.841041,-4.38226 1.099787,-1.053713 2.518062,-1.354826 4.268369,-0.889961 1.873291,0.497529 3.363021,1.603314 4.45324,3.32485 1.102675,1.729388 1.626641,3.54602 1.56269,5.43637 -0.03542,1.046945 -0.28424,1.971665 -0.745195,2.771707 -0.451228,0.799692 -1.392584,1.77763 -2.812265,2.925427 -0.72788,0.588547 -1.184588,1.101297 -1.373322,1.540528 -0.180684,0.441254 -0.28533,1.304456 -0.314134,2.590601 0,0 2e-6,10e-7 2e-6,10e-7 z m -3.15004,5.148874 c 0,0 0.161376,-4.595823 0.161376,-4.595823 0,0 3.236659,1.163327 3.236659,1.163327 0,0 -0.161403,4.667497 -0.161403,4.667497 0,0 -3.236632,-1.235001 -3.236632,-1.235001 z"
           style="font-style:normal;font-variant:normal;font-weight:bold;font-stretch:normal;font-size:35.27777863px;font-family:Arial;-inkscape-font-specification:'Arial Bold';fill:#ffffff;stroke:none;stroke-width:0.26458332;stroke-opacity:1"
           id="path5142"
           inkscape:original-d="m 93.117189,91.239334 h -4.392497 q -0.01723,-0.947401 -0.01723,-1.154107 0,-2.135959 0.706245,-3.513998 0.706245,-1.378038 2.824978,-3.100586 2.118734,-1.722547 2.532146,-2.256537 0.637342,-0.844049 0.637342,-1.860352 0,-1.412489 -1.136881,-2.411567 -1.119656,-1.016303 -3.031684,-1.016303 -1.843127,0 -3.083361,1.050754 -1.240234,1.050754 -1.705322,3.203939 l -4.444174,-0.551215 q 0.189481,-3.083361 2.618273,-5.236545 2.446018,-2.153185 6.407878,-2.153185 4.168565,0 6.631809,2.187636 2.463249,2.17041 2.463249,5.06429 0,1.601969 -0.912956,3.031684 -0.895725,1.429715 -3.858507,3.892958 -1.533068,1.274686 -1.912028,2.049832 -0.361735,0.775147 -0.327284,2.773302 z m -4.392497,6.511231 v -4.84036 h 4.840359 v 4.84036 z"
           inkscape:connector-curvature="0" />
      </g>
    </g>
  </g>
</svg>
