<?xml version="1.0" encoding="UTF-8" standalone="no"?>
<svg xmlns:dc="http://purl.org/dc/elements/1.1/" xmlns:cc="http://creativecommons.org/ns#" xmlns:rdf="http://www.w3.org/1999/02/22-rdf-syntax-ns#" xmlns:svg="http://www.w3.org/2000/svg" xmlns="http://www.w3.org/2000/svg" viewBox="0 0 630.66669 264" height="264" width="630.66669" xml:space="preserve" id="svg70" version="1.1" preserveAspectRatio="xMinYMin meet">
  <metadata id="metadata76">
    <rdf:RDF>
      <cc:Work rdf:about="">
        <dc:format>image/svg+xml</dc:format>
        <dc:type rdf:resource="http://purl.org/dc/dcmitype/StillImage"/>
        <dc:title/>
      </cc:Work>
    </rdf:RDF>
  </metadata>
  <defs id="defs74">
    <clipPath id="clipPath88" clipPathUnits="userSpaceOnUse">
      <path id="path86" d="M 0,0 H 4723.2 V 1980 H 0 Z"/>
    </clipPath>
  </defs>
  <g transform="matrix(1.3333333,0,0,-1.3333333,0,264)" id="g78">
    <g transform="matrix(9.2426419,0,0,-9.2426419,23.082904,137.04894)" id="g12">
      <path d="M 33.789,8.492 C 32.844,8.359 32.219,8.098 31.703,7.609 31.121,7.059 30.762,6.262 30.652,5.262 30.633,5.113 30.625,4.023 30.621,2.582 V 0.156 h 2.047 l 0.008,2.539 c 0.008,2.52 0.012,2.539 0.07,2.754 0.176,0.621 0.524,0.989 1.086,1.141 0.238,0.062 0.773,0.066 1.035,0.004 0.278,-0.071 0.543,-0.219 0.715,-0.406 0.18,-0.196 0.273,-0.364 0.371,-0.68 l 0.078,-0.246 0.008,-2.555 0.008,-2.551 h 2.047 L 38.086,2.75 c -0.008,2.547 -0.012,2.598 -0.07,2.902 -0.309,1.551 -1.184,2.457 -2.676,2.778 -0.223,0.047 -0.395,0.058 -0.871,0.066 -0.328,0.004 -0.633,0.004 -0.68,0 z m 8.16,0 C 40.695,8.367 39.664,8.109 38.926,7.738 L 38.758,7.652 38.922,7.191 c 0.367,-1.054 0.441,-1.261 0.449,-1.269 0.008,-0.008 0.152,0.055 0.328,0.137 0.535,0.257 1.176,0.453 1.836,0.558 0.426,0.067 1.438,0.086 1.707,0.031 0.465,-0.097 0.688,-0.304 0.688,-0.64 0,-0.43 -0.379,-0.641 -1.676,-0.942 C 40.906,4.754 40.363,4.555 39.875,4.18 39.324,3.762 39.09,3.184 39.121,2.348 c 0.016,-0.383 0.07,-0.602 0.223,-0.907 0.363,-0.718 1.094,-1.191 2.152,-1.386 0.414,-0.078 1.586,-0.071 2.156,0.015 0.75,0.114 1.516,0.332 1.996,0.575 L 45.836,0.738 45.797,0.84 C 45.664,1.211 45.219,2.359 45.203,2.379 45.191,2.391 45.082,2.352 44.961,2.293 44.559,2.09 44.008,1.926 43.391,1.828 43.02,1.77 42.148,1.746 41.891,1.785 41.34,1.871 41.062,2.113 41.117,2.461 c 0.028,0.164 0.086,0.254 0.231,0.344 0.187,0.121 0.425,0.195 1.488,0.461 0.519,0.129 1.07,0.277 1.23,0.336 1.032,0.359 1.645,0.929 1.86,1.722 0.082,0.309 0.086,0.922 0,1.254 -0.246,0.996 -1.028,1.633 -2.289,1.867 -0.239,0.043 -1.399,0.078 -1.688,0.047 z M 0,8.332 C 0,8.324 0.938,6.48 2.082,4.238 L 4.16,0.156 h 1.774 l 2.074,4.067 c 1.14,2.238 2.078,4.082 2.086,4.097 0.004,0.016 -0.438,0.024 -1.145,0.024 H 7.801 L 6.414,5.551 C 5.648,4.016 5.02,2.758 5.008,2.758 c -0.016,0 -1.219,2.433 -1.219,2.469 0,0.011 0.371,0.019 0.824,0.019 H 5.438 L 5.844,6.082 C 6.07,6.543 6.25,6.934 6.25,6.953 6.25,6.98 5.898,6.988 4.582,6.988 H 2.91 L 2.578,7.668 2.242,8.344 H 1.121 C 0.504,8.344 0,8.34 0,8.332 Z M 10.512,4.25 V 0.156 h 1.992 v 8.188 h -1.992 z m 3.332,4.059 C 13.836,8.289 13.836,6.453 13.836,4.223 l 0.008,-4.051 h 2.379 c 2.629,0 2.613,-0.004 3.172,0.18 1.25,0.406 1.929,1.492 1.793,2.871 -0.106,1.066 -0.637,1.765 -1.594,2.097 -0.145,0.047 -0.262,0.094 -0.266,0.102 -0.004,0.008 0.387,0.633 0.867,1.39 0.477,0.758 0.891,1.415 0.918,1.454 L 21.16,8.344 H 18.879 L 17.516,6.164 16.152,3.988 17.266,3.973 c 0.957,-0.016 1.136,-0.024 1.269,-0.067 0.449,-0.144 0.668,-0.453 0.668,-0.957 0,-0.383 -0.117,-0.637 -0.375,-0.812 -0.266,-0.18 -0.301,-0.184 -1.711,-0.184 h -1.265 v 6.391 h -0.997 c -0.773,0 -1,-0.008 -1.011,-0.035 z M 22.129,4.25 V 0.152 l 2.609,0.012 c 2.367,0.008 2.625,0.016 2.813,0.059 0.57,0.132 0.984,0.343 1.297,0.656 0.422,0.422 0.605,0.937 0.578,1.613 -0.028,0.664 -0.285,1.156 -0.785,1.5 l -0.145,0.102 0.227,0.109 c 0.312,0.156 0.648,0.492 0.816,0.813 0.176,0.343 0.234,0.589 0.234,1.019 0.004,0.434 -0.043,0.637 -0.218,1 -0.34,0.699 -1.09,1.16 -2.071,1.277 -0.164,0.024 -1.121,0.032 -2.8,0.032 h -2.555 z m 5.043,2.297 C 27.348,6.48 27.523,6.316 27.613,6.137 27.664,6.031 27.676,5.961 27.676,5.773 27.676,5.562 27.668,5.52 27.594,5.387 27.496,5.207 27.363,5.098 27.172,5.023 27.031,4.973 26.953,4.969 25.586,4.969 h -1.438 v 1.633 h 1.438 c 1.371,0 1.445,-0.004 1.586,-0.055 z M 27.066,3.273 C 27.207,3.211 27.348,3.078 27.422,2.938 27.469,2.852 27.48,2.777 27.48,2.617 27.484,2.438 27.473,2.391 27.398,2.262 27.312,2.102 27.152,1.977 26.973,1.926 26.914,1.91 26.316,1.898 25.512,1.898 H 24.148 V 3.34 L 25.555,3.332 C 26.836,3.324 26.969,3.32 27.066,3.273 Z" style="fill:#23373b;fill-opacity:1;fill-rule:nonzero;stroke:none" id="path14"/>
    </g>
  </g>
</svg>
