a function, named printInfo, is added to simulator.h. It prints out the...

a function, named printInfo, is added to simulator.h. It prints out the registers value. This function is called 2 times. when we have a break point, for Fault injection, and when the simulation execution is done.
5 jobs for architecturalFaultInjection in 31 seconds (queued for 1 second)
Status Job ID Name Coverage
  Build
failed #1097456
cbuild

00:00:31

 
  Test
skipped #1097458
test:applications
skipped #1097457
test:atomic
 
  Hls
skipped #1097459
catapult_ASIC
skipped #1097460
catapult_Xilinx
 
Name Stage Failure
failed
cbuild Build
   std::ofstream rFile;
^
/udd/srokicki/builds/dQ-WesJC/0/srokicki/Comet/./include/simulator.h:142:17: error: aggregate ‘std::ofstream cFile’ has incomplete type and cannot be defined
std::ofstream cFile;
^
make[2]: *** [CMakeFiles/comet.sim.dir/src/basic_simulator.cpp.o] Error 1
make[1]: *** [CMakeFiles/comet.sim.dir/all] Error 2
make: *** [all] Error 2
ERROR: Job failed: exit status 1