{
    "name": "AV_model",
    "wandb_n": "",
    "n_gpu": 1,
    "arch": {
        "type": "SeparationModel",
        "args": {
            "n_fftBins": 512,
            "BN_dim": 256,
            "H_dim": 512,
            "layer": 8,
            "stack": 3,
            "kernel": 3,
            "num_spk": 2,
            "skip": false,
            "dilated": true,
            "casual": false,
            "pretrained_csd": false,
            "path_pretrained_csd": "/home/dsi/moradim/Results/train_only_csd_weighted_LN_schedule_clip1_PReLU_try2/Weights/model_best_2022_03_22-11:13:38_AM.pth",
            "freeze_csd_weights": false,
            "finetune": false,
            "bool_drop": true,
            "drop_value": 0.05,
            "wen": true,
            "mel_bool": false,
            "middle_vad": false,
            "final_vad": true,
            "csd_bool": false,
            "noisy_phase": true,
            "complex_masks": false,
            "activity_input_bool": true,
            "pc_bool": false,
            "middle_layer": false
        }
    },
    "data_loader": {
        "type": "Old_Partial_DataLoader",
        "args": {
            "csv_file": "/dsi/gannot-lab/datasets/mordehay/data_wham_partial_overlap/train/csv_files/with_wham_noise_res.csv",
            "cds_lables": "/dsi/gannot-lab/datasets/mordehay/data_wham_partial_overlap/train/labels_npz/",
            "batch_size": 16,
            "type_dataset": "old",
            "shuffle": true,
            "validation_split": 0.2,
            "num_workers": 8
        }
    },
    "optimizer": {
        "type": "Adam",
        "args": {
            "lr": 0.001,
            "weight_decay": 0,
            "amsgrad": true
        }
    },
    "loss_separation": {
        "type": "PITLossWrapper",
        "loss_func": "pairwise_neg_sisdr",
        "perm_reduce": false,
        "args": {
            "pit_from": "pw_mtx"
        }
    },
    "loss_vad": {
        "type": "PITLossWrapper",
        "loss_func": "BinaryCrossEntropyLoss_Mean",
        "args": {
            "pit_from": "pw_pt"
        }
    },
    "mse_vad_only": {
        "type": "PITLossWrapper",
        "loss_func": "MSE_with_VA_only",
        "args": {
            "pit_from": "pw_pt"
        }
    },
    "combined_loss": {
        "weight_separation_loss": 0.99,
        "weight_vad_loss": 0.01,
        "weight_vad_sum_loss": 0,
        "weight_csd_loss": 0,
        "weight_sum_csd_loss": 0,
        "weight_mse_loss": 0,
        "weight_mse_vad_loss": 0,
        "mse_vad_only_loss": false,
        "weight_sobel_loss": 0,
        "weight_complement_loss": 0,
        "min_over_spk_complement_loss": false,
        "weight_stoi_loss": 0,
        "weight_cosine_similarity": 0,
        "min_over_spk": false
    },
    "metrics": {
        "separation": [
            "pit_snr",
            "pit_si_sdr"
        ],
        "separation_mix": [
            "si_sdri"
        ],
        "vad": [
            "pit_CE_vad"
        ],
        "vad_acc": [
            "vad_accuracy"
        ],
        "vad_sum_acc": [
            "vad_sum_accuracy"
        ],
        "csd_acc": [
            "csd_accuracy"
        ],
        "perceptual": [
            "stoi_met"
        ]
    },
    "lr_scheduler": {
        "type": "CosineAnnealingWarmRestarts",
        "args": {
            "T_0": 3,
            "eta_min": 0.00025,
            "verbose": false
        }
    },
    "trainer": {
        "epochs": 1000,
        "accum_iter": 1,
        "vad_decay_weight": 0.95,
        "mse_decay_weight": 1,
        "com_sisdr_decay_weight": 1,
        "swa_start": 2000,
        "vad_bool": false,
        "csd_bool": false,
        "save_dir": "/dsi/gannot-lab/datasets/mordehay/Result/Separation_data_wham_partial_overlap_mod4p1dialiation_Vad099_decay095_inputActivity_CosineAnnealing",
        "save_period": 40,
        "verbosity": 2,
        "max_clip": 5,
        "monitor": "max val_pit_si_sdr",
        "early_stop": 1000,
        "tensorboard": true
    },
    "tester": {
        "GradCam": false,
        "online": {
            "online_bool": true,
            "similarity": false
        },
        "save_test": "/dsi/gannot-lab/datasets/mordehay/Result/test_for_git/Separation_data_wham_partial_overlap_MultiDial_Vad099_decay095_inputActivity_CosineAnnealing_Test/",
        "csv_file_test": "/dsi/gannot-lab/datasets/mordehay/data_wham_partial_overlap/test/csv_files/with_wham_noise_res.csv",
        "cds_lables": "/dsi/gannot-lab/datasets/mordehay/data_wham_partial_overlap/test/labels_npz/",
        "type_dataset": "old",
        "save_test_real": "/dsi/gannot-lab/datasets/mordehay/Result/yoav_mordehay_hebrew_vad/",
        "save_dir": "save_test_RandT60/"
    }
}