{
    "name": "CSD_model",
    "wandb_n":"weighted_LN_schedule_clip1_PReLU_try2",
    "n_gpu": 1,

    "arch": {
        "type": "SeparationModel",
        "args": {
            "n_fftBins": 512,
            "BN_dim": 256,
            "H_dim": 512,
            "layer": 8,
            "stack": 3,
            "kernel":3,
            "num_spk": 2,
            "skip": false,
            "dilated": true,
            "casual": false
        }
    },
    "data_loader": {
        "type": "NoisyWsjDataLoader",
        "args":{

            "csv_file": "/dsi/gannot-lab/datasets/mordehay/LibriSpeech_mix_with_overlap/train/csv_files/with_white_noise_res.csv",
            "cds_lables": "/dsi/gannot-lab/datasets/mordehay/LibriSpeech_mix_with_overlap/train/labels_npz/",
            "batch_size": 512,
            "shuffle": true,
            "validation_split": 0.2,
            "num_workers": 8,
            "pin_memory":false
        }
    },
    "optimizer": {
        "type": "Adam",
        "args":{
            "lr": 0.001,
            "weight_decay": 0,
            "amsgrad": true
        }
    },
    "loss_separation": {
        "type": "PITLossWrapper",
        "loss_func":"pairwise_neg_sisdr",
        "perm_reduce": false,
        "args": {

            "pit_from": "pw_mtx"
        }
    },
    "loss_csd": {
        "type": "PITLossWrapper",
        "loss_func":"CrossEntropyLoss_Mean",
        "args": {

            "pit_from": "pw_pt"
        }
    },
    "combined_loss":{
        "weight_separation_loss": 0.75,
        "weight_csd_individual_loss": 0.75,
        "weight_csd_loss": 0.5
    },
    "metrics":{
        "csd": ["pit_CE_csd"]
    },
    "lr_scheduler": {
        "type": "ReduceLROnPlateau",
        "args": {
            "factor": 0.5,
            "patience": 1,
            "verbose": false,
            "mode": "max"
        }
        
    },
    "trainer": {
        "epochs": 100,
        "do_validation": true,
        "save_dir": "/home/dsi/moradim/Results/train_only_csd_weighted_LN_schedule_clip1_PReLU_try2/",
        "save_period": 1,
        "verbosity": 2,
        "max_clip": 1,
        "monitor": "min val_loss",
        "early_stop": 50,
        "tensorboard": true
    },
    "tester": {
        "save_test": "/home/dsi/moradim/Results_local/save_test_csd_only_weighted_LN_schedule_clip1_PReLU_try2/",
        "csv_file_test": "/dsi/gannot-lab/datasets/mordehay/LibriSpeech_mix_with_overlap/test/csv_files/with_white_noise_res.csv",
        "cds_lables": "/dsi/gannot-lab/datasets/mordehay/LibriSpeech_mix_with_overlap/test/labels_npz/",
        "save_test_real": "/dsi/gannot-lab/datasets/mordehay/save_test_real_robot_french/",
        "save_dir": "save_test_RandT60/"
    }
}
