P,X,Y,iter,cell_ns,b,s,algo,time
16,6144,6144,2048,1,128,-1,classical,34.276633
16,6144,6144,2048,1,128,-1,classical,34.498831
16,6144,6144,2048,1,128,-1,classical,34.483624
16,6144,6144,2048,1,128,-1,classical,34.464992
16,6144,6144,2048,1,128,-1,classical,34.486891
16,6144,6144,2048,1,128,-1,classical,34.450514
16,6144,6144,2048,1,128,-1,classical,34.578026
16,6144,6144,2048,1,128,-1,classical,34.439623
16,6144,6144,2048,1,128,-1,classical,34.515579
16,6144,6144,2048,1,128,-1,classical,34.400325
16,6144,6144,2048,1,128,128,communication-avoiding,10.507875
16,6144,6144,2048,1,128,128,communication-avoiding,10.365078
16,6144,6144,2048,1,128,128,communication-avoiding,10.378175
16,6144,6144,2048,1,128,128,communication-avoiding,10.410671
16,6144,6144,2048,1,128,128,communication-avoiding,10.406971
16,6144,6144,2048,1,128,128,communication-avoiding,10.191032
16,6144,6144,2048,1,128,128,communication-avoiding,10.334952
16,6144,6144,2048,1,128,128,communication-avoiding,10.456704
16,6144,6144,2048,1,128,128,communication-avoiding,10.352504
16,6144,6144,2048,1,128,128,communication-avoiding,10.228245
16,6144,6144,2048,1,128,256,communication-avoiding,12.873041
16,6144,6144,2048,1,128,256,communication-avoiding,12.834069
16,6144,6144,2048,1,128,256,communication-avoiding,12.732444
16,6144,6144,2048,1,128,256,communication-avoiding,12.778024
16,6144,6144,2048,1,128,256,communication-avoiding,12.883434
16,6144,6144,2048,1,128,256,communication-avoiding,12.717922
16,6144,6144,2048,1,128,256,communication-avoiding,12.654150
16,6144,6144,2048,1,128,256,communication-avoiding,12.722340
16,6144,6144,2048,1,128,256,communication-avoiding,12.370669
16,6144,6144,2048,1,128,256,communication-avoiding,12.707657
16,6144,6144,2048,1,128,512,communication-avoiding,16.207891
16,6144,6144,2048,1,128,512,communication-avoiding,16.664735
16,6144,6144,2048,1,128,512,communication-avoiding,16.593310
16,6144,6144,2048,1,128,512,communication-avoiding,16.574543
16,6144,6144,2048,1,128,512,communication-avoiding,16.546437
16,6144,6144,2048,1,128,512,communication-avoiding,16.608890
16,6144,6144,2048,1,128,512,communication-avoiding,16.659340
16,6144,6144,2048,1,128,512,communication-avoiding,16.765561
16,6144,6144,2048,1,128,512,communication-avoiding,16.614919
16,6144,6144,2048,1,128,512,communication-avoiding,16.538122
16,6144,6144,2048,1,256,-1,classical,11.545099
16,6144,6144,2048,1,256,-1,classical,9.599822
16,6144,6144,2048,1,256,-1,classical,8.697712
16,6144,6144,2048,1,256,-1,classical,8.603146
16,6144,6144,2048,1,256,-1,classical,8.656166
16,6144,6144,2048,1,256,-1,classical,8.504429
16,6144,6144,2048,1,256,-1,classical,8.496601
16,6144,6144,2048,1,256,-1,classical,8.521452
16,6144,6144,2048,1,256,-1,classical,8.356217
16,6144,6144,2048,1,256,-1,classical,8.352370
16,6144,6144,2048,1,256,256,communication-avoiding,3.392739
16,6144,6144,2048,1,256,256,communication-avoiding,3.497025
16,6144,6144,2048,1,256,256,communication-avoiding,3.373358
16,6144,6144,2048,1,256,256,communication-avoiding,3.388109
16,6144,6144,2048,1,256,256,communication-avoiding,3.370777
16,6144,6144,2048,1,256,256,communication-avoiding,3.377627
16,6144,6144,2048,1,256,256,communication-avoiding,3.596412
16,6144,6144,2048,1,256,256,communication-avoiding,3.380610
16,6144,6144,2048,1,256,256,communication-avoiding,3.393498
16,6144,6144,2048,1,256,256,communication-avoiding,3.384906
16,6144,6144,2048,1,256,512,communication-avoiding,4.358593
16,6144,6144,2048,1,256,512,communication-avoiding,4.336935
16,6144,6144,2048,1,256,512,communication-avoiding,4.424094
16,6144,6144,2048,1,256,512,communication-avoiding,4.445535
16,6144,6144,2048,1,256,512,communication-avoiding,4.494021
16,6144,6144,2048,1,256,512,communication-avoiding,4.435905
16,6144,6144,2048,1,256,512,communication-avoiding,4.421154
16,6144,6144,2048,1,256,512,communication-avoiding,4.417874
16,6144,6144,2048,1,256,512,communication-avoiding,4.435559
16,6144,6144,2048,1,256,512,communication-avoiding,4.394219
16,6144,6144,2048,1,256,1024,communication-avoiding,6.839784
16,6144,6144,2048,1,256,1024,communication-avoiding,6.748023
16,6144,6144,2048,1,256,1024,communication-avoiding,7.002138
16,6144,6144,2048,1,256,1024,communication-avoiding,6.991255
16,6144,6144,2048,1,256,1024,communication-avoiding,6.985338
16,6144,6144,2048,1,256,1024,communication-avoiding,6.992041
16,6144,6144,2048,1,256,1024,communication-avoiding,7.004233
16,6144,6144,2048,1,256,1024,communication-avoiding,7.022907
16,6144,6144,2048,1,256,1024,communication-avoiding,7.001241
16,6144,6144,2048,1,256,1024,communication-avoiding,6.992214
16,6144,6144,4096,1,128,-1,classical,63.117900
16,6144,6144,4096,1,128,-1,classical,62.126397
16,6144,6144,4096,1,128,-1,classical,61.930007
16,6144,6144,4096,1,128,-1,classical,62.018987
16,6144,6144,4096,1,128,-1,classical,65.787166
16,6144,6144,4096,1,128,-1,classical,65.684560
16,6144,6144,4096,1,128,128,communication-avoiding,21.123925
16,6144,6144,4096,1,128,128,communication-avoiding,21.586218
16,6144,6144,4096,1,128,128,communication-avoiding,21.233028
16,6144,6144,4096,1,128,128,communication-avoiding,21.779855
16,6144,6144,4096,1,128,128,communication-avoiding,21.015460
16,6144,6144,4096,1,128,128,communication-avoiding,22.164875
16,6144,6144,4096,1,128,256,communication-avoiding,24.211791
16,6144,6144,4096,1,128,256,communication-avoiding,24.110198
16,6144,6144,4096,1,128,256,communication-avoiding,24.081122
16,6144,6144,4096,1,128,256,communication-avoiding,24.135535
16,6144,6144,4096,1,128,256,communication-avoiding,24.349198
16,6144,6144,4096,1,128,256,communication-avoiding,24.583210
16,6144,6144,4096,1,128,512,communication-avoiding,32.396668
16,6144,6144,4096,1,128,512,communication-avoiding,32.318688
16,6144,6144,4096,1,128,512,communication-avoiding,32.188468
16,6144,6144,4096,1,128,512,communication-avoiding,32.279282
16,6144,6144,4096,1,128,512,communication-avoiding,32.634616
16,6144,6144,4096,1,128,512,communication-avoiding,32.566780
16,6144,6144,4096,1,256,-1,classical,18.779941
16,6144,6144,4096,1,256,-1,classical,17.760123
16,6144,6144,4096,1,256,-1,classical,17.435495
16,6144,6144,4096,1,256,-1,classical,17.258487
16,6144,6144,4096,1,256,-1,classical,17.158619
16,6144,6144,4096,1,256,-1,classical,17.122108
16,6144,6144,4096,1,256,256,communication-avoiding,6.746400
16,6144,6144,4096,1,256,256,communication-avoiding,6.674424
16,6144,6144,4096,1,256,256,communication-avoiding,6.704173
16,6144,6144,4096,1,256,256,communication-avoiding,6.679558
16,6144,6144,4096,1,256,256,communication-avoiding,6.791571
16,6144,6144,4096,1,256,256,communication-avoiding,6.712922
16,6144,6144,4096,1,256,512,communication-avoiding,8.846538
16,6144,6144,4096,1,256,512,communication-avoiding,8.784161
16,6144,6144,4096,1,256,512,communication-avoiding,8.984566
16,6144,6144,4096,1,256,512,communication-avoiding,9.066525
16,6144,6144,4096,1,256,512,communication-avoiding,8.947077
16,6144,6144,4096,1,256,512,communication-avoiding,9.042174
16,6144,6144,4096,1,256,1024,communication-avoiding,14.015728
16,6144,6144,4096,1,256,1024,communication-avoiding,13.944619
16,6144,6144,4096,1,256,1024,communication-avoiding,14.064058
16,6144,6144,4096,1,256,1024,communication-avoiding,14.003151
16,6144,6144,4096,1,256,1024,communication-avoiding,14.067244
16,6144,6144,4096,1,256,1024,communication-avoiding,14.055701
16,6144,6144,2048,16,128,-1,classical,33.097948
16,6144,6144,2048,16,128,-1,classical,31.223187
16,6144,6144,2048,16,128,-1,classical,31.159792
16,6144,6144,2048,16,128,-1,classical,31.291683
16,6144,6144,2048,16,128,-1,classical,31.215163
16,6144,6144,2048,16,128,-1,classical,31.200258
16,6144,6144,2048,16,128,-1,classical,31.332695
16,6144,6144,2048,16,128,-1,classical,31.228184
16,6144,6144,2048,16,128,-1,classical,31.293473
16,6144,6144,2048,16,128,-1,classical,31.230412
16,6144,6144,2048,16,128,128,communication-avoiding,9.978026
16,6144,6144,2048,16,128,128,communication-avoiding,9.956107
16,6144,6144,2048,16,128,128,communication-avoiding,9.886343
16,6144,6144,2048,16,128,128,communication-avoiding,9.850398
16,6144,6144,2048,16,128,128,communication-avoiding,9.938477
16,6144,6144,2048,16,128,128,communication-avoiding,9.908718
16,6144,6144,2048,16,128,128,communication-avoiding,9.880732
16,6144,6144,2048,16,128,128,communication-avoiding,9.870314
16,6144,6144,2048,16,128,128,communication-avoiding,9.917546
16,6144,6144,2048,16,128,128,communication-avoiding,9.886408
16,6144,6144,2048,16,128,256,communication-avoiding,11.625170
16,6144,6144,2048,16,128,256,communication-avoiding,11.666030
16,6144,6144,2048,16,128,256,communication-avoiding,11.597968
16,6144,6144,2048,16,128,256,communication-avoiding,11.659313
16,6144,6144,2048,16,128,256,communication-avoiding,11.570963
16,6144,6144,2048,16,128,256,communication-avoiding,11.660565
16,6144,6144,2048,16,128,256,communication-avoiding,11.871615
16,6144,6144,2048,16,128,256,communication-avoiding,11.707329
16,6144,6144,2048,16,128,256,communication-avoiding,11.705814
16,6144,6144,2048,16,128,256,communication-avoiding,11.697574
16,6144,6144,2048,16,128,512,communication-avoiding,15.411489
16,6144,6144,2048,16,128,512,communication-avoiding,15.462928
16,6144,6144,2048,16,128,512,communication-avoiding,15.404633
16,6144,6144,2048,16,128,512,communication-avoiding,15.440945
16,6144,6144,2048,16,128,512,communication-avoiding,15.562189
16,6144,6144,2048,16,128,512,communication-avoiding,15.336262
16,6144,6144,2048,16,128,512,communication-avoiding,15.457757
16,6144,6144,2048,16,128,512,communication-avoiding,15.396999
16,6144,6144,2048,16,128,512,communication-avoiding,15.452793
16,6144,6144,2048,16,128,512,communication-avoiding,15.408634
16,6144,6144,2048,16,256,-1,classical,8.473789
16,6144,6144,2048,16,256,-1,classical,8.397954
16,6144,6144,2048,16,256,-1,classical,8.420851
16,6144,6144,2048,16,256,-1,classical,8.354604
16,6144,6144,2048,16,256,-1,classical,8.415697
16,6144,6144,2048,16,256,-1,classical,8.381585
16,6144,6144,2048,16,256,-1,classical,8.457938
16,6144,6144,2048,16,256,-1,classical,8.399749
16,6144,6144,2048,16,256,-1,classical,8.426384
16,6144,6144,2048,16,256,-1,classical,8.527107
16,6144,6144,2048,16,256,256,communication-avoiding,3.848820
16,6144,6144,2048,16,256,256,communication-avoiding,3.969289
16,6144,6144,2048,16,256,256,communication-avoiding,3.979106
16,6144,6144,2048,16,256,256,communication-avoiding,4.046598
16,6144,6144,2048,16,256,256,communication-avoiding,4.207168
16,6144,6144,2048,16,256,256,communication-avoiding,4.038400
16,6144,6144,2048,16,256,256,communication-avoiding,3.917506
16,6144,6144,2048,16,256,256,communication-avoiding,3.901651
16,6144,6144,2048,16,256,256,communication-avoiding,3.892061
16,6144,6144,2048,16,256,256,communication-avoiding,4.011541
16,6144,6144,2048,16,256,512,communication-avoiding,5.048235
16,6144,6144,2048,16,256,512,communication-avoiding,5.015331
16,6144,6144,2048,16,256,512,communication-avoiding,5.015058
16,6144,6144,2048,16,256,512,communication-avoiding,5.008790
16,6144,6144,2048,16,256,512,communication-avoiding,5.065548
16,6144,6144,2048,16,256,512,communication-avoiding,5.129016
16,6144,6144,2048,16,256,512,communication-avoiding,5.357227
16,6144,6144,2048,16,256,512,communication-avoiding,5.074935
16,6144,6144,2048,16,256,512,communication-avoiding,5.050909
16,6144,6144,2048,16,256,512,communication-avoiding,5.068888
16,6144,6144,2048,16,256,1024,communication-avoiding,7.950888
16,6144,6144,2048,16,256,1024,communication-avoiding,8.208594
16,6144,6144,2048,16,256,1024,communication-avoiding,8.067985
16,6144,6144,2048,16,256,1024,communication-avoiding,7.930446
16,6144,6144,2048,16,256,1024,communication-avoiding,7.898831
16,6144,6144,2048,16,256,1024,communication-avoiding,7.952777
16,6144,6144,2048,16,256,1024,communication-avoiding,7.875048
16,6144,6144,2048,16,256,1024,communication-avoiding,7.845447
16,6144,6144,2048,16,256,1024,communication-avoiding,7.848233
16,6144,6144,2048,16,256,1024,communication-avoiding,7.862932
16,6144,6144,4096,16,128,-1,classical,68.279541
16,6144,6144,4096,16,128,-1,classical,62.475265
16,6144,6144,4096,16,128,-1,classical,61.770091
16,6144,6144,4096,16,128,-1,classical,61.280100
16,6144,6144,4096,16,128,-1,classical,61.004118
16,6144,6144,4096,16,128,-1,classical,60.515306
16,6144,6144,4096,16,128,128,communication-avoiding,19.761799
16,6144,6144,4096,16,128,128,communication-avoiding,19.775515
16,6144,6144,4096,16,128,128,communication-avoiding,19.700991
16,6144,6144,4096,16,128,128,communication-avoiding,19.726559
16,6144,6144,4096,16,128,128,communication-avoiding,19.932327
16,6144,6144,4096,16,128,128,communication-avoiding,19.812849
16,6144,6144,4096,16,128,256,communication-avoiding,23.182964
16,6144,6144,4096,16,128,256,communication-avoiding,23.157176
16,6144,6144,4096,16,128,256,communication-avoiding,23.252299
16,6144,6144,4096,16,128,256,communication-avoiding,23.080036
16,6144,6144,4096,16,128,256,communication-avoiding,23.064118
16,6144,6144,4096,16,128,256,communication-avoiding,22.967957
16,6144,6144,4096,16,128,512,communication-avoiding,30.483524
16,6144,6144,4096,16,128,512,communication-avoiding,30.441068
16,6144,6144,4096,16,128,512,communication-avoiding,30.425334
16,6144,6144,4096,16,128,512,communication-avoiding,30.507043
16,6144,6144,4096,16,128,512,communication-avoiding,30.574861
16,6144,6144,4096,16,128,512,communication-avoiding,30.476301
16,6144,6144,4096,16,256,-1,classical,16.708890
16,6144,6144,4096,16,256,-1,classical,16.974022
16,6144,6144,4096,16,256,-1,classical,16.796344
16,6144,6144,4096,16,256,-1,classical,16.884547
16,6144,6144,4096,16,256,-1,classical,16.812617
16,6144,6144,4096,16,256,-1,classical,16.772970
16,6144,6144,4096,16,256,256,communication-avoiding,8.199559
16,6144,6144,4096,16,256,256,communication-avoiding,8.032604
16,6144,6144,4096,16,256,256,communication-avoiding,8.372617
16,6144,6144,4096,16,256,256,communication-avoiding,8.638629
16,6144,6144,4096,16,256,256,communication-avoiding,9.244179
16,6144,6144,4096,16,256,256,communication-avoiding,8.384542
16,6144,6144,4096,16,256,512,communication-avoiding,10.301517
16,6144,6144,4096,16,256,512,communication-avoiding,10.446337
16,6144,6144,4096,16,256,512,communication-avoiding,10.772845
16,6144,6144,4096,16,256,512,communication-avoiding,10.285332
16,6144,6144,4096,16,256,512,communication-avoiding,10.063410
16,6144,6144,4096,16,256,512,communication-avoiding,10.465711
16,6144,6144,4096,16,256,1024,communication-avoiding,16.137479
16,6144,6144,4096,16,256,1024,communication-avoiding,16.322928
16,6144,6144,4096,16,256,1024,communication-avoiding,16.687540
16,6144,6144,4096,16,256,1024,communication-avoiding,16.557935
16,6144,6144,4096,16,256,1024,communication-avoiding,16.524177
16,6144,6144,4096,16,256,1024,communication-avoiding,15.983558
