P,X,Y,iter,cell_us,b,s,algo,time
4,8192,8192,16,0,64,-1,classical,6.697453
4,8192,8192,16,0,64,-1,classical,6.825188
4,8192,8192,16,0,64,-1,classical,6.713225
4,8192,8192,16,0,64,-1,classical,6.612201
4,8192,8192,16,0,64,-1,classical,6.638641
4,8192,8192,16,0,64,-1,classical,6.380570
4,8192,8192,16,0,64,-1,classical,6.239415
4,8192,8192,16,0,64,-1,classical,6.225997
4,8192,8192,16,0,64,-1,classical,6.262584
4,8192,8192,16,0,64,-1,classical,6.336471
4,8192,8192,16,0,64,64,communication-avoiding,1.515451
4,8192,8192,16,0,64,64,communication-avoiding,1.571529
4,8192,8192,16,0,64,64,communication-avoiding,1.570965
4,8192,8192,16,0,64,64,communication-avoiding,1.541577
4,8192,8192,16,0,64,64,communication-avoiding,1.585248
4,8192,8192,16,0,64,64,communication-avoiding,1.508337
4,8192,8192,16,0,64,64,communication-avoiding,1.588817
4,8192,8192,16,0,64,64,communication-avoiding,1.512792
4,8192,8192,16,0,64,64,communication-avoiding,1.479035
4,8192,8192,16,0,64,64,communication-avoiding,1.532939
4,8192,8192,16,0,64,128,communication-avoiding,1.550598
4,8192,8192,16,0,64,128,communication-avoiding,1.588506
4,8192,8192,16,0,64,128,communication-avoiding,1.668273
4,8192,8192,16,0,64,128,communication-avoiding,1.540930
4,8192,8192,16,0,64,128,communication-avoiding,1.558316
4,8192,8192,16,0,64,128,communication-avoiding,1.550300
4,8192,8192,16,0,64,128,communication-avoiding,1.531642
4,8192,8192,16,0,64,128,communication-avoiding,1.585817
4,8192,8192,16,0,64,128,communication-avoiding,1.544468
4,8192,8192,16,0,64,128,communication-avoiding,1.535000
4,8192,8192,16,0,64,256,communication-avoiding,1.749530
4,8192,8192,16,0,64,256,communication-avoiding,2.063748
4,8192,8192,16,0,64,256,communication-avoiding,1.747098
4,8192,8192,16,0,64,256,communication-avoiding,1.731328
4,8192,8192,16,0,64,256,communication-avoiding,1.735917
4,8192,8192,16,0,64,256,communication-avoiding,1.727087
4,8192,8192,16,0,64,256,communication-avoiding,1.719522
4,8192,8192,16,0,64,256,communication-avoiding,1.742931
4,8192,8192,16,0,64,256,communication-avoiding,1.739960
4,8192,8192,16,0,64,256,communication-avoiding,1.704943
4,16384,16384,16,0,64,-1,classical,27.784335
4,16384,16384,16,0,64,-1,classical,27.760341
4,16384,16384,16,0,64,-1,classical,27.329732
4,16384,16384,16,0,64,-1,classical,27.462537
4,16384,16384,16,0,64,-1,classical,26.482645
4,16384,16384,16,0,64,-1,classical,26.004479
4,16384,16384,16,0,64,-1,classical,26.171902
4,16384,16384,16,0,64,-1,classical,26.079176
4,16384,16384,16,0,64,-1,classical,26.140658
4,16384,16384,16,0,64,-1,classical,25.826270
4,16384,16384,16,0,64,64,communication-avoiding,6.406486
4,16384,16384,16,0,64,64,communication-avoiding,6.466617
4,16384,16384,16,0,64,64,communication-avoiding,6.305022
4,16384,16384,16,0,64,64,communication-avoiding,6.228983
4,16384,16384,16,0,64,64,communication-avoiding,6.301653
4,16384,16384,16,0,64,64,communication-avoiding,6.190770
4,16384,16384,16,0,64,64,communication-avoiding,6.121596
4,16384,16384,16,0,64,64,communication-avoiding,6.088821
4,16384,16384,16,0,64,64,communication-avoiding,6.269651
4,16384,16384,16,0,64,64,communication-avoiding,6.218490
4,16384,16384,16,0,64,128,communication-avoiding,6.564911
4,16384,16384,16,0,64,128,communication-avoiding,6.528981
4,16384,16384,16,0,64,128,communication-avoiding,6.421248
4,16384,16384,16,0,64,128,communication-avoiding,6.315642
4,16384,16384,16,0,64,128,communication-avoiding,6.325285
4,16384,16384,16,0,64,128,communication-avoiding,6.402545
4,16384,16384,16,0,64,128,communication-avoiding,6.331293
4,16384,16384,16,0,64,128,communication-avoiding,6.282057
4,16384,16384,16,0,64,128,communication-avoiding,6.333821
4,16384,16384,16,0,64,128,communication-avoiding,6.282672
4,16384,16384,16,0,64,256,communication-avoiding,6.896909
4,16384,16384,16,0,64,256,communication-avoiding,6.834699
4,16384,16384,16,0,64,256,communication-avoiding,6.805081
4,16384,16384,16,0,64,256,communication-avoiding,6.794844
4,16384,16384,16,0,64,256,communication-avoiding,6.773294
4,16384,16384,16,0,64,256,communication-avoiding,6.758989
4,16384,16384,16,0,64,256,communication-avoiding,6.766403
4,16384,16384,16,0,64,256,communication-avoiding,6.785597
4,16384,16384,16,0,64,256,communication-avoiding,6.734368
4,16384,16384,16,0,64,256,communication-avoiding,6.723283
4,8192,8192,16,0,128,-1,classical,1.477603
4,8192,8192,16,0,128,-1,classical,1.503828
4,8192,8192,16,0,128,-1,classical,1.534046
4,8192,8192,16,0,128,-1,classical,1.516663
4,8192,8192,16,0,128,-1,classical,1.495654
4,8192,8192,16,0,128,-1,classical,1.584968
4,8192,8192,16,0,128,-1,classical,1.554759
4,8192,8192,16,0,128,-1,classical,1.553823
4,8192,8192,16,0,128,-1,classical,1.576722
4,8192,8192,16,0,128,-1,classical,1.530989
4,8192,8192,16,0,128,128,communication-avoiding,0.373772
4,8192,8192,16,0,128,128,communication-avoiding,0.381343
4,8192,8192,16,0,128,128,communication-avoiding,0.374800
4,8192,8192,16,0,128,128,communication-avoiding,0.372894
4,8192,8192,16,0,128,128,communication-avoiding,0.372724
4,8192,8192,16,0,128,128,communication-avoiding,0.373723
4,8192,8192,16,0,128,128,communication-avoiding,0.370004
4,8192,8192,16,0,128,128,communication-avoiding,0.370406
4,8192,8192,16,0,128,128,communication-avoiding,0.387187
4,8192,8192,16,0,128,128,communication-avoiding,0.455463
4,8192,8192,16,0,128,256,communication-avoiding,0.420003
4,8192,8192,16,0,128,256,communication-avoiding,0.423967
4,8192,8192,16,0,128,256,communication-avoiding,0.406242
4,8192,8192,16,0,128,256,communication-avoiding,0.429911
4,8192,8192,16,0,128,256,communication-avoiding,0.447654
4,8192,8192,16,0,128,256,communication-avoiding,0.409479
4,8192,8192,16,0,128,256,communication-avoiding,0.407329
4,8192,8192,16,0,128,256,communication-avoiding,0.542232
4,8192,8192,16,0,128,256,communication-avoiding,0.412216
4,8192,8192,16,0,128,256,communication-avoiding,0.407385
4,8192,8192,16,0,128,512,communication-avoiding,0.510520
4,8192,8192,16,0,128,512,communication-avoiding,0.475135
4,8192,8192,16,0,128,512,communication-avoiding,0.460590
4,8192,8192,16,0,128,512,communication-avoiding,0.471821
4,8192,8192,16,0,128,512,communication-avoiding,0.460332
4,8192,8192,16,0,128,512,communication-avoiding,0.656895
4,8192,8192,16,0,128,512,communication-avoiding,0.462471
4,8192,8192,16,0,128,512,communication-avoiding,0.461180
4,8192,8192,16,0,128,512,communication-avoiding,0.459239
4,8192,8192,16,0,128,512,communication-avoiding,0.464938
4,16384,16384,16,0,128,-1,classical,6.269339
4,16384,16384,16,0,128,-1,classical,6.343153
4,16384,16384,16,0,128,-1,classical,6.309118
4,16384,16384,16,0,128,-1,classical,6.287984
4,16384,16384,16,0,128,-1,classical,6.248608
4,16384,16384,16,0,128,-1,classical,6.233936
4,16384,16384,16,0,128,-1,classical,6.213640
4,16384,16384,16,0,128,-1,classical,6.175838
4,16384,16384,16,0,128,-1,classical,6.273696
4,16384,16384,16,0,128,-1,classical,6.196458
4,16384,16384,16,0,128,128,communication-avoiding,1.501888
4,16384,16384,16,0,128,128,communication-avoiding,1.548471
4,16384,16384,16,0,128,128,communication-avoiding,1.520608
4,16384,16384,16,0,128,128,communication-avoiding,1.506355
4,16384,16384,16,0,128,128,communication-avoiding,1.502511
4,16384,16384,16,0,128,128,communication-avoiding,1.541211
4,16384,16384,16,0,128,128,communication-avoiding,1.496838
4,16384,16384,16,0,128,128,communication-avoiding,1.490292
4,16384,16384,16,0,128,128,communication-avoiding,1.488452
4,16384,16384,16,0,128,128,communication-avoiding,1.492244
4,16384,16384,16,0,128,256,communication-avoiding,1.638211
4,16384,16384,16,0,128,256,communication-avoiding,1.663056
4,16384,16384,16,0,128,256,communication-avoiding,1.620054
4,16384,16384,16,0,128,256,communication-avoiding,1.703215
4,16384,16384,16,0,128,256,communication-avoiding,1.610825
4,16384,16384,16,0,128,256,communication-avoiding,1.621426
4,16384,16384,16,0,128,256,communication-avoiding,1.611311
4,16384,16384,16,0,128,256,communication-avoiding,1.609997
4,16384,16384,16,0,128,256,communication-avoiding,2.856818
4,16384,16384,16,0,128,256,communication-avoiding,1.635357
4,16384,16384,16,0,128,512,communication-avoiding,1.770295
4,16384,16384,16,0,128,512,communication-avoiding,1.738852
4,16384,16384,16,0,128,512,communication-avoiding,1.753757
4,16384,16384,16,0,128,512,communication-avoiding,1.825317
4,16384,16384,16,0,128,512,communication-avoiding,2.108387
4,16384,16384,16,0,128,512,communication-avoiding,1.760252
4,16384,16384,16,0,128,512,communication-avoiding,1.793842
4,16384,16384,16,0,128,512,communication-avoiding,1.737953
4,16384,16384,16,0,128,512,communication-avoiding,1.773946
4,16384,16384,16,0,128,512,communication-avoiding,1.734078
