P,X,Y,iter,cell_ns,b,s,algo,time
4,8192,8192,16,1,128,-1,classical,1.492080
4,8192,8192,16,1,128,-1,classical,1.514859
4,8192,8192,16,1,128,-1,classical,1.562941
4,8192,8192,16,1,128,-1,classical,1.510480
4,8192,8192,16,1,128,-1,classical,1.516637
4,8192,8192,16,1,128,-1,classical,1.489789
4,8192,8192,16,1,128,-1,classical,1.514711
4,8192,8192,16,1,128,-1,classical,1.515533
4,8192,8192,16,1,128,-1,classical,1.511944
4,8192,8192,16,1,128,-1,classical,1.519954
4,8192,8192,16,1,128,128,communication-avoiding,0.374115
4,8192,8192,16,1,128,128,communication-avoiding,0.387081
4,8192,8192,16,1,128,128,communication-avoiding,0.376152
4,8192,8192,16,1,128,128,communication-avoiding,0.376001
4,8192,8192,16,1,128,128,communication-avoiding,0.398864
4,8192,8192,16,1,128,128,communication-avoiding,0.375663
4,8192,8192,16,1,128,128,communication-avoiding,0.379885
4,8192,8192,16,1,128,128,communication-avoiding,0.373478
4,8192,8192,16,1,128,128,communication-avoiding,0.384775
4,8192,8192,16,1,128,128,communication-avoiding,0.374684
4,8192,8192,16,1,128,256,communication-avoiding,0.403263
4,8192,8192,16,1,128,256,communication-avoiding,0.422271
4,8192,8192,16,1,128,256,communication-avoiding,0.416883
4,8192,8192,16,1,128,256,communication-avoiding,0.425669
4,8192,8192,16,1,128,256,communication-avoiding,0.417685
4,8192,8192,16,1,128,256,communication-avoiding,0.416483
4,8192,8192,16,1,128,256,communication-avoiding,0.417452
4,8192,8192,16,1,128,256,communication-avoiding,0.415706
4,8192,8192,16,1,128,256,communication-avoiding,0.416259
4,8192,8192,16,1,128,256,communication-avoiding,0.420193
4,8192,8192,16,1,128,512,communication-avoiding,0.468939
4,8192,8192,16,1,128,512,communication-avoiding,0.485894
4,8192,8192,16,1,128,512,communication-avoiding,0.475232
4,8192,8192,16,1,128,512,communication-avoiding,0.491467
4,8192,8192,16,1,128,512,communication-avoiding,0.475894
4,8192,8192,16,1,128,512,communication-avoiding,0.523003
4,8192,8192,16,1,128,512,communication-avoiding,0.530110
4,8192,8192,16,1,128,512,communication-avoiding,0.515483
4,8192,8192,16,1,128,512,communication-avoiding,0.476088
4,8192,8192,16,1,128,512,communication-avoiding,0.475679
4,8192,8192,16,1,256,-1,classical,0.330678
4,8192,8192,16,1,256,-1,classical,0.358531
4,8192,8192,16,1,256,-1,classical,0.342703
4,8192,8192,16,1,256,-1,classical,0.344593
4,8192,8192,16,1,256,-1,classical,0.340810
4,8192,8192,16,1,256,-1,classical,0.345020
4,8192,8192,16,1,256,-1,classical,0.343129
4,8192,8192,16,1,256,-1,classical,0.345533
4,8192,8192,16,1,256,-1,classical,0.347662
4,8192,8192,16,1,256,-1,classical,0.360286
4,8192,8192,16,1,256,256,communication-avoiding,0.094756
4,8192,8192,16,1,256,256,communication-avoiding,0.093445
4,8192,8192,16,1,256,256,communication-avoiding,0.093508
4,8192,8192,16,1,256,256,communication-avoiding,0.092885
4,8192,8192,16,1,256,256,communication-avoiding,0.093132
4,8192,8192,16,1,256,256,communication-avoiding,0.092749
4,8192,8192,16,1,256,256,communication-avoiding,0.092918
4,8192,8192,16,1,256,256,communication-avoiding,0.125391
4,8192,8192,16,1,256,256,communication-avoiding,0.094372
4,8192,8192,16,1,256,256,communication-avoiding,0.094556
4,8192,8192,16,1,256,512,communication-avoiding,0.109639
4,8192,8192,16,1,256,512,communication-avoiding,0.106951
4,8192,8192,16,1,256,512,communication-avoiding,0.107025
4,8192,8192,16,1,256,512,communication-avoiding,0.106745
4,8192,8192,16,1,256,512,communication-avoiding,0.107013
4,8192,8192,16,1,256,512,communication-avoiding,0.110588
4,8192,8192,16,1,256,512,communication-avoiding,0.113268
4,8192,8192,16,1,256,512,communication-avoiding,0.109234
4,8192,8192,16,1,256,512,communication-avoiding,0.108988
4,8192,8192,16,1,256,512,communication-avoiding,0.108289
4,8192,8192,16,1,256,1024,communication-avoiding,0.141379
4,8192,8192,16,1,256,1024,communication-avoiding,0.136734
4,8192,8192,16,1,256,1024,communication-avoiding,0.140031
4,8192,8192,16,1,256,1024,communication-avoiding,0.138845
4,8192,8192,16,1,256,1024,communication-avoiding,0.141792
4,8192,8192,16,1,256,1024,communication-avoiding,0.139900
4,8192,8192,16,1,256,1024,communication-avoiding,0.140831
4,8192,8192,16,1,256,1024,communication-avoiding,0.138875
4,8192,8192,16,1,256,1024,communication-avoiding,0.139227
4,8192,8192,16,1,256,1024,communication-avoiding,0.139765
4,8192,8192,64,1,128,-1,classical,5.959780
4,8192,8192,64,1,128,-1,classical,5.996442
4,8192,8192,64,1,128,-1,classical,5.945297
4,8192,8192,64,1,128,-1,classical,5.919403
4,8192,8192,64,1,128,-1,classical,5.967593
4,8192,8192,64,1,128,-1,classical,5.944654
4,8192,8192,64,1,128,-1,classical,5.976182
4,8192,8192,64,1,128,-1,classical,5.949197
4,8192,8192,64,1,128,-1,classical,6.033719
4,8192,8192,64,1,128,-1,classical,6.013264
4,8192,8192,64,1,128,128,communication-avoiding,1.508502
4,8192,8192,64,1,128,128,communication-avoiding,1.554570
4,8192,8192,64,1,128,128,communication-avoiding,1.529023
4,8192,8192,64,1,128,128,communication-avoiding,1.587352
4,8192,8192,64,1,128,128,communication-avoiding,1.507140
4,8192,8192,64,1,128,128,communication-avoiding,1.556825
4,8192,8192,64,1,128,128,communication-avoiding,1.551799
4,8192,8192,64,1,128,128,communication-avoiding,1.561440
4,8192,8192,64,1,128,128,communication-avoiding,1.551905
4,8192,8192,64,1,128,128,communication-avoiding,1.580641
4,8192,8192,64,1,128,256,communication-avoiding,1.660077
4,8192,8192,64,1,128,256,communication-avoiding,1.732911
4,8192,8192,64,1,128,256,communication-avoiding,1.678777
4,8192,8192,64,1,128,256,communication-avoiding,1.630664
4,8192,8192,64,1,128,256,communication-avoiding,1.654512
4,8192,8192,64,1,128,256,communication-avoiding,1.657875
4,8192,8192,64,1,128,256,communication-avoiding,1.651266
4,8192,8192,64,1,128,256,communication-avoiding,1.624070
4,8192,8192,64,1,128,256,communication-avoiding,1.625540
4,8192,8192,64,1,128,256,communication-avoiding,1.617691
4,8192,8192,64,1,128,512,communication-avoiding,1.958487
4,8192,8192,64,1,128,512,communication-avoiding,1.850841
4,8192,8192,64,1,128,512,communication-avoiding,1.847678
4,8192,8192,64,1,128,512,communication-avoiding,1.849153
4,8192,8192,64,1,128,512,communication-avoiding,1.855221
4,8192,8192,64,1,128,512,communication-avoiding,1.856802
4,8192,8192,64,1,128,512,communication-avoiding,1.853359
4,8192,8192,64,1,128,512,communication-avoiding,1.851964
4,8192,8192,64,1,128,512,communication-avoiding,1.857292
4,8192,8192,64,1,128,512,communication-avoiding,1.857077
4,8192,8192,64,1,256,-1,classical,1.394306
4,8192,8192,64,1,256,-1,classical,1.418086
4,8192,8192,64,1,256,-1,classical,1.415508
4,8192,8192,64,1,256,-1,classical,1.419065
4,8192,8192,64,1,256,-1,classical,1.422179
4,8192,8192,64,1,256,-1,classical,1.425901
4,8192,8192,64,1,256,-1,classical,1.413557
4,8192,8192,64,1,256,-1,classical,1.415187
4,8192,8192,64,1,256,-1,classical,1.423152
4,8192,8192,64,1,256,-1,classical,1.419289
4,8192,8192,64,1,256,256,communication-avoiding,0.377759
4,8192,8192,64,1,256,256,communication-avoiding,0.382260
4,8192,8192,64,1,256,256,communication-avoiding,0.376985
4,8192,8192,64,1,256,256,communication-avoiding,0.384089
4,8192,8192,64,1,256,256,communication-avoiding,0.373869
4,8192,8192,64,1,256,256,communication-avoiding,0.372819
4,8192,8192,64,1,256,256,communication-avoiding,0.377822
4,8192,8192,64,1,256,256,communication-avoiding,0.400604
4,8192,8192,64,1,256,256,communication-avoiding,0.398905
4,8192,8192,64,1,256,256,communication-avoiding,0.373162
4,8192,8192,64,1,256,512,communication-avoiding,0.430770
4,8192,8192,64,1,256,512,communication-avoiding,0.439833
4,8192,8192,64,1,256,512,communication-avoiding,0.440666
4,8192,8192,64,1,256,512,communication-avoiding,0.440392
4,8192,8192,64,1,256,512,communication-avoiding,0.554667
4,8192,8192,64,1,256,512,communication-avoiding,0.441017
4,8192,8192,64,1,256,512,communication-avoiding,0.439789
4,8192,8192,64,1,256,512,communication-avoiding,0.440646
4,8192,8192,64,1,256,512,communication-avoiding,0.441290
4,8192,8192,64,1,256,512,communication-avoiding,0.441302
4,8192,8192,64,1,256,1024,communication-avoiding,0.555839
4,8192,8192,64,1,256,1024,communication-avoiding,0.569332
4,8192,8192,64,1,256,1024,communication-avoiding,0.552013
4,8192,8192,64,1,256,1024,communication-avoiding,0.555991
4,8192,8192,64,1,256,1024,communication-avoiding,0.553367
4,8192,8192,64,1,256,1024,communication-avoiding,0.550799
4,8192,8192,64,1,256,1024,communication-avoiding,0.545537
4,8192,8192,64,1,256,1024,communication-avoiding,0.542726
4,8192,8192,64,1,256,1024,communication-avoiding,0.545105
4,8192,8192,64,1,256,1024,communication-avoiding,0.585346
4,8192,8192,256,1,128,-1,classical,23.989227
4,8192,8192,256,1,128,-1,classical,24.699728
4,8192,8192,256,1,128,-1,classical,35.372442
4,8192,8192,256,1,128,-1,classical,36.191032
4,8192,8192,256,1,128,-1,classical,38.898028
4,8192,8192,256,1,128,-1,classical,33.765132
4,8192,8192,256,1,128,-1,classical,25.526608
4,8192,8192,256,1,128,-1,classical,25.123929
4,8192,8192,256,1,128,-1,classical,25.382773
4,8192,8192,256,1,128,-1,classical,25.458219
4,8192,8192,256,1,128,128,communication-avoiding,5.980787
4,8192,8192,256,1,128,128,communication-avoiding,6.096868
4,8192,8192,256,1,128,128,communication-avoiding,6.276380
4,8192,8192,256,1,128,128,communication-avoiding,6.290386
4,8192,8192,256,1,128,128,communication-avoiding,6.264137
4,8192,8192,256,1,128,128,communication-avoiding,6.229701
4,8192,8192,256,1,128,128,communication-avoiding,6.244722
4,8192,8192,256,1,128,128,communication-avoiding,6.303439
4,8192,8192,256,1,128,128,communication-avoiding,6.296748
4,8192,8192,256,1,128,128,communication-avoiding,6.297014
4,8192,8192,256,1,128,256,communication-avoiding,6.610782
4,8192,8192,256,1,128,256,communication-avoiding,6.175644
4,8192,8192,256,1,128,256,communication-avoiding,6.215954
4,8192,8192,256,1,128,256,communication-avoiding,6.236087
4,8192,8192,256,1,128,256,communication-avoiding,6.211172
4,8192,8192,256,1,128,256,communication-avoiding,6.188751
4,8192,8192,256,1,128,256,communication-avoiding,6.170956
4,8192,8192,256,1,128,256,communication-avoiding,6.181118
4,8192,8192,256,1,128,256,communication-avoiding,6.214905
4,8192,8192,256,1,128,256,communication-avoiding,6.157428
4,8192,8192,256,1,128,512,communication-avoiding,7.352993
4,8192,8192,256,1,128,512,communication-avoiding,7.352810
4,8192,8192,256,1,128,512,communication-avoiding,7.353343
4,8192,8192,256,1,128,512,communication-avoiding,7.333092
4,8192,8192,256,1,128,512,communication-avoiding,7.336894
4,8192,8192,256,1,128,512,communication-avoiding,7.283592
4,8192,8192,256,1,128,512,communication-avoiding,7.305023
4,8192,8192,256,1,128,512,communication-avoiding,7.334566
4,8192,8192,256,1,128,512,communication-avoiding,7.303217
4,8192,8192,256,1,128,512,communication-avoiding,7.305052
4,8192,8192,256,1,256,-1,classical,5.709703
4,8192,8192,256,1,256,-1,classical,5.796596
4,8192,8192,256,1,256,-1,classical,5.679992
4,8192,8192,256,1,256,-1,classical,5.620098
4,8192,8192,256,1,256,-1,classical,5.848364
4,8192,8192,256,1,256,-1,classical,5.809045
4,8192,8192,256,1,256,-1,classical,5.815161
4,8192,8192,256,1,256,-1,classical,5.823846
4,8192,8192,256,1,256,-1,classical,5.804853
4,8192,8192,256,1,256,-1,classical,5.842572
4,8192,8192,256,1,256,256,communication-avoiding,1.560431
4,8192,8192,256,1,256,256,communication-avoiding,1.516700
4,8192,8192,256,1,256,256,communication-avoiding,1.516022
4,8192,8192,256,1,256,256,communication-avoiding,1.516668
4,8192,8192,256,1,256,256,communication-avoiding,1.510470
4,8192,8192,256,1,256,256,communication-avoiding,1.512214
4,8192,8192,256,1,256,256,communication-avoiding,1.506138
4,8192,8192,256,1,256,256,communication-avoiding,1.498805
4,8192,8192,256,1,256,256,communication-avoiding,1.498713
4,8192,8192,256,1,256,256,communication-avoiding,1.527373
4,8192,8192,256,1,256,512,communication-avoiding,1.730272
4,8192,8192,256,1,256,512,communication-avoiding,1.737337
4,8192,8192,256,1,256,512,communication-avoiding,1.739072
4,8192,8192,256,1,256,512,communication-avoiding,1.741554
4,8192,8192,256,1,256,512,communication-avoiding,1.733488
4,8192,8192,256,1,256,512,communication-avoiding,1.737347
4,8192,8192,256,1,256,512,communication-avoiding,1.743066
4,8192,8192,256,1,256,512,communication-avoiding,1.734557
4,8192,8192,256,1,256,512,communication-avoiding,1.749188
4,8192,8192,256,1,256,512,communication-avoiding,1.800840
4,8192,8192,256,1,256,1024,communication-avoiding,2.217386
4,8192,8192,256,1,256,1024,communication-avoiding,2.293268
4,8192,8192,256,1,256,1024,communication-avoiding,2.226931
4,8192,8192,256,1,256,1024,communication-avoiding,2.234288
4,8192,8192,256,1,256,1024,communication-avoiding,2.239974
4,8192,8192,256,1,256,1024,communication-avoiding,2.227507
4,8192,8192,256,1,256,1024,communication-avoiding,2.208183
4,8192,8192,256,1,256,1024,communication-avoiding,2.254634
4,8192,8192,256,1,256,1024,communication-avoiding,2.213012
4,8192,8192,256,1,256,1024,communication-avoiding,2.224778
4,8192,8192,1024,1,128,-1,classical,97.930249
4,8192,8192,1024,1,128,-1,classical,97.409441
4,8192,8192,1024,1,128,-1,classical,96.256465
4,8192,8192,1024,1,128,-1,classical,95.737678
4,8192,8192,1024,1,128,-1,classical,95.856481
4,8192,8192,1024,1,128,-1,classical,96.027862
4,8192,8192,1024,1,128,-1,classical,95.711627
4,8192,8192,1024,1,128,-1,classical,97.380410
4,8192,8192,1024,1,128,-1,classical,100.732929
4,8192,8192,1024,1,128,-1,classical,101.061356
4,8192,8192,1024,1,128,128,communication-avoiding,23.681502
4,8192,8192,1024,1,128,128,communication-avoiding,24.004455
4,8192,8192,1024,1,128,128,communication-avoiding,23.947262
4,8192,8192,1024,1,128,128,communication-avoiding,23.870965
4,8192,8192,1024,1,128,128,communication-avoiding,23.818054
4,8192,8192,1024,1,128,128,communication-avoiding,23.946268
4,8192,8192,1024,1,128,128,communication-avoiding,23.838539
4,8192,8192,1024,1,128,128,communication-avoiding,23.865675
4,8192,8192,1024,1,128,128,communication-avoiding,23.912366
4,8192,8192,1024,1,128,128,communication-avoiding,23.852322
4,8192,8192,1024,1,128,256,communication-avoiding,25.063468
4,8192,8192,1024,1,128,256,communication-avoiding,24.825366
4,8192,8192,1024,1,128,256,communication-avoiding,24.942923
4,8192,8192,1024,1,128,256,communication-avoiding,24.802535
4,8192,8192,1024,1,128,256,communication-avoiding,24.857317
4,8192,8192,1024,1,128,256,communication-avoiding,24.839365
4,8192,8192,1024,1,128,256,communication-avoiding,24.785912
4,8192,8192,1024,1,128,256,communication-avoiding,24.852492
4,8192,8192,1024,1,128,256,communication-avoiding,24.873923
4,8192,8192,1024,1,128,256,communication-avoiding,24.835967
4,8192,8192,1024,1,128,512,communication-avoiding,27.235367
4,8192,8192,1024,1,128,512,communication-avoiding,26.706246
4,8192,8192,1024,1,128,512,communication-avoiding,26.788642
4,8192,8192,1024,1,128,512,communication-avoiding,26.734796
4,8192,8192,1024,1,128,512,communication-avoiding,26.843323
4,8192,8192,1024,1,128,512,communication-avoiding,26.735059
4,8192,8192,1024,1,128,512,communication-avoiding,26.728037
4,8192,8192,1024,1,128,512,communication-avoiding,26.793348
4,8192,8192,1024,1,128,512,communication-avoiding,26.750322
4,8192,8192,1024,1,128,512,communication-avoiding,26.608137
4,8192,8192,1024,1,256,-1,classical,22.222113
4,8192,8192,1024,1,256,-1,classical,21.987656
4,8192,8192,1024,1,256,-1,classical,22.596326
4,8192,8192,1024,1,256,-1,classical,22.464466
4,8192,8192,1024,1,256,-1,classical,22.604659
4,8192,8192,1024,1,256,-1,classical,22.601642
4,8192,8192,1024,1,256,-1,classical,22.518254
4,8192,8192,1024,1,256,-1,classical,22.530731
4,8192,8192,1024,1,256,-1,classical,22.468925
4,8192,8192,1024,1,256,-1,classical,22.512176
4,8192,8192,1024,1,256,256,communication-avoiding,6.050437
4,8192,8192,1024,1,256,256,communication-avoiding,5.974800
4,8192,8192,1024,1,256,256,communication-avoiding,6.041070
4,8192,8192,1024,1,256,256,communication-avoiding,5.965147
4,8192,8192,1024,1,256,256,communication-avoiding,5.955899
4,8192,8192,1024,1,256,256,communication-avoiding,5.986975
4,8192,8192,1024,1,256,256,communication-avoiding,6.004715
4,8192,8192,1024,1,256,256,communication-avoiding,6.041707
4,8192,8192,1024,1,256,256,communication-avoiding,6.031034
4,8192,8192,1024,1,256,256,communication-avoiding,6.021278
4,8192,8192,1024,1,256,512,communication-avoiding,6.581674
4,8192,8192,1024,1,256,512,communication-avoiding,6.456898
4,8192,8192,1024,1,256,512,communication-avoiding,6.423511
4,8192,8192,1024,1,256,512,communication-avoiding,6.445611
4,8192,8192,1024,1,256,512,communication-avoiding,6.467247
4,8192,8192,1024,1,256,512,communication-avoiding,6.453036
4,8192,8192,1024,1,256,512,communication-avoiding,6.479498
4,8192,8192,1024,1,256,512,communication-avoiding,6.455531
4,8192,8192,1024,1,256,512,communication-avoiding,6.486906
4,8192,8192,1024,1,256,512,communication-avoiding,6.448231
4,8192,8192,1024,1,256,1024,communication-avoiding,7.484400
4,8192,8192,1024,1,256,1024,communication-avoiding,7.464804
4,8192,8192,1024,1,256,1024,communication-avoiding,7.452049
4,8192,8192,1024,1,256,1024,communication-avoiding,7.540277
4,8192,8192,1024,1,256,1024,communication-avoiding,7.521655
4,8192,8192,1024,1,256,1024,communication-avoiding,7.538668
4,8192,8192,1024,1,256,1024,communication-avoiding,7.583839
4,8192,8192,1024,1,256,1024,communication-avoiding,7.494213
4,8192,8192,1024,1,256,1024,communication-avoiding,7.523577
4,8192,8192,1024,1,256,1024,communication-avoiding,7.571471
4,8192,8192,16,16,128,-1,classical,1.401924
4,8192,8192,16,16,128,-1,classical,1.496695
4,8192,8192,16,16,128,-1,classical,1.525178
4,8192,8192,16,16,128,-1,classical,1.515692
4,8192,8192,16,16,128,-1,classical,1.543827
4,8192,8192,16,16,128,-1,classical,1.505337
4,8192,8192,16,16,128,-1,classical,1.532078
4,8192,8192,16,16,128,-1,classical,1.506305
4,8192,8192,16,16,128,-1,classical,1.535144
4,8192,8192,16,16,128,-1,classical,1.519498
4,8192,8192,16,16,128,128,communication-avoiding,0.404896
4,8192,8192,16,16,128,128,communication-avoiding,0.429929
4,8192,8192,16,16,128,128,communication-avoiding,0.385774
4,8192,8192,16,16,128,128,communication-avoiding,0.390908
4,8192,8192,16,16,128,128,communication-avoiding,0.392897
4,8192,8192,16,16,128,128,communication-avoiding,0.398782
4,8192,8192,16,16,128,128,communication-avoiding,0.391479
4,8192,8192,16,16,128,128,communication-avoiding,0.390655
4,8192,8192,16,16,128,128,communication-avoiding,0.396686
4,8192,8192,16,16,128,128,communication-avoiding,0.403929
4,8192,8192,16,16,128,256,communication-avoiding,0.442486
4,8192,8192,16,16,128,256,communication-avoiding,0.459067
4,8192,8192,16,16,128,256,communication-avoiding,0.409516
4,8192,8192,16,16,128,256,communication-avoiding,0.416873
4,8192,8192,16,16,128,256,communication-avoiding,0.419045
4,8192,8192,16,16,128,256,communication-avoiding,0.416659
4,8192,8192,16,16,128,256,communication-avoiding,0.424645
4,8192,8192,16,16,128,256,communication-avoiding,0.412929
4,8192,8192,16,16,128,256,communication-avoiding,0.449065
4,8192,8192,16,16,128,256,communication-avoiding,0.417845
4,8192,8192,16,16,128,512,communication-avoiding,0.472989
4,8192,8192,16,16,128,512,communication-avoiding,0.482148
4,8192,8192,16,16,128,512,communication-avoiding,0.471004
4,8192,8192,16,16,128,512,communication-avoiding,0.485392
4,8192,8192,16,16,128,512,communication-avoiding,0.472380
4,8192,8192,16,16,128,512,communication-avoiding,0.518720
4,8192,8192,16,16,128,512,communication-avoiding,0.473385
4,8192,8192,16,16,128,512,communication-avoiding,0.473001
4,8192,8192,16,16,128,512,communication-avoiding,0.478389
4,8192,8192,16,16,128,512,communication-avoiding,0.474091
4,8192,8192,16,16,256,-1,classical,0.329077
4,8192,8192,16,16,256,-1,classical,0.352562
4,8192,8192,16,16,256,-1,classical,0.345029
4,8192,8192,16,16,256,-1,classical,0.339213
4,8192,8192,16,16,256,-1,classical,0.338114
4,8192,8192,16,16,256,-1,classical,0.339188
4,8192,8192,16,16,256,-1,classical,0.338061
4,8192,8192,16,16,256,-1,classical,0.336822
4,8192,8192,16,16,256,-1,classical,0.338631
4,8192,8192,16,16,256,-1,classical,0.338111
4,8192,8192,16,16,256,256,communication-avoiding,0.134377
4,8192,8192,16,16,256,256,communication-avoiding,0.134113
4,8192,8192,16,16,256,256,communication-avoiding,0.136439
4,8192,8192,16,16,256,256,communication-avoiding,0.134315
4,8192,8192,16,16,256,256,communication-avoiding,0.134795
4,8192,8192,16,16,256,256,communication-avoiding,0.136796
4,8192,8192,16,16,256,256,communication-avoiding,0.134431
4,8192,8192,16,16,256,256,communication-avoiding,0.138945
4,8192,8192,16,16,256,256,communication-avoiding,0.135295
4,8192,8192,16,16,256,256,communication-avoiding,0.135205
4,8192,8192,16,16,256,512,communication-avoiding,0.154345
4,8192,8192,16,16,256,512,communication-avoiding,0.152587
4,8192,8192,16,16,256,512,communication-avoiding,0.153020
4,8192,8192,16,16,256,512,communication-avoiding,0.152320
4,8192,8192,16,16,256,512,communication-avoiding,0.152435
4,8192,8192,16,16,256,512,communication-avoiding,0.152613
4,8192,8192,16,16,256,512,communication-avoiding,0.157492
4,8192,8192,16,16,256,512,communication-avoiding,0.152737
4,8192,8192,16,16,256,512,communication-avoiding,0.152420
4,8192,8192,16,16,256,512,communication-avoiding,0.153648
4,8192,8192,16,16,256,1024,communication-avoiding,0.221348
4,8192,8192,16,16,256,1024,communication-avoiding,0.191397
4,8192,8192,16,16,256,1024,communication-avoiding,0.192423
4,8192,8192,16,16,256,1024,communication-avoiding,0.192675
4,8192,8192,16,16,256,1024,communication-avoiding,0.210885
4,8192,8192,16,16,256,1024,communication-avoiding,0.192570
4,8192,8192,16,16,256,1024,communication-avoiding,0.192387
4,8192,8192,16,16,256,1024,communication-avoiding,0.192388
4,8192,8192,16,16,256,1024,communication-avoiding,0.197444
4,8192,8192,16,16,256,1024,communication-avoiding,0.192864
4,8192,8192,64,16,128,-1,classical,5.696906
4,8192,8192,64,16,128,-1,classical,5.793221
4,8192,8192,64,16,128,-1,classical,5.749389
4,8192,8192,64,16,128,-1,classical,5.752254
4,8192,8192,64,16,128,-1,classical,5.795321
4,8192,8192,64,16,128,-1,classical,5.779787
4,8192,8192,64,16,128,-1,classical,5.751465
4,8192,8192,64,16,128,-1,classical,5.742772
4,8192,8192,64,16,128,-1,classical,5.768216
4,8192,8192,64,16,128,-1,classical,5.758336
4,8192,8192,64,16,128,128,communication-avoiding,1.674239
4,8192,8192,64,16,128,128,communication-avoiding,1.568202
4,8192,8192,64,16,128,128,communication-avoiding,1.563508
4,8192,8192,64,16,128,128,communication-avoiding,1.572268
4,8192,8192,64,16,128,128,communication-avoiding,1.583568
4,8192,8192,64,16,128,128,communication-avoiding,1.575617
4,8192,8192,64,16,128,128,communication-avoiding,1.568291
4,8192,8192,64,16,128,128,communication-avoiding,1.582072
4,8192,8192,64,16,128,128,communication-avoiding,1.576535
4,8192,8192,64,16,128,128,communication-avoiding,1.582392
4,8192,8192,64,16,128,256,communication-avoiding,1.689424
4,8192,8192,64,16,128,256,communication-avoiding,1.721935
4,8192,8192,64,16,128,256,communication-avoiding,1.775813
4,8192,8192,64,16,128,256,communication-avoiding,1.670406
4,8192,8192,64,16,128,256,communication-avoiding,1.688472
4,8192,8192,64,16,128,256,communication-avoiding,1.675052
4,8192,8192,64,16,128,256,communication-avoiding,1.701960
4,8192,8192,64,16,128,256,communication-avoiding,1.684783
4,8192,8192,64,16,128,256,communication-avoiding,1.683290
4,8192,8192,64,16,128,256,communication-avoiding,1.664358
4,8192,8192,64,16,128,512,communication-avoiding,1.944971
4,8192,8192,64,16,128,512,communication-avoiding,1.912829
4,8192,8192,64,16,128,512,communication-avoiding,2.082441
4,8192,8192,64,16,128,512,communication-avoiding,1.923694
4,8192,8192,64,16,128,512,communication-avoiding,1.946125
4,8192,8192,64,16,128,512,communication-avoiding,1.919493
4,8192,8192,64,16,128,512,communication-avoiding,1.902884
4,8192,8192,64,16,128,512,communication-avoiding,1.908679
4,8192,8192,64,16,128,512,communication-avoiding,1.919271
4,8192,8192,64,16,128,512,communication-avoiding,1.909857
4,8192,8192,64,16,256,-1,classical,1.351353
4,8192,8192,64,16,256,-1,classical,1.354723
4,8192,8192,64,16,256,-1,classical,1.368904
4,8192,8192,64,16,256,-1,classical,1.354193
4,8192,8192,64,16,256,-1,classical,1.352480
4,8192,8192,64,16,256,-1,classical,1.360752
4,8192,8192,64,16,256,-1,classical,1.364998
4,8192,8192,64,16,256,-1,classical,1.368457
4,8192,8192,64,16,256,-1,classical,1.387635
4,8192,8192,64,16,256,-1,classical,1.373595
4,8192,8192,64,16,256,256,communication-avoiding,0.551781
4,8192,8192,64,16,256,256,communication-avoiding,0.558861
4,8192,8192,64,16,256,256,communication-avoiding,0.543911
4,8192,8192,64,16,256,256,communication-avoiding,0.542712
4,8192,8192,64,16,256,256,communication-avoiding,0.540426
4,8192,8192,64,16,256,256,communication-avoiding,0.546037
4,8192,8192,64,16,256,256,communication-avoiding,0.553016
4,8192,8192,64,16,256,256,communication-avoiding,0.536150
4,8192,8192,64,16,256,256,communication-avoiding,0.544902
4,8192,8192,64,16,256,256,communication-avoiding,0.541508
4,8192,8192,64,16,256,512,communication-avoiding,0.607128
4,8192,8192,64,16,256,512,communication-avoiding,0.628837
4,8192,8192,64,16,256,512,communication-avoiding,0.619793
4,8192,8192,64,16,256,512,communication-avoiding,0.608925
4,8192,8192,64,16,256,512,communication-avoiding,0.606734
4,8192,8192,64,16,256,512,communication-avoiding,0.631011
4,8192,8192,64,16,256,512,communication-avoiding,0.607684
4,8192,8192,64,16,256,512,communication-avoiding,0.608843
4,8192,8192,64,16,256,512,communication-avoiding,0.608376
4,8192,8192,64,16,256,512,communication-avoiding,0.616562
4,8192,8192,64,16,256,1024,communication-avoiding,0.799387
4,8192,8192,64,16,256,1024,communication-avoiding,0.783342
4,8192,8192,64,16,256,1024,communication-avoiding,0.764587
4,8192,8192,64,16,256,1024,communication-avoiding,0.765781
4,8192,8192,64,16,256,1024,communication-avoiding,0.788778
4,8192,8192,64,16,256,1024,communication-avoiding,0.765394
4,8192,8192,64,16,256,1024,communication-avoiding,0.785488
4,8192,8192,64,16,256,1024,communication-avoiding,0.766272
4,8192,8192,64,16,256,1024,communication-avoiding,0.779995
4,8192,8192,64,16,256,1024,communication-avoiding,0.785159
4,8192,8192,256,16,128,-1,classical,23.343832
4,8192,8192,256,16,128,-1,classical,23.805652
4,8192,8192,256,16,128,-1,classical,23.793597
4,8192,8192,256,16,128,-1,classical,23.728975
4,8192,8192,256,16,128,-1,classical,23.773347
4,8192,8192,256,16,128,-1,classical,23.929930
4,8192,8192,256,16,128,-1,classical,24.069064
4,8192,8192,256,16,128,-1,classical,23.810523
4,8192,8192,256,16,128,-1,classical,23.705109
4,8192,8192,256,16,128,-1,classical,23.765575
4,8192,8192,256,16,128,128,communication-avoiding,6.350507
4,8192,8192,256,16,128,128,communication-avoiding,6.355324
4,8192,8192,256,16,128,128,communication-avoiding,6.509264
4,8192,8192,256,16,128,128,communication-avoiding,6.414962
4,8192,8192,256,16,128,128,communication-avoiding,6.426035
4,8192,8192,256,16,128,128,communication-avoiding,6.420685
4,8192,8192,256,16,128,128,communication-avoiding,6.413831
4,8192,8192,256,16,128,128,communication-avoiding,6.412433
4,8192,8192,256,16,128,128,communication-avoiding,6.413242
4,8192,8192,256,16,128,128,communication-avoiding,6.412280
4,8192,8192,256,16,128,256,communication-avoiding,6.519974
4,8192,8192,256,16,128,256,communication-avoiding,6.553864
4,8192,8192,256,16,128,256,communication-avoiding,6.571837
4,8192,8192,256,16,128,256,communication-avoiding,6.566540
4,8192,8192,256,16,128,256,communication-avoiding,6.579773
4,8192,8192,256,16,128,256,communication-avoiding,6.581265
4,8192,8192,256,16,128,256,communication-avoiding,6.582925
4,8192,8192,256,16,128,256,communication-avoiding,6.583010
4,8192,8192,256,16,128,256,communication-avoiding,6.572287
4,8192,8192,256,16,128,256,communication-avoiding,6.581713
4,8192,8192,256,16,128,512,communication-avoiding,7.566548
4,8192,8192,256,16,128,512,communication-avoiding,7.464684
4,8192,8192,256,16,128,512,communication-avoiding,7.493986
4,8192,8192,256,16,128,512,communication-avoiding,7.482813
4,8192,8192,256,16,128,512,communication-avoiding,7.497244
4,8192,8192,256,16,128,512,communication-avoiding,7.539262
4,8192,8192,256,16,128,512,communication-avoiding,7.526888
4,8192,8192,256,16,128,512,communication-avoiding,7.460182
4,8192,8192,256,16,128,512,communication-avoiding,7.532486
4,8192,8192,256,16,128,512,communication-avoiding,7.493563
4,8192,8192,256,16,256,-1,classical,5.390106
4,8192,8192,256,16,256,-1,classical,5.445904
4,8192,8192,256,16,256,-1,classical,5.445693
4,8192,8192,256,16,256,-1,classical,5.443770
4,8192,8192,256,16,256,-1,classical,5.419909
4,8192,8192,256,16,256,-1,classical,5.446969
4,8192,8192,256,16,256,-1,classical,5.504495
4,8192,8192,256,16,256,-1,classical,5.463343
4,8192,8192,256,16,256,-1,classical,5.430294
4,8192,8192,256,16,256,-1,classical,5.470285
4,8192,8192,256,16,256,256,communication-avoiding,2.234429
4,8192,8192,256,16,256,256,communication-avoiding,2.229998
4,8192,8192,256,16,256,256,communication-avoiding,2.220598
4,8192,8192,256,16,256,256,communication-avoiding,2.242445
4,8192,8192,256,16,256,256,communication-avoiding,2.233925
4,8192,8192,256,16,256,256,communication-avoiding,2.273260
4,8192,8192,256,16,256,256,communication-avoiding,2.234653
4,8192,8192,256,16,256,256,communication-avoiding,2.265953
4,8192,8192,256,16,256,256,communication-avoiding,2.227260
4,8192,8192,256,16,256,256,communication-avoiding,2.238353
4,8192,8192,256,16,256,512,communication-avoiding,2.536948
4,8192,8192,256,16,256,512,communication-avoiding,2.578602
4,8192,8192,256,16,256,512,communication-avoiding,2.625741
4,8192,8192,256,16,256,512,communication-avoiding,2.546013
4,8192,8192,256,16,256,512,communication-avoiding,2.561944
4,8192,8192,256,16,256,512,communication-avoiding,2.739110
4,8192,8192,256,16,256,512,communication-avoiding,2.576221
4,8192,8192,256,16,256,512,communication-avoiding,2.521138
4,8192,8192,256,16,256,512,communication-avoiding,2.569869
4,8192,8192,256,16,256,512,communication-avoiding,2.529636
4,8192,8192,256,16,256,1024,communication-avoiding,3.196520
4,8192,8192,256,16,256,1024,communication-avoiding,3.170206
4,8192,8192,256,16,256,1024,communication-avoiding,3.178052
4,8192,8192,256,16,256,1024,communication-avoiding,3.172704
4,8192,8192,256,16,256,1024,communication-avoiding,3.209310
4,8192,8192,256,16,256,1024,communication-avoiding,3.307078
4,8192,8192,256,16,256,1024,communication-avoiding,3.177558
4,8192,8192,256,16,256,1024,communication-avoiding,3.188693
4,8192,8192,256,16,256,1024,communication-avoiding,3.196368
4,8192,8192,256,16,256,1024,communication-avoiding,3.285465
4,8192,8192,1024,16,128,-1,classical,94.142987
4,8192,8192,1024,16,128,-1,classical,95.472476
4,8192,8192,1024,16,128,-1,classical,95.791951
4,8192,8192,1024,16,128,-1,classical,96.438405
4,8192,8192,1024,16,128,-1,classical,96.583992
4,8192,8192,1024,16,128,-1,classical,96.284271
4,8192,8192,1024,16,128,-1,classical,96.410457
4,8192,8192,1024,16,128,-1,classical,96.559053
4,8192,8192,1024,16,128,-1,classical,96.438369
4,8192,8192,1024,16,128,-1,classical,96.589051
4,8192,8192,1024,16,128,128,communication-avoiding,25.758529
4,8192,8192,1024,16,128,128,communication-avoiding,25.492057
4,8192,8192,1024,16,128,128,communication-avoiding,25.650843
4,8192,8192,1024,16,128,128,communication-avoiding,25.508502
4,8192,8192,1024,16,128,128,communication-avoiding,25.496556
4,8192,8192,1024,16,128,128,communication-avoiding,25.545817
4,8192,8192,1024,16,128,128,communication-avoiding,25.542243
4,8192,8192,1024,16,128,128,communication-avoiding,25.536582
4,8192,8192,1024,16,128,128,communication-avoiding,25.492140
4,8192,8192,1024,16,128,128,communication-avoiding,25.635071
4,8192,8192,1024,16,128,256,communication-avoiding,26.047342
4,8192,8192,1024,16,128,256,communication-avoiding,26.017810
4,8192,8192,1024,16,128,256,communication-avoiding,26.088725
4,8192,8192,1024,16,128,256,communication-avoiding,26.007191
4,8192,8192,1024,16,128,256,communication-avoiding,26.081941
4,8192,8192,1024,16,128,256,communication-avoiding,26.057181
4,8192,8192,1024,16,128,256,communication-avoiding,26.131188
4,8192,8192,1024,16,128,256,communication-avoiding,26.185823
4,8192,8192,1024,16,128,256,communication-avoiding,26.093161
4,8192,8192,1024,16,128,256,communication-avoiding,26.156434
4,8192,8192,1024,16,128,512,communication-avoiding,28.071907
4,8192,8192,1024,16,128,512,communication-avoiding,27.957735
4,8192,8192,1024,16,128,512,communication-avoiding,28.003305
4,8192,8192,1024,16,128,512,communication-avoiding,27.967743
4,8192,8192,1024,16,128,512,communication-avoiding,27.956127
4,8192,8192,1024,16,128,512,communication-avoiding,27.895946
4,8192,8192,1024,16,128,512,communication-avoiding,28.041565
4,8192,8192,1024,16,128,512,communication-avoiding,27.984664
4,8192,8192,1024,16,128,512,communication-avoiding,28.023221
4,8192,8192,1024,16,128,512,communication-avoiding,27.970257
4,8192,8192,1024,16,256,-1,classical,21.755630
4,8192,8192,1024,16,256,-1,classical,21.861049
4,8192,8192,1024,16,256,-1,classical,21.805897
4,8192,8192,1024,16,256,-1,classical,21.836223
4,8192,8192,1024,16,256,-1,classical,21.842588
4,8192,8192,1024,16,256,-1,classical,21.812385
4,8192,8192,1024,16,256,-1,classical,21.777415
4,8192,8192,1024,16,256,-1,classical,21.683968
4,8192,8192,1024,16,256,-1,classical,21.771846
4,8192,8192,1024,16,256,-1,classical,21.693412
4,8192,8192,1024,16,256,256,communication-avoiding,9.146695
4,8192,8192,1024,16,256,256,communication-avoiding,8.936131
4,8192,8192,1024,16,256,256,communication-avoiding,9.660511
4,8192,8192,1024,16,256,256,communication-avoiding,9.385993
4,8192,8192,1024,16,256,256,communication-avoiding,8.949718
4,8192,8192,1024,16,256,256,communication-avoiding,9.291129
4,8192,8192,1024,16,256,256,communication-avoiding,9.087950
4,8192,8192,1024,16,256,256,communication-avoiding,9.374727
4,8192,8192,1024,16,256,256,communication-avoiding,9.362576
4,8192,8192,1024,16,256,256,communication-avoiding,9.246473
4,8192,8192,1024,16,256,512,communication-avoiding,9.595587
4,8192,8192,1024,16,256,512,communication-avoiding,10.177754
4,8192,8192,1024,16,256,512,communication-avoiding,10.440992
4,8192,8192,1024,16,256,512,communication-avoiding,10.255873
4,8192,8192,1024,16,256,512,communication-avoiding,9.755022
4,8192,8192,1024,16,256,512,communication-avoiding,9.740569
4,8192,8192,1024,16,256,512,communication-avoiding,9.631000
4,8192,8192,1024,16,256,512,communication-avoiding,9.754132
4,8192,8192,1024,16,256,512,communication-avoiding,9.803570
4,8192,8192,1024,16,256,512,communication-avoiding,9.907044
4,8192,8192,1024,16,256,1024,communication-avoiding,10.747792
4,8192,8192,1024,16,256,1024,communication-avoiding,10.990105
4,8192,8192,1024,16,256,1024,communication-avoiding,11.173418
4,8192,8192,1024,16,256,1024,communication-avoiding,11.541795
4,8192,8192,1024,16,256,1024,communication-avoiding,11.156605
4,8192,8192,1024,16,256,1024,communication-avoiding,10.866244
4,8192,8192,1024,16,256,1024,communication-avoiding,11.020912
4,8192,8192,1024,16,256,1024,communication-avoiding,11.198483
4,8192,8192,1024,16,256,1024,communication-avoiding,11.094107
4,8192,8192,1024,16,256,1024,communication-avoiding,11.036164
4,8192,8192,16,256,128,-1,classical,2.123163
4,8192,8192,16,256,128,-1,classical,2.113074
4,8192,8192,16,256,128,-1,classical,2.149686
4,8192,8192,16,256,128,-1,classical,2.234460
4,8192,8192,16,256,128,-1,classical,2.127967
4,8192,8192,16,256,128,-1,classical,2.124146
4,8192,8192,16,256,128,-1,classical,2.167832
4,8192,8192,16,256,128,-1,classical,2.121294
4,8192,8192,16,256,128,-1,classical,2.109144
4,8192,8192,16,256,128,-1,classical,2.116105
4,8192,8192,16,256,128,128,communication-avoiding,2.029382
4,8192,8192,16,256,128,128,communication-avoiding,2.019483
4,8192,8192,16,256,128,128,communication-avoiding,2.029311
4,8192,8192,16,256,128,128,communication-avoiding,2.020475
4,8192,8192,16,256,128,128,communication-avoiding,2.083627
4,8192,8192,16,256,128,128,communication-avoiding,2.020924
4,8192,8192,16,256,128,128,communication-avoiding,2.020854
4,8192,8192,16,256,128,128,communication-avoiding,2.099153
4,8192,8192,16,256,128,128,communication-avoiding,2.021952
4,8192,8192,16,256,128,128,communication-avoiding,2.022353
4,8192,8192,16,256,128,256,communication-avoiding,2.163348
4,8192,8192,16,256,128,256,communication-avoiding,2.153163
4,8192,8192,16,256,128,256,communication-avoiding,2.157116
4,8192,8192,16,256,128,256,communication-avoiding,2.151637
4,8192,8192,16,256,128,256,communication-avoiding,2.179168
4,8192,8192,16,256,128,256,communication-avoiding,2.154131
4,8192,8192,16,256,128,256,communication-avoiding,2.152353
4,8192,8192,16,256,128,256,communication-avoiding,2.186621
4,8192,8192,16,256,128,256,communication-avoiding,2.150906
4,8192,8192,16,256,128,256,communication-avoiding,2.164616
4,8192,8192,16,256,128,512,communication-avoiding,2.459423
4,8192,8192,16,256,128,512,communication-avoiding,2.440264
4,8192,8192,16,256,128,512,communication-avoiding,2.428917
4,8192,8192,16,256,128,512,communication-avoiding,2.463050
4,8192,8192,16,256,128,512,communication-avoiding,2.431795
4,8192,8192,16,256,128,512,communication-avoiding,2.426845
4,8192,8192,16,256,128,512,communication-avoiding,2.511760
4,8192,8192,16,256,128,512,communication-avoiding,2.426208
4,8192,8192,16,256,128,512,communication-avoiding,2.433019
4,8192,8192,16,256,128,512,communication-avoiding,2.427343
4,8192,8192,16,256,256,-1,classical,1.895732
4,8192,8192,16,256,256,-1,classical,1.847204
4,8192,8192,16,256,256,-1,classical,1.836810
4,8192,8192,16,256,256,-1,classical,1.876623
4,8192,8192,16,256,256,-1,classical,1.850989
4,8192,8192,16,256,256,-1,classical,1.852270
4,8192,8192,16,256,256,-1,classical,1.876168
4,8192,8192,16,256,256,-1,classical,1.861850
4,8192,8192,16,256,256,-1,classical,1.859632
4,8192,8192,16,256,256,-1,classical,1.871895
4,8192,8192,16,256,256,256,communication-avoiding,1.849220
4,8192,8192,16,256,256,256,communication-avoiding,1.854594
4,8192,8192,16,256,256,256,communication-avoiding,1.858511
4,8192,8192,16,256,256,256,communication-avoiding,1.856671
4,8192,8192,16,256,256,256,communication-avoiding,1.846841
4,8192,8192,16,256,256,256,communication-avoiding,1.874017
4,8192,8192,16,256,256,256,communication-avoiding,1.841853
4,8192,8192,16,256,256,256,communication-avoiding,1.847666
4,8192,8192,16,256,256,256,communication-avoiding,1.842842
4,8192,8192,16,256,256,256,communication-avoiding,1.868443
4,8192,8192,16,256,256,512,communication-avoiding,2.092015
4,8192,8192,16,256,256,512,communication-avoiding,2.089940
4,8192,8192,16,256,256,512,communication-avoiding,2.097276
4,8192,8192,16,256,256,512,communication-avoiding,2.119581
4,8192,8192,16,256,256,512,communication-avoiding,2.089272
4,8192,8192,16,256,256,512,communication-avoiding,2.113341
4,8192,8192,16,256,256,512,communication-avoiding,2.116611
4,8192,8192,16,256,256,512,communication-avoiding,2.092295
4,8192,8192,16,256,256,512,communication-avoiding,2.099030
4,8192,8192,16,256,256,512,communication-avoiding,2.116204
4,8192,8192,16,256,256,1024,communication-avoiding,2.641013
4,8192,8192,16,256,256,1024,communication-avoiding,2.652644
4,8192,8192,16,256,256,1024,communication-avoiding,2.672983
4,8192,8192,16,256,256,1024,communication-avoiding,2.644143
4,8192,8192,16,256,256,1024,communication-avoiding,2.644408
4,8192,8192,16,256,256,1024,communication-avoiding,2.649510
4,8192,8192,16,256,256,1024,communication-avoiding,2.652304
4,8192,8192,16,256,256,1024,communication-avoiding,2.636883
4,8192,8192,16,256,256,1024,communication-avoiding,2.652162
4,8192,8192,16,256,256,1024,communication-avoiding,2.649448
4,8192,8192,64,256,128,-1,classical,8.558547
4,8192,8192,64,256,128,-1,classical,8.602501
4,8192,8192,64,256,128,-1,classical,8.505558
4,8192,8192,64,256,128,-1,classical,8.584116
4,8192,8192,64,256,128,-1,classical,8.581012
4,8192,8192,64,256,128,-1,classical,8.530141
4,8192,8192,64,256,128,-1,classical,8.577162
4,8192,8192,64,256,128,-1,classical,8.485177
4,8192,8192,64,256,128,-1,classical,8.648739
4,8192,8192,64,256,128,-1,classical,8.545429
4,8192,8192,64,256,128,128,communication-avoiding,8.181350
4,8192,8192,64,256,128,128,communication-avoiding,8.234811
4,8192,8192,64,256,128,128,communication-avoiding,8.250120
4,8192,8192,64,256,128,128,communication-avoiding,8.387630
4,8192,8192,64,256,128,128,communication-avoiding,8.254938
4,8192,8192,64,256,128,128,communication-avoiding,8.292348
4,8192,8192,64,256,128,128,communication-avoiding,8.290603
4,8192,8192,64,256,128,128,communication-avoiding,8.333494
4,8192,8192,64,256,128,128,communication-avoiding,8.257434
4,8192,8192,64,256,128,128,communication-avoiding,8.196639
4,8192,8192,64,256,128,256,communication-avoiding,8.714969
4,8192,8192,64,256,128,256,communication-avoiding,8.891708
4,8192,8192,64,256,128,256,communication-avoiding,8.749650
4,8192,8192,64,256,128,256,communication-avoiding,8.713217
4,8192,8192,64,256,128,256,communication-avoiding,8.716316
4,8192,8192,64,256,128,256,communication-avoiding,8.681242
4,8192,8192,64,256,128,256,communication-avoiding,8.778639
4,8192,8192,64,256,128,256,communication-avoiding,8.727467
4,8192,8192,64,256,128,256,communication-avoiding,8.712937
4,8192,8192,64,256,128,256,communication-avoiding,8.804500
4,8192,8192,64,256,128,512,communication-avoiding,9.846757
4,8192,8192,64,256,128,512,communication-avoiding,9.857456
4,8192,8192,64,256,128,512,communication-avoiding,9.825214
4,8192,8192,64,256,128,512,communication-avoiding,9.858649
4,8192,8192,64,256,128,512,communication-avoiding,9.874261
4,8192,8192,64,256,128,512,communication-avoiding,10.030272
4,8192,8192,64,256,128,512,communication-avoiding,9.829896
4,8192,8192,64,256,128,512,communication-avoiding,9.827161
4,8192,8192,64,256,128,512,communication-avoiding,9.893884
4,8192,8192,64,256,128,512,communication-avoiding,9.899280
4,8192,8192,64,256,256,-1,classical,7.377862
4,8192,8192,64,256,256,-1,classical,8.014496
4,8192,8192,64,256,256,-1,classical,7.459735
4,8192,8192,64,256,256,-1,classical,7.409691
4,8192,8192,64,256,256,-1,classical,7.411714
4,8192,8192,64,256,256,-1,classical,7.442770
4,8192,8192,64,256,256,-1,classical,7.356792
4,8192,8192,64,256,256,-1,classical,7.519951
4,8192,8192,64,256,256,-1,classical,7.845584
4,8192,8192,64,256,256,-1,classical,7.342854
4,8192,8192,64,256,256,256,communication-avoiding,7.387376
4,8192,8192,64,256,256,256,communication-avoiding,7.412356
4,8192,8192,64,256,256,256,communication-avoiding,7.426607
4,8192,8192,64,256,256,256,communication-avoiding,7.374711
4,8192,8192,64,256,256,256,communication-avoiding,7.393693
4,8192,8192,64,256,256,256,communication-avoiding,7.373252
4,8192,8192,64,256,256,256,communication-avoiding,7.368669
4,8192,8192,64,256,256,256,communication-avoiding,7.502897
4,8192,8192,64,256,256,256,communication-avoiding,7.371212
4,8192,8192,64,256,256,256,communication-avoiding,7.388381
4,8192,8192,64,256,256,512,communication-avoiding,8.392400
4,8192,8192,64,256,256,512,communication-avoiding,8.427545
4,8192,8192,64,256,256,512,communication-avoiding,8.424147
4,8192,8192,64,256,256,512,communication-avoiding,8.391871
4,8192,8192,64,256,256,512,communication-avoiding,8.424840
4,8192,8192,64,256,256,512,communication-avoiding,8.374175
4,8192,8192,64,256,256,512,communication-avoiding,8.374881
4,8192,8192,64,256,256,512,communication-avoiding,8.435141
4,8192,8192,64,256,256,512,communication-avoiding,8.374007
4,8192,8192,64,256,256,512,communication-avoiding,8.380240
4,8192,8192,64,256,256,1024,communication-avoiding,10.636159
4,8192,8192,64,256,256,1024,communication-avoiding,10.604546
4,8192,8192,64,256,256,1024,communication-avoiding,10.607045
4,8192,8192,64,256,256,1024,communication-avoiding,10.594933
4,8192,8192,64,256,256,1024,communication-avoiding,10.687798
4,8192,8192,64,256,256,1024,communication-avoiding,10.583113
4,8192,8192,64,256,256,1024,communication-avoiding,10.668762
4,8192,8192,64,256,256,1024,communication-avoiding,10.586910
4,8192,8192,64,256,256,1024,communication-avoiding,10.602709
4,8192,8192,64,256,256,1024,communication-avoiding,10.569613
4,8192,8192,256,256,128,-1,classical,34.479440
4,8192,8192,256,256,128,-1,classical,33.835123
4,8192,8192,256,256,128,-1,classical,34.641881
4,8192,8192,256,256,128,-1,classical,34.303264
4,8192,8192,256,256,128,-1,classical,34.249068
4,8192,8192,256,256,128,-1,classical,34.308415
4,8192,8192,256,256,128,-1,classical,34.131762
4,8192,8192,256,256,128,-1,classical,34.328261
4,8192,8192,256,256,128,-1,classical,34.189285
4,8192,8192,256,256,128,-1,classical,34.233404
4,8192,8192,256,256,128,128,communication-avoiding,33.253897
4,8192,8192,256,256,128,128,communication-avoiding,33.819278
4,8192,8192,256,256,128,128,communication-avoiding,34.926817
4,8192,8192,256,256,128,128,communication-avoiding,34.655293
4,8192,8192,256,256,128,128,communication-avoiding,33.422553
4,8192,8192,256,256,128,128,communication-avoiding,33.156228
4,8192,8192,256,256,128,128,communication-avoiding,33.383770
4,8192,8192,256,256,128,128,communication-avoiding,33.846209
4,8192,8192,256,256,128,128,communication-avoiding,33.192145
4,8192,8192,256,256,128,128,communication-avoiding,34.185941
4,8192,8192,256,256,128,256,communication-avoiding,34.898396
4,8192,8192,256,256,128,256,communication-avoiding,34.902890
4,8192,8192,256,256,128,256,communication-avoiding,34.613528
4,8192,8192,256,256,128,256,communication-avoiding,34.405033
4,8192,8192,256,256,128,256,communication-avoiding,34.348626
4,8192,8192,256,256,128,256,communication-avoiding,36.734638
4,8192,8192,256,256,128,256,communication-avoiding,37.742655
4,8192,8192,256,256,128,256,communication-avoiding,35.222224
4,8192,8192,256,256,128,256,communication-avoiding,34.324368
4,8192,8192,256,256,128,256,communication-avoiding,34.282566
4,8192,8192,256,256,128,512,communication-avoiding,39.356633
4,8192,8192,256,256,128,512,communication-avoiding,38.596654
4,8192,8192,256,256,128,512,communication-avoiding,40.942964
4,8192,8192,256,256,128,512,communication-avoiding,39.778030
4,8192,8192,256,256,128,512,communication-avoiding,38.632024
4,8192,8192,256,256,128,512,communication-avoiding,39.043434
4,8192,8192,256,256,128,512,communication-avoiding,38.948713
4,8192,8192,256,256,128,512,communication-avoiding,39.049356
4,8192,8192,256,256,128,512,communication-avoiding,40.758676
4,8192,8192,256,256,128,512,communication-avoiding,38.989040
4,8192,8192,256,256,128,-1,classical,34.371571
4,8192,8192,256,256,128,-1,classical,33.996483
4,8192,8192,256,256,128,-1,classical,34.643519
4,8192,8192,256,256,128,-1,classical,34.897568
4,8192,8192,256,256,128,-1,classical,34.074335
4,8192,8192,256,256,128,-1,classical,34.433747
4,8192,8192,256,256,128,-1,classical,34.058603
4,8192,8192,256,256,128,-1,classical,34.002229
4,8192,8192,256,256,128,-1,classical,34.206122
4,8192,8192,256,256,128,-1,classical,34.072895
4,8192,8192,256,256,128,128,communication-avoiding,33.195492
4,8192,8192,256,256,128,128,communication-avoiding,33.843330
4,8192,8192,256,256,128,128,communication-avoiding,34.249225
4,8192,8192,256,256,128,128,communication-avoiding,34.871452
4,8192,8192,256,256,128,128,communication-avoiding,33.980740
4,8192,8192,256,256,128,128,communication-avoiding,33.130785
4,8192,8192,256,256,128,128,communication-avoiding,33.532171
4,8192,8192,256,256,128,128,communication-avoiding,33.894795
4,8192,8192,256,256,128,128,communication-avoiding,33.803308
4,8192,8192,256,256,128,128,communication-avoiding,33.431742
4,8192,8192,256,256,128,256,communication-avoiding,34.320751
4,8192,8192,256,256,128,256,communication-avoiding,35.700073
4,8192,8192,256,256,128,256,communication-avoiding,34.656086
4,8192,8192,256,256,128,256,communication-avoiding,34.685453
4,8192,8192,256,256,128,256,communication-avoiding,35.197859
4,8192,8192,256,256,128,256,communication-avoiding,36.382718
4,8192,8192,256,256,128,256,communication-avoiding,35.573603
4,8192,8192,256,256,128,256,communication-avoiding,35.539809
4,8192,8192,256,256,128,256,communication-avoiding,34.983469
4,8192,8192,256,256,128,256,communication-avoiding,34.473272
4,8192,8192,256,256,128,512,communication-avoiding,38.642235
4,8192,8192,256,256,128,512,communication-avoiding,40.399513
4,8192,8192,256,256,128,512,communication-avoiding,40.618857
4,8192,8192,256,256,128,512,communication-avoiding,40.162082
4,8192,8192,256,256,128,512,communication-avoiding,39.681602
4,8192,8192,256,256,128,512,communication-avoiding,40.222299
4,8192,8192,256,256,128,512,communication-avoiding,40.082905
4,8192,8192,256,256,128,512,communication-avoiding,39.514546
4,8192,8192,256,256,128,512,communication-avoiding,39.374737
4,8192,8192,256,256,128,512,communication-avoiding,39.129288
4,8192,8192,256,256,256,-1,classical,29.517107
4,8192,8192,256,256,256,-1,classical,30.111126
4,8192,8192,256,256,256,-1,classical,30.056111
4,8192,8192,256,256,256,-1,classical,29.657446
4,8192,8192,256,256,256,-1,classical,29.666464
4,8192,8192,256,256,256,-1,classical,29.523845
4,8192,8192,256,256,256,-1,classical,30.920132
4,8192,8192,256,256,256,-1,classical,29.541630
4,8192,8192,256,256,256,-1,classical,30.168027
4,8192,8192,256,256,256,-1,classical,29.855601
4,8192,8192,256,256,256,256,communication-avoiding,30.977454
4,8192,8192,256,256,256,256,communication-avoiding,30.918170
4,8192,8192,256,256,256,256,communication-avoiding,30.933125
4,8192,8192,256,256,256,256,communication-avoiding,30.940189
4,8192,8192,256,256,256,256,communication-avoiding,30.993531
4,8192,8192,256,256,256,256,communication-avoiding,30.889807
4,8192,8192,256,256,256,256,communication-avoiding,31.260945
4,8192,8192,256,256,256,256,communication-avoiding,30.943846
4,8192,8192,256,256,256,256,communication-avoiding,30.910290
4,8192,8192,256,256,256,256,communication-avoiding,31.115087
4,8192,8192,256,256,256,512,communication-avoiding,35.076005
4,8192,8192,256,256,256,512,communication-avoiding,35.101391
4,8192,8192,256,256,256,512,communication-avoiding,35.211654
4,8192,8192,256,256,256,512,communication-avoiding,35.013004
4,8192,8192,256,256,256,512,communication-avoiding,35.008384
4,8192,8192,256,256,256,512,communication-avoiding,34.974530
4,8192,8192,256,256,256,512,communication-avoiding,35.128531
4,8192,8192,256,256,256,512,communication-avoiding,35.086189
4,8192,8192,256,256,256,512,communication-avoiding,35.100738
4,8192,8192,256,256,256,512,communication-avoiding,35.126346
4,8192,8192,256,256,256,1024,communication-avoiding,44.123652
4,8192,8192,256,256,256,1024,communication-avoiding,44.122141
4,8192,8192,256,256,256,1024,communication-avoiding,44.119234
4,8192,8192,256,256,256,1024,communication-avoiding,44.035192
4,8192,8192,256,256,256,1024,communication-avoiding,43.983357
4,8192,8192,256,256,256,1024,communication-avoiding,43.961964
4,8192,8192,256,256,256,1024,communication-avoiding,43.962201
4,8192,8192,256,256,256,1024,communication-avoiding,43.970337
4,8192,8192,256,256,256,1024,communication-avoiding,43.979411
4,8192,8192,256,256,256,1024,communication-avoiding,44.142879
4,8192,8192,1024,256,128,-1,classical,136.388523
4,8192,8192,1024,256,128,-1,classical,136.768750
4,8192,8192,1024,256,128,-1,classical,136.525239
4,8192,8192,1024,256,128,-1,classical,136.727002
4,8192,8192,1024,256,128,-1,classical,136.173650
4,8192,8192,1024,256,128,-1,classical,136.350257
4,8192,8192,1024,256,128,-1,classical,137.164869
4,8192,8192,1024,256,128,-1,classical,136.719512
4,8192,8192,1024,256,128,-1,classical,136.410493
4,8192,8192,1024,256,128,-1,classical,136.716179
4,8192,8192,1024,256,128,128,communication-avoiding,132.938979
4,8192,8192,1024,256,128,128,communication-avoiding,144.961389
4,8192,8192,1024,256,128,128,communication-avoiding,139.176562
4,8192,8192,1024,256,128,128,communication-avoiding,133.408050
4,8192,8192,1024,256,128,128,communication-avoiding,134.750391
4,8192,8192,1024,256,128,128,communication-avoiding,134.023821
4,8192,8192,1024,256,128,128,communication-avoiding,134.094872
4,8192,8192,1024,256,128,128,communication-avoiding,135.725061
4,8192,8192,1024,256,128,128,communication-avoiding,137.414433
4,8192,8192,1024,256,128,128,communication-avoiding,134.188038
4,8192,8192,1024,256,128,256,communication-avoiding,136.869861
4,8192,8192,1024,256,128,256,communication-avoiding,142.760748
4,8192,8192,1024,256,128,256,communication-avoiding,142.377369
4,8192,8192,1024,256,128,256,communication-avoiding,139.489609
4,8192,8192,1024,256,128,256,communication-avoiding,139.696776
4,8192,8192,1024,256,128,256,communication-avoiding,139.159045
4,8192,8192,1024,256,128,256,communication-avoiding,138.912590
4,8192,8192,1024,256,128,256,communication-avoiding,138.599783
4,8192,8192,1024,256,128,256,communication-avoiding,138.600039
4,8192,8192,1024,256,128,256,communication-avoiding,138.554934
4,8192,8192,1024,256,128,512,communication-avoiding,146.108951
4,8192,8192,1024,256,128,512,communication-avoiding,152.418821
4,8192,8192,1024,256,128,512,communication-avoiding,148.986331
4,8192,8192,1024,256,128,512,communication-avoiding,147.579485
4,8192,8192,1024,256,128,512,communication-avoiding,147.168548
4,8192,8192,1024,256,128,512,communication-avoiding,148.148546
4,8192,8192,1024,256,128,512,communication-avoiding,151.056422
4,8192,8192,1024,256,128,512,communication-avoiding,147.522639
4,8192,8192,1024,256,128,512,communication-avoiding,147.970467
4,8192,8192,1024,256,128,512,communication-avoiding,148.799059
