%%MatrixMarket matrix coordinate real general
%
1331 1 1330
2 1 6.666666666666666e+00
3 1 1.333333333333333e+01
4 1 2.000000000000000e+01
5 1 2.666666666666666e+01
6 1 3.333333333333333e+01
7 1 4.000000000000000e+01
8 1 4.666666666666666e+01
9 1 5.333333333333333e+01
10 1 1.191666666666667e+02
11 1 1.316666666666667e+02
12 1 1.433333333333333e+02
13 1 1.550000000000000e+02
14 1 1.666666666666667e+02
15 1 1.783333333333333e+02
16 1 1.900000000000000e+02
17 1 2.016666666666667e+02
18 1 2.208333333333333e+02
19 1 2.316666666666666e+02
20 1 2.366666666666667e+02
21 1 2.483333333333333e+02
22 1 2.600000000000000e+02
23 1 2.716666666666666e+02
24 1 2.833333333333333e+02
25 1 2.950000000000000e+02
26 1 3.066666666666666e+02
27 1 3.333333333333333e+02
28 1 3.441666666666666e+02
29 1 3.416666666666666e+02
30 1 3.533333333333333e+02
31 1 3.649999999999999e+02
32 1 3.766666666666666e+02
33 1 3.883333333333333e+02
34 1 3.999999999999999e+02
35 1 4.116666666666666e+02
36 1 4.458333333333333e+02
37 1 4.566666666666666e+02
38 1 4.466666666666666e+02
39 1 4.583333333333333e+02
40 1 4.700000000000000e+02
41 1 4.816666666666666e+02
42 1 4.933333333333333e+02
43 1 5.050000000000000e+02
44 1 5.166666666666666e+02
45 1 5.583333333333333e+02
46 1 5.691666666666666e+02
47 1 5.516666666666666e+02
48 1 5.633333333333333e+02
49 1 5.750000000000000e+02
50 1 5.866666666666666e+02
51 1 5.983333333333333e+02
52 1 6.099999999999999e+02
53 1 6.216666666666666e+02
54 1 6.708333333333333e+02
55 1 6.816666666666665e+02
56 1 6.566666666666666e+02
57 1 6.683333333333333e+02
58 1 6.799999999999999e+02
59 1 6.916666666666666e+02
60 1 7.033333333333333e+02
61 1 7.149999999999999e+02
62 1 7.266666666666666e+02
63 1 7.833333333333333e+02
64 1 4.161666666666667e+02
65 1 3.776666666666666e+02
66 1 3.833333333333333e+02
67 1 3.890000000000000e+02
68 1 3.946666666666666e+02
69 1 4.003333333333333e+02
70 1 4.060000000000000e+02
71 1 4.116666666666666e+02
72 1 4.698333333333333e+02
73 1 9.066666666666667e+01
74 1 8.666666666666666e+01
75 1 8.783333333333333e+01
76 1 8.900000000000000e+01
77 1 9.016666666666666e+01
78 1 9.133333333333333e+01
79 1 9.250000000000000e+01
80 1 9.366666666666666e+01
81 1 1.008333333333333e+02
82 1 1.019166666666667e+02
83 1 9.716666666666666e+01
84 1 9.833333333333333e+01
85 1 9.950000000000000e+01
86 1 1.006666666666667e+02
87 1 1.018333333333333e+02
88 1 1.030000000000000e+02
89 1 1.041666666666667e+02
90 1 1.120833333333333e+02
91 1 5.316666666666666e+01
92 1 4.700000000000000e+01
93 1 4.750000000000000e+01
94 1 4.800000000000000e+01
95 1 4.850000000000000e+01
96 1 4.900000000000000e+01
97 1 4.950000000000000e+01
98 1 4.999999999999999e+01
99 1 5.799999999999999e+01
100 1 1.295833333333333e+03
101 1 1.298333333333333e+03
102 1 1.306666666666667e+03
103 1 1.315000000000000e+03
104 1 1.323333333333333e+03
105 1 1.331666666666667e+03
106 1 1.340000000000000e+03
107 1 1.348333333333333e+03
108 1 1.379166666666667e+03
109 1 2.650000000000000e+03
110 1 2.473333333333333e+03
111 1 2.486666666666666e+03
112 1 2.500000000000000e+03
113 1 2.513333333333333e+03
114 1 2.526666666666666e+03
115 1 2.540000000000000e+03
116 1 2.553333333333333e+03
117 1 2.806666666666666e+03
118 1 2.814999999999999e+03
119 1 2.593333333333333e+03
120 1 2.606666666666666e+03
121 1 2.619999999999999e+03
122 1 2.633333333333333e+03
123 1 2.646666666666666e+03
124 1 2.659999999999999e+03
125 1 2.673333333333333e+03
126 1 2.971666666666666e+03
127 1 2.979999999999999e+03
128 1 2.713333333333333e+03
129 1 2.726666666666666e+03
130 1 2.739999999999999e+03
131 1 2.753333333333333e+03
132 1 2.766666666666666e+03
133 1 2.779999999999999e+03
134 1 2.793333333333333e+03
135 1 3.136666666666666e+03
136 1 3.144999999999999e+03
137 1 2.833333333333333e+03
138 1 2.846666666666666e+03
139 1 2.859999999999999e+03
140 1 2.873333333333333e+03
141 1 2.886666666666666e+03
142 1 2.899999999999999e+03
143 1 2.913333333333332e+03
144 1 3.301666666666666e+03
145 1 3.309999999999999e+03
146 1 2.953333333333332e+03
147 1 2.966666666666666e+03
148 1 2.979999999999999e+03
149 1 2.993333333333332e+03
150 1 3.006666666666666e+03
151 1 3.019999999999999e+03
152 1 3.033333333333332e+03
153 1 3.466666666666666e+03
154 1 3.474999999999999e+03
155 1 3.073333333333333e+03
156 1 3.086666666666666e+03
157 1 3.099999999999999e+03
158 1 3.113333333333333e+03
159 1 3.126666666666666e+03
160 1 3.139999999999999e+03
161 1 3.153333333333333e+03
162 1 3.631666666666666e+03
163 1 1.906750000000000e+03
164 1 1.552333333333333e+03
165 1 1.558166666666667e+03
166 1 1.564000000000000e+03
167 1 1.569833333333333e+03
168 1 1.575666666666667e+03
169 1 1.581500000000000e+03
170 1 1.587333333333333e+03
171 1 1.988416666666667e+03
172 1 3.805000000000000e+02
173 1 3.313333333333333e+02
174 1 3.326666666666666e+02
175 1 3.340000000000000e+02
176 1 3.353333333333333e+02
177 1 3.366666666666666e+02
178 1 3.380000000000000e+02
179 1 3.393333333333333e+02
180 1 3.961666666666666e+02
181 1 3.970000000000000e+02
182 1 3.433333333333333e+02
183 1 3.446666666666666e+02
184 1 3.460000000000000e+02
185 1 3.473333333333333e+02
186 1 3.486666666666666e+02
187 1 3.500000000000000e+02
188 1 3.513333333333333e+02
189 1 4.126666666666666e+02
190 1 1.939166666666667e+02
191 1 1.505000000000000e+02
192 1 1.510000000000000e+02
193 1 1.515000000000000e+02
194 1 1.520000000000000e+02
195 1 1.525000000000000e+02
196 1 1.530000000000000e+02
197 1 1.535000000000000e+02
198 1 2.012500000000000e+02
199 1 2.285833333333333e+03
200 1 2.123333333333333e+03
201 1 2.131666666666667e+03
202 1 2.140000000000000e+03
203 1 2.148333333333333e+03
204 1 2.156666666666667e+03
205 1 2.165000000000000e+03
206 1 2.173333333333333e+03
207 1 2.369166666666667e+03
208 1 4.464999999999999e+03
209 1 3.793333333333332e+03
210 1 3.806666666666666e+03
211 1 3.820000000000000e+03
212 1 3.833333333333332e+03
213 1 3.846666666666666e+03
214 1 3.860000000000000e+03
215 1 3.873333333333332e+03
216 1 4.621666666666666e+03
217 1 4.629999999999999e+03
218 1 3.913333333333332e+03
219 1 3.926666666666666e+03
220 1 3.940000000000000e+03
221 1 3.953333333333332e+03
222 1 3.966666666666666e+03
223 1 3.980000000000000e+03
224 1 3.993333333333332e+03
225 1 4.786666666666666e+03
226 1 4.794999999999999e+03
227 1 4.033333333333332e+03
228 1 4.046666666666666e+03
229 1 4.060000000000000e+03
230 1 4.073333333333332e+03
231 1 4.086666666666666e+03
232 1 4.099999999999998e+03
233 1 4.113333333333332e+03
234 1 4.951666666666666e+03
235 1 4.959999999999998e+03
236 1 4.153333333333332e+03
237 1 4.166666666666666e+03
238 1 4.179999999999998e+03
239 1 4.193333333333332e+03
240 1 4.206666666666666e+03
241 1 4.219999999999998e+03
242 1 4.233333333333332e+03
243 1 5.116666666666666e+03
244 1 5.124999999999998e+03
245 1 4.273333333333332e+03
246 1 4.286666666666666e+03
247 1 4.299999999999998e+03
248 1 4.313333333333332e+03
249 1 4.326666666666666e+03
250 1 4.339999999999998e+03
251 1 4.353333333333332e+03
252 1 5.281666666666666e+03
253 1 5.289999999999998e+03
254 1 4.393333333333332e+03
255 1 4.406666666666666e+03
256 1 4.419999999999998e+03
257 1 4.433333333333332e+03
258 1 4.446666666666666e+03
259 1 4.459999999999998e+03
260 1 4.473333333333332e+03
261 1 5.446666666666666e+03
262 1 2.830750000000000e+03
263 1 2.129833333333333e+03
264 1 2.135666666666667e+03
265 1 2.141500000000000e+03
266 1 2.147333333333333e+03
267 1 2.153166666666667e+03
268 1 2.159000000000000e+03
269 1 2.164833333333333e+03
270 1 2.912416666666667e+03
271 1 5.620000000000000e+02
272 1 4.633333333333333e+02
273 1 4.646666666666666e+02
274 1 4.660000000000000e+02
275 1 4.673333333333333e+02
276 1 4.686666666666666e+02
277 1 4.700000000000000e+02
278 1 4.713333333333333e+02
279 1 5.776666666666666e+02
280 1 5.785000000000000e+02
281 1 4.753333333333333e+02
282 1 4.766666666666666e+02
283 1 4.780000000000000e+02
284 1 4.793333333333333e+02
285 1 4.806666666666666e+02
286 1 4.820000000000000e+02
287 1 4.833333333333333e+02
288 1 5.941666666666666e+02
289 1 2.764166666666667e+02
290 1 2.000000000000000e+02
291 1 2.005000000000000e+02
292 1 2.010000000000000e+02
293 1 2.015000000000000e+02
294 1 2.020000000000000e+02
295 1 2.025000000000000e+02
296 1 2.030000000000000e+02
297 1 2.837500000000000e+02
298 1 3.275833333333333e+03
299 1 2.948333333333333e+03
300 1 2.956666666666667e+03
301 1 2.965000000000000e+03
302 1 2.973333333333333e+03
303 1 2.981666666666667e+03
304 1 2.990000000000000e+03
305 1 2.998333333333333e+03
306 1 3.359166666666667e+03
307 1 6.279999999999998e+03
308 1 5.113333333333332e+03
309 1 5.126666666666666e+03
310 1 5.139999999999998e+03
311 1 5.153333333333331e+03
312 1 5.166666666666666e+03
313 1 5.179999999999998e+03
314 1 5.193333333333331e+03
315 1 6.436666666666666e+03
316 1 6.444999999999998e+03
317 1 5.233333333333331e+03
318 1 5.246666666666666e+03
319 1 5.259999999999998e+03
320 1 5.273333333333331e+03
321 1 5.286666666666666e+03
322 1 5.299999999999998e+03
323 1 5.313333333333331e+03
324 1 6.601666666666666e+03
325 1 6.609999999999998e+03
326 1 5.353333333333331e+03
327 1 5.366666666666666e+03
328 1 5.379999999999998e+03
329 1 5.393333333333331e+03
330 1 5.406666666666666e+03
331 1 5.419999999999998e+03
332 1 5.433333333333331e+03
333 1 6.766666666666666e+03
334 1 6.774999999999998e+03
335 1 5.473333333333331e+03
336 1 5.486666666666666e+03
337 1 5.499999999999998e+03
338 1 5.513333333333331e+03
339 1 5.526666666666666e+03
340 1 5.539999999999998e+03
341 1 5.553333333333331e+03
342 1 6.931666666666666e+03
343 1 6.939999999999998e+03
344 1 5.593333333333331e+03
345 1 5.606666666666666e+03
346 1 5.619999999999998e+03
347 1 5.633333333333331e+03
348 1 5.646666666666666e+03
349 1 5.659999999999998e+03
350 1 5.673333333333331e+03
351 1 7.096666666666666e+03
352 1 7.104999999999998e+03
353 1 5.713333333333331e+03
354 1 5.726666666666666e+03
355 1 5.739999999999998e+03
356 1 5.753333333333331e+03
357 1 5.766666666666666e+03
358 1 5.779999999999998e+03
359 1 5.793333333333331e+03
360 1 7.261666666666664e+03
361 1 3.754750000000000e+03
362 1 2.707333333333333e+03
363 1 2.713166666666667e+03
364 1 2.719000000000000e+03
365 1 2.724833333333333e+03
366 1 2.730666666666667e+03
367 1 2.736500000000000e+03
368 1 2.742333333333333e+03
369 1 3.836416666666667e+03
370 1 7.435000000000000e+02
371 1 5.953333333333334e+02
372 1 5.966666666666665e+02
373 1 5.980000000000000e+02
374 1 5.993333333333334e+02
375 1 6.006666666666665e+02
376 1 6.020000000000000e+02
377 1 6.033333333333334e+02
378 1 7.591666666666666e+02
379 1 7.600000000000000e+02
380 1 6.073333333333334e+02
381 1 6.086666666666665e+02
382 1 6.100000000000000e+02
383 1 6.113333333333333e+02
384 1 6.126666666666665e+02
385 1 6.140000000000000e+02
386 1 6.153333333333333e+02
387 1 7.756666666666666e+02
388 1 3.589166666666667e+02
389 1 2.494999999999999e+02
390 1 2.500000000000000e+02
391 1 2.505000000000000e+02
392 1 2.509999999999999e+02
393 1 2.515000000000000e+02
394 1 2.520000000000000e+02
395 1 2.524999999999999e+02
396 1 3.662500000000000e+02
397 1 4.265833333333332e+03
398 1 3.773333333333333e+03
399 1 3.781666666666666e+03
400 1 3.789999999999999e+03
401 1 3.798333333333333e+03
402 1 3.806666666666666e+03
403 1 3.814999999999999e+03
404 1 3.823333333333333e+03
405 1 4.349166666666666e+03
406 1 8.094999999999998e+03
407 1 6.433333333333331e+03
408 1 6.446666666666664e+03
409 1 6.459999999999998e+03
410 1 6.473333333333331e+03
411 1 6.486666666666664e+03
412 1 6.499999999999998e+03
413 1 6.513333333333331e+03
414 1 8.251666666666664e+03
415 1 8.259999999999998e+03
416 1 6.553333333333331e+03
417 1 6.566666666666664e+03
418 1 6.579999999999998e+03
419 1 6.593333333333331e+03
420 1 6.606666666666664e+03
421 1 6.619999999999998e+03
422 1 6.633333333333331e+03
423 1 8.416666666666664e+03
424 1 8.424999999999998e+03
425 1 6.673333333333331e+03
426 1 6.686666666666664e+03
427 1 6.699999999999998e+03
428 1 6.713333333333331e+03
429 1 6.726666666666664e+03
430 1 6.739999999999998e+03
431 1 6.753333333333331e+03
432 1 8.581666666666664e+03
433 1 8.589999999999998e+03
434 1 6.793333333333331e+03
435 1 6.806666666666664e+03
436 1 6.819999999999998e+03
437 1 6.833333333333331e+03
438 1 6.846666666666664e+03
439 1 6.859999999999998e+03
440 1 6.873333333333332e+03
441 1 8.746666666666664e+03
442 1 8.754999999999998e+03
443 1 6.913333333333332e+03
444 1 6.926666666666663e+03
445 1 6.939999999999998e+03
446 1 6.953333333333332e+03
447 1 6.966666666666663e+03
448 1 6.979999999999998e+03
449 1 6.993333333333332e+03
450 1 8.911666666666664e+03
451 1 8.919999999999998e+03
452 1 7.033333333333332e+03
453 1 7.046666666666663e+03
454 1 7.059999999999998e+03
455 1 7.073333333333332e+03
456 1 7.086666666666663e+03
457 1 7.099999999999998e+03
458 1 7.113333333333332e+03
459 1 9.076666666666664e+03
460 1 4.678750000000000e+03
461 1 3.284833333333333e+03
462 1 3.290666666666667e+03
463 1 3.296500000000000e+03
464 1 3.302333333333333e+03
465 1 3.308166666666667e+03
466 1 3.314000000000000e+03
467 1 3.319833333333333e+03
468 1 4.760416666666667e+03
469 1 9.250000000000000e+02
470 1 7.273333333333331e+02
471 1 7.286666666666666e+02
472 1 7.300000000000001e+02
473 1 7.313333333333331e+02
474 1 7.326666666666666e+02
475 1 7.340000000000001e+02
476 1 7.353333333333333e+02
477 1 9.406666666666666e+02
478 1 9.415000000000000e+02
479 1 7.393333333333333e+02
480 1 7.406666666666666e+02
481 1 7.420000000000001e+02
482 1 7.433333333333333e+02
483 1 7.446666666666666e+02
484 1 7.460000000000001e+02
485 1 7.473333333333333e+02
486 1 9.571666666666666e+02
487 1 4.414166666666667e+02
488 1 2.989999999999999e+02
489 1 2.995000000000000e+02
490 1 3.000000000000000e+02
491 1 3.004999999999999e+02
492 1 3.010000000000000e+02
493 1 3.015000000000000e+02
494 1 3.019999999999999e+02
495 1 4.487500000000000e+02
496 1 5.255833333333332e+03
497 1 4.598333333333334e+03
498 1 4.606666666666666e+03
499 1 4.614999999999999e+03
500 1 4.623333333333334e+03
501 1 4.631666666666666e+03
502 1 4.639999999999999e+03
503 1 4.648333333333334e+03
504 1 5.339166666666666e+03
505 1 9.909999999999996e+03
506 1 7.753333333333332e+03
507 1 7.766666666666663e+03
508 1 7.779999999999996e+03
509 1 7.793333333333332e+03
510 1 7.806666666666663e+03
511 1 7.819999999999997e+03
512 1 7.833333333333332e+03
513 1 1.006666666666666e+04
514 1 1.007500000000000e+04
515 1 7.873333333333332e+03
516 1 7.886666666666663e+03
517 1 7.899999999999997e+03
518 1 7.913333333333332e+03
519 1 7.926666666666663e+03
520 1 7.939999999999997e+03
521 1 7.953333333333332e+03
522 1 1.023166666666666e+04
523 1 1.024000000000000e+04
524 1 7.993333333333332e+03
525 1 8.006666666666663e+03
526 1 8.019999999999997e+03
527 1 8.033333333333332e+03
528 1 8.046666666666663e+03
529 1 8.059999999999997e+03
530 1 8.073333333333332e+03
531 1 1.039666666666666e+04
532 1 1.040500000000000e+04
533 1 8.113333333333332e+03
534 1 8.126666666666663e+03
535 1 8.139999999999997e+03
536 1 8.153333333333332e+03
537 1 8.166666666666663e+03
538 1 8.179999999999997e+03
539 1 8.193333333333332e+03
540 1 1.056166666666666e+04
541 1 1.057000000000000e+04
542 1 8.233333333333332e+03
543 1 8.246666666666664e+03
544 1 8.259999999999996e+03
545 1 8.273333333333332e+03
546 1 8.286666666666664e+03
547 1 8.299999999999996e+03
548 1 8.313333333333332e+03
549 1 1.072666666666666e+04
550 1 1.073500000000000e+04
551 1 8.353333333333332e+03
552 1 8.366666666666664e+03
553 1 8.379999999999996e+03
554 1 8.393333333333332e+03
555 1 8.406666666666664e+03
556 1 8.419999999999996e+03
557 1 8.433333333333332e+03
558 1 1.089166666666666e+04
559 1 5.602750000000000e+03
560 1 3.862333333333333e+03
561 1 3.868166666666666e+03
562 1 3.874000000000000e+03
563 1 3.879833333333333e+03
564 1 3.885666666666666e+03
565 1 3.891500000000000e+03
566 1 3.897333333333333e+03
567 1 5.684416666666666e+03
568 1 1.106500000000000e+03
569 1 8.593333333333331e+02
570 1 8.606666666666666e+02
571 1 8.620000000000000e+02
572 1 8.633333333333331e+02
573 1 8.646666666666666e+02
574 1 8.660000000000000e+02
575 1 8.673333333333331e+02
576 1 1.122166666666667e+03
577 1 1.123000000000000e+03
578 1 8.713333333333331e+02
579 1 8.726666666666666e+02
580 1 8.740000000000000e+02
581 1 8.753333333333331e+02
582 1 8.766666666666666e+02
583 1 8.780000000000000e+02
584 1 8.793333333333331e+02
585 1 1.138666666666667e+03
586 1 5.239166666666667e+02
587 1 3.484999999999999e+02
588 1 3.490000000000000e+02
589 1 3.495000000000000e+02
590 1 3.499999999999999e+02
591 1 3.505000000000000e+02
592 1 3.510000000000000e+02
593 1 3.514999999999999e+02
594 1 5.312500000000000e+02
595 1 6.245833333333332e+03
596 1 5.423333333333334e+03
597 1 5.431666666666666e+03
598 1 5.439999999999999e+03
599 1 5.448333333333334e+03
600 1 5.456666666666666e+03
601 1 5.464999999999999e+03
602 1 5.473333333333334e+03
603 1 6.329166666666666e+03
604 1 1.172500000000000e+04
605 1 9.073333333333328e+03
606 1 9.086666666666664e+03
607 1 9.099999999999996e+03
608 1 9.113333333333328e+03
609 1 9.126666666666664e+03
610 1 9.139999999999996e+03
611 1 9.153333333333328e+03
612 1 1.188166666666666e+04
613 1 1.189000000000000e+04
614 1 9.193333333333328e+03
615 1 9.206666666666664e+03
616 1 9.219999999999996e+03
617 1 9.233333333333332e+03
618 1 9.246666666666661e+03
619 1 9.259999999999996e+03
620 1 9.273333333333332e+03
621 1 1.204666666666666e+04
622 1 1.205500000000000e+04
623 1 9.313333333333332e+03
624 1 9.326666666666661e+03
625 1 9.339999999999998e+03
626 1 9.353333333333332e+03
627 1 9.366666666666662e+03
628 1 9.379999999999998e+03
629 1 9.393333333333332e+03
630 1 1.221166666666666e+04
631 1 1.222000000000000e+04
632 1 9.433333333333332e+03
633 1 9.446666666666662e+03
634 1 9.459999999999998e+03
635 1 9.473333333333332e+03
636 1 9.486666666666662e+03
637 1 9.499999999999998e+03
638 1 9.513333333333332e+03
639 1 1.237666666666666e+04
640 1 1.238500000000000e+04
641 1 9.553333333333332e+03
642 1 9.566666666666662e+03
643 1 9.579999999999998e+03
644 1 9.593333333333332e+03
645 1 9.606666666666662e+03
646 1 9.619999999999998e+03
647 1 9.633333333333332e+03
648 1 1.254166666666666e+04
649 1 1.255000000000000e+04
650 1 9.673333333333332e+03
651 1 9.686666666666662e+03
652 1 9.699999999999998e+03
653 1 9.713333333333332e+03
654 1 9.726666666666662e+03
655 1 9.739999999999998e+03
656 1 9.753333333333332e+03
657 1 1.270666666666666e+04
658 1 6.526750000000000e+03
659 1 4.439833333333334e+03
660 1 4.445666666666666e+03
661 1 4.451500000000000e+03
662 1 4.457333333333334e+03
663 1 4.463166666666666e+03
664 1 4.469000000000000e+03
665 1 4.474833333333334e+03
666 1 6.608416666666666e+03
667 1 1.288000000000000e+03
668 1 9.913333333333333e+02
669 1 9.926666666666666e+02
670 1 9.939999999999999e+02
671 1 9.953333333333333e+02
672 1 9.966666666666666e+02
673 1 9.979999999999999e+02
674 1 9.993333333333333e+02
675 1 1.303666666666667e+03
676 1 1.304500000000000e+03
677 1 1.003333333333333e+03
678 1 1.004666666666667e+03
679 1 1.006000000000000e+03
680 1 1.007333333333333e+03
681 1 1.008666666666667e+03
682 1 1.010000000000000e+03
683 1 1.011333333333333e+03
684 1 1.320166666666667e+03
685 1 6.064166666666667e+02
686 1 3.979999999999999e+02
687 1 3.985000000000000e+02
688 1 3.990000000000000e+02
689 1 3.994999999999999e+02
690 1 4.000000000000000e+02
691 1 4.005000000000000e+02
692 1 4.009999999999999e+02
693 1 6.137500000000000e+02
694 1 7.235833333333334e+03
695 1 6.248333333333332e+03
696 1 6.256666666666666e+03
697 1 6.265000000000000e+03
698 1 6.273333333333332e+03
699 1 6.281666666666666e+03
700 1 6.290000000000000e+03
701 1 6.298333333333332e+03
702 1 7.319166666666666e+03
703 1 1.354000000000000e+04
704 1 1.039333333333333e+04
705 1 1.040666666666666e+04
706 1 1.042000000000000e+04
707 1 1.043333333333333e+04
708 1 1.044666666666666e+04
709 1 1.046000000000000e+04
710 1 1.047333333333333e+04
711 1 1.369666666666666e+04
712 1 1.370500000000000e+04
713 1 1.051333333333333e+04
714 1 1.052666666666666e+04
715 1 1.054000000000000e+04
716 1 1.055333333333333e+04
717 1 1.056666666666666e+04
718 1 1.058000000000000e+04
719 1 1.059333333333333e+04
720 1 1.386166666666666e+04
721 1 1.387000000000000e+04
722 1 1.063333333333333e+04
723 1 1.064666666666666e+04
724 1 1.066000000000000e+04
725 1 1.067333333333333e+04
726 1 1.068666666666666e+04
727 1 1.070000000000000e+04
728 1 1.071333333333333e+04
729 1 1.402666666666666e+04
730 1 1.403500000000000e+04
731 1 1.075333333333333e+04
732 1 1.076666666666666e+04
733 1 1.078000000000000e+04
734 1 1.079333333333333e+04
735 1 1.080666666666666e+04
736 1 1.082000000000000e+04
737 1 1.083333333333333e+04
738 1 1.419166666666666e+04
739 1 1.420000000000000e+04
740 1 1.087333333333333e+04
741 1 1.088666666666666e+04
742 1 1.090000000000000e+04
743 1 1.091333333333333e+04
744 1 1.092666666666666e+04
745 1 1.094000000000000e+04
746 1 1.095333333333333e+04
747 1 1.435666666666666e+04
748 1 1.436500000000000e+04
749 1 1.099333333333333e+04
750 1 1.100666666666666e+04
751 1 1.102000000000000e+04
752 1 1.103333333333333e+04
753 1 1.104666666666666e+04
754 1 1.106000000000000e+04
755 1 1.107333333333333e+04
756 1 1.452166666666666e+04
757 1 7.450750000000000e+03
758 1 5.017333333333334e+03
759 1 5.023166666666666e+03
760 1 5.029000000000000e+03
761 1 5.034833333333334e+03
762 1 5.040666666666666e+03
763 1 5.046500000000000e+03
764 1 5.052333333333334e+03
765 1 7.532416666666666e+03
766 1 1.469500000000000e+03
767 1 1.123333333333333e+03
768 1 1.124666666666667e+03
769 1 1.126000000000000e+03
770 1 1.127333333333333e+03
771 1 1.128666666666667e+03
772 1 1.130000000000000e+03
773 1 1.131333333333333e+03
774 1 1.485166666666667e+03
775 1 1.486000000000000e+03
776 1 1.135333333333333e+03
777 1 1.136666666666667e+03
778 1 1.138000000000000e+03
779 1 1.139333333333333e+03
780 1 1.140666666666667e+03
781 1 1.142000000000000e+03
782 1 1.143333333333333e+03
783 1 1.501666666666667e+03
784 1 6.889166666666667e+02
785 1 4.475000000000000e+02
786 1 4.479999999999999e+02
787 1 4.485000000000000e+02
788 1 4.490000000000000e+02
789 1 4.494999999999999e+02
790 1 4.500000000000000e+02
791 1 4.505000000000000e+02
792 1 6.962499999999999e+02
793 1 8.225833333333332e+03
794 1 7.073333333333332e+03
795 1 7.081666666666666e+03
796 1 7.089999999999998e+03
797 1 7.098333333333332e+03
798 1 7.106666666666666e+03
799 1 7.114999999999998e+03
800 1 7.123333333333332e+03
801 1 8.309166666666666e+03
802 1 1.535500000000000e+04
803 1 1.171333333333333e+04
804 1 1.172666666666666e+04
805 1 1.174000000000000e+04
806 1 1.175333333333333e+04
807 1 1.176666666666666e+04
808 1 1.178000000000000e+04
809 1 1.179333333333333e+04
810 1 1.551166666666666e+04
811 1 1.552000000000000e+04
812 1 1.183333333333333e+04
813 1 1.184666666666666e+04
814 1 1.186000000000000e+04
815 1 1.187333333333333e+04
816 1 1.188666666666666e+04
817 1 1.190000000000000e+04
818 1 1.191333333333333e+04
819 1 1.567666666666666e+04
820 1 1.568500000000000e+04
821 1 1.195333333333333e+04
822 1 1.196666666666666e+04
823 1 1.198000000000000e+04
824 1 1.199333333333333e+04
825 1 1.200666666666666e+04
826 1 1.202000000000000e+04
827 1 1.203333333333333e+04
828 1 1.584166666666666e+04
829 1 1.585000000000000e+04
830 1 1.207333333333333e+04
831 1 1.208666666666666e+04
832 1 1.210000000000000e+04
833 1 1.211333333333333e+04
834 1 1.212666666666666e+04
835 1 1.214000000000000e+04
836 1 1.215333333333333e+04
837 1 1.600666666666666e+04
838 1 1.601500000000000e+04
839 1 1.219333333333333e+04
840 1 1.220666666666666e+04
841 1 1.222000000000000e+04
842 1 1.223333333333333e+04
843 1 1.224666666666666e+04
844 1 1.226000000000000e+04
845 1 1.227333333333333e+04
846 1 1.617166666666666e+04
847 1 1.618000000000000e+04
848 1 1.231333333333333e+04
849 1 1.232666666666666e+04
850 1 1.234000000000000e+04
851 1 1.235333333333333e+04
852 1 1.236666666666666e+04
853 1 1.238000000000000e+04
854 1 1.239333333333333e+04
855 1 1.633666666666666e+04
856 1 8.374750000000000e+03
857 1 5.594833333333334e+03
858 1 5.600666666666666e+03
859 1 5.606500000000002e+03
860 1 5.612333333333334e+03
861 1 5.618166666666666e+03
862 1 5.624000000000002e+03
863 1 5.629833333333333e+03
864 1 8.456416666666666e+03
865 1 1.651000000000000e+03
866 1 1.255333333333333e+03
867 1 1.256666666666667e+03
868 1 1.258000000000000e+03
869 1 1.259333333333333e+03
870 1 1.260666666666667e+03
871 1 1.262000000000000e+03
872 1 1.263333333333333e+03
873 1 1.666666666666667e+03
874 1 1.667500000000000e+03
875 1 1.267333333333333e+03
876 1 1.268666666666667e+03
877 1 1.270000000000000e+03
878 1 1.271333333333333e+03
879 1 1.272666666666667e+03
880 1 1.274000000000000e+03
881 1 1.275333333333333e+03
882 1 1.683166666666667e+03
883 1 7.714166666666667e+02
884 1 4.970000000000000e+02
885 1 4.974999999999999e+02
886 1 4.980000000000001e+02
887 1 4.985000000000000e+02
888 1 4.989999999999999e+02
889 1 4.995000000000001e+02
890 1 5.000000000000000e+02
891 1 7.787499999999999e+02
892 1 9.215833333333332e+03
893 1 7.898333333333332e+03
894 1 7.906666666666666e+03
895 1 7.914999999999999e+03
896 1 7.923333333333332e+03
897 1 7.931666666666666e+03
898 1 7.939999999999999e+03
899 1 7.948333333333332e+03
900 1 9.299166666666666e+03
901 1 1.717000000000000e+04
902 1 1.303333333333333e+04
903 1 1.304666666666666e+04
904 1 1.306000000000000e+04
905 1 1.307333333333333e+04
906 1 1.308666666666666e+04
907 1 1.310000000000000e+04
908 1 1.311333333333333e+04
909 1 1.732666666666666e+04
910 1 1.733500000000000e+04
911 1 1.315333333333333e+04
912 1 1.316666666666666e+04
913 1 1.318000000000000e+04
914 1 1.319333333333333e+04
915 1 1.320666666666666e+04
916 1 1.322000000000000e+04
917 1 1.323333333333333e+04
918 1 1.749166666666666e+04
919 1 1.750000000000000e+04
920 1 1.327333333333333e+04
921 1 1.328666666666666e+04
922 1 1.330000000000000e+04
923 1 1.331333333333333e+04
924 1 1.332666666666666e+04
925 1 1.333999999999999e+04
926 1 1.335333333333333e+04
927 1 1.765666666666666e+04
928 1 1.766499999999999e+04
929 1 1.339333333333333e+04
930 1 1.340666666666666e+04
931 1 1.341999999999999e+04
932 1 1.343333333333333e+04
933 1 1.344666666666666e+04
934 1 1.345999999999999e+04
935 1 1.347333333333333e+04
936 1 1.782166666666666e+04
937 1 1.782999999999999e+04
938 1 1.351333333333333e+04
939 1 1.352666666666666e+04
940 1 1.353999999999999e+04
941 1 1.355333333333333e+04
942 1 1.356666666666666e+04
943 1 1.357999999999999e+04
944 1 1.359333333333333e+04
945 1 1.798666666666666e+04
946 1 1.799499999999999e+04
947 1 1.363333333333333e+04
948 1 1.364666666666666e+04
949 1 1.365999999999999e+04
950 1 1.367333333333333e+04
951 1 1.368666666666666e+04
952 1 1.369999999999999e+04
953 1 1.371333333333333e+04
954 1 1.815166666666666e+04
955 1 9.298750000000000e+03
956 1 6.172333333333333e+03
957 1 6.178166666666666e+03
958 1 6.184000000000000e+03
959 1 6.189833333333333e+03
960 1 6.195666666666666e+03
961 1 6.201500000000000e+03
962 1 6.207333333333333e+03
963 1 9.380416666666666e+03
964 1 1.832500000000000e+03
965 1 1.387333333333333e+03
966 1 1.388666666666666e+03
967 1 1.390000000000000e+03
968 1 1.391333333333333e+03
969 1 1.392666666666666e+03
970 1 1.394000000000000e+03
971 1 1.395333333333333e+03
972 1 1.848166666666667e+03
973 1 1.849000000000000e+03
974 1 1.399333333333333e+03
975 1 1.400666666666666e+03
976 1 1.402000000000000e+03
977 1 1.403333333333333e+03
978 1 1.404666666666666e+03
979 1 1.406000000000000e+03
980 1 1.407333333333333e+03
981 1 1.864666666666667e+03
982 1 8.539166666666667e+02
983 1 5.465000000000000e+02
984 1 5.469999999999999e+02
985 1 5.475000000000001e+02
986 1 5.480000000000000e+02
987 1 5.484999999999999e+02
988 1 5.490000000000001e+02
989 1 5.495000000000000e+02
990 1 8.612499999999999e+02
991 1 3.605833333333333e+03
992 1 2.116666666666666e+03
993 1 2.118333333333334e+03
994 1 2.120000000000000e+03
995 1 2.121666666666666e+03
996 1 2.123333333333334e+03
997 1 2.125000000000000e+03
998 1 2.126666666666666e+03
999 1 3.635833333333333e+03
1000 1 6.490833333333333e+03
1001 1 2.671666666666668e+03
1002 1 2.673333333333332e+03
1003 1 2.674999999999998e+03
1004 1 2.676666666666668e+03
1005 1 2.678333333333332e+03
1006 1 2.679999999999998e+03
1007 1 2.681666666666668e+03
1008 1 6.545833333333334e+03
1009 1 6.543333333333333e+03
1010 1 2.686666666666668e+03
1011 1 2.688333333333332e+03
1012 1 2.689999999999998e+03
1013 1 2.691666666666668e+03
1014 1 2.693333333333332e+03
1015 1 2.694999999999998e+03
1016 1 2.696666666666668e+03
1017 1 6.598333333333334e+03
1018 1 6.595833333333333e+03
1019 1 2.701666666666668e+03
1020 1 2.703333333333332e+03
1021 1 2.704999999999998e+03
1022 1 2.706666666666668e+03
1023 1 2.708333333333332e+03
1024 1 2.709999999999998e+03
1025 1 2.711666666666668e+03
1026 1 6.650833333333334e+03
1027 1 6.648333333333333e+03
1028 1 2.716666666666668e+03
1029 1 2.718333333333332e+03
1030 1 2.719999999999998e+03
1031 1 2.721666666666668e+03
1032 1 2.723333333333332e+03
1033 1 2.724999999999998e+03
1034 1 2.726666666666668e+03
1035 1 6.703333333333334e+03
1036 1 6.700833333333333e+03
1037 1 2.731666666666668e+03
1038 1 2.733333333333332e+03
1039 1 2.734999999999998e+03
1040 1 2.736666666666668e+03
1041 1 2.738333333333332e+03
1042 1 2.739999999999998e+03
1043 1 2.741666666666668e+03
1044 1 6.755833333333334e+03
1045 1 6.753333333333333e+03
1046 1 2.746666666666668e+03
1047 1 2.748333333333332e+03
1048 1 2.749999999999998e+03
1049 1 2.751666666666668e+03
1050 1 2.753333333333332e+03
1051 1 2.754999999999998e+03
1052 1 2.756666666666668e+03
1053 1 6.808333333333334e+03
1054 1 3.371583333333334e+03
1055 1 7.621666666666661e+02
1056 1 7.623333333333339e+02
1057 1 7.625000000000000e+02
1058 1 7.626666666666661e+02
1059 1 7.628333333333339e+02
1060 1 7.630000000000000e+02
1061 1 7.631666666666661e+02
1062 1 3.399583333333333e+03
1063 1 6.858333333333333e+02
1064 1 2.776666666666665e+02
1065 1 2.778333333333333e+02
1066 1 2.780000000000000e+02
1067 1 2.781666666666665e+02
1068 1 2.783333333333333e+02
1069 1 2.785000000000000e+02
1070 1 2.786666666666665e+02
1071 1 6.913333333333333e+02
1072 1 6.910833333333333e+02
1073 1 2.791666666666665e+02
1074 1 2.793333333333333e+02
1075 1 2.795000000000000e+02
1076 1 2.796666666666665e+02
1077 1 2.798333333333333e+02
1078 1 2.800000000000000e+02
1079 1 2.801666666666665e+02
1080 1 6.965833333333333e+02
1081 1 3.057500000000001e+02
1082 1 5.400000000000000e+01
1083 1 5.400000000000000e+01
1084 1 5.400000000000000e+01
1085 1 5.400000000000000e+01
1086 1 5.400000000000000e+01
1087 1 5.400000000000000e+01
1088 1 5.400000000000000e+01
1089 1 3.082500000000000e+02
1090 1 3.450000000000000e+03
1091 1 3.433333333333333e+03
1092 1 6.898333333333333e+03
1093 1 6.864999999999999e+03
1094 1 6.866666666666666e+03
1095 1 6.833333333333333e+03
1096 1 6.834999999999999e+03
1097 1 6.801666666666666e+03
1098 1 6.803333333333333e+03
1099 1 6.769999999999999e+03
1100 1 6.771666666666666e+03
1101 1 6.738333333333333e+03
1102 1 6.739999999999999e+03
1103 1 6.706666666666666e+03
1104 1 3.703083333333333e+03
1105 1 3.684750000000000e+03
1106 1 6.676666666666666e+02
1107 1 6.643333333333333e+02
1108 1 6.645000000000000e+02
1109 1 6.611666666666666e+02
1110 1 3.321666666666666e+02
1111 1 3.305000000000000e+02
1112 1 5.972500000000000e+03
1113 1 5.938333333333333e+03
1114 1 1.194166666666666e+04
1115 1 1.187333333333333e+04
1116 1 1.187500000000000e+04
1117 1 1.180666666666666e+04
1118 1 1.180833333333333e+04
1119 1 1.174000000000000e+04
1120 1 1.174166666666666e+04
1121 1 1.167333333333333e+04
1122 1 1.167500000000000e+04
1123 1 1.160666666666666e+04
1124 1 1.160833333333333e+04
1125 1 1.154000000000000e+04
1126 1 6.376416666666667e+03
1127 1 6.338833333333332e+03
1128 1 1.147500000000000e+03
1129 1 1.140666666666667e+03
1130 1 1.140833333333333e+03
1131 1 1.134000000000000e+03
1132 1 5.702500000000000e+02
1133 1 5.668333333333333e+02
1134 1 5.605833333333333e+03
1135 1 5.571666666666666e+03
1136 1 1.120833333333333e+04
1137 1 1.114000000000000e+04
1138 1 1.114166666666666e+04
1139 1 1.107333333333333e+04
1140 1 1.107500000000000e+04
1141 1 1.100666666666666e+04
1142 1 1.100833333333333e+04
1143 1 1.094000000000000e+04
1144 1 1.094166666666666e+04
1145 1 1.087333333333333e+04
1146 1 1.087500000000000e+04
1147 1 1.080666666666666e+04
1148 1 5.973083333333332e+03
1149 1 5.935500000000000e+03
1150 1 1.074166666666667e+03
1151 1 1.067333333333333e+03
1152 1 1.067500000000000e+03
1153 1 1.060666666666667e+03
1154 1 5.335833333333333e+02
1155 1 5.301666666666666e+02
1156 1 5.239166666666666e+03
1157 1 5.205000000000000e+03
1158 1 1.047500000000000e+04
1159 1 1.040666666666666e+04
1160 1 1.040833333333333e+04
1161 1 1.034000000000000e+04
1162 1 1.034166666666666e+04
1163 1 1.027333333333333e+04
1164 1 1.027500000000000e+04
1165 1 1.020666666666667e+04
1166 1 1.020833333333333e+04
1167 1 1.014000000000000e+04
1168 1 1.014166666666666e+04
1169 1 1.007333333333333e+04
1170 1 5.569750000000000e+03
1171 1 5.532166666666666e+03
1172 1 1.000833333333333e+03
1173 1 9.939999999999999e+02
1174 1 9.941666666666666e+02
1175 1 9.873333333333333e+02
1176 1 4.969166666666666e+02
1177 1 4.935000000000000e+02
1178 1 4.872500000000000e+03
1179 1 4.838333333333334e+03
1180 1 9.741666666666666e+03
1181 1 9.673333333333332e+03
1182 1 9.675000000000000e+03
1183 1 9.606666666666664e+03
1184 1 9.608333333333332e+03
1185 1 9.540000000000000e+03
1186 1 9.541666666666664e+03
1187 1 9.473333333333332e+03
1188 1 9.475000000000000e+03
1189 1 9.406666666666664e+03
1190 1 9.408333333333332e+03
1191 1 9.340000000000000e+03
1192 1 5.166416666666666e+03
1193 1 5.128833333333332e+03
1194 1 9.274999999999999e+02
1195 1 9.206666666666666e+02
1196 1 9.208333333333333e+02
1197 1 9.139999999999999e+02
1198 1 4.602500000000000e+02
1199 1 4.568333333333333e+02
1200 1 4.505833333333334e+03
1201 1 4.471666666666666e+03
1202 1 9.008333333333332e+03
1203 1 8.940000000000000e+03
1204 1 8.941666666666666e+03
1205 1 8.873333333333332e+03
1206 1 8.875000000000000e+03
1207 1 8.806666666666664e+03
1208 1 8.808333333333332e+03
1209 1 8.740000000000000e+03
1210 1 8.741666666666664e+03
1211 1 8.673333333333332e+03
1212 1 8.675000000000000e+03
1213 1 8.606666666666664e+03
1214 1 4.763083333333332e+03
1215 1 4.725500000000000e+03
1216 1 8.541666666666666e+02
1217 1 8.473333333333333e+02
1218 1 8.474999999999999e+02
1219 1 8.406666666666666e+02
1220 1 4.235833333333333e+02
1221 1 4.201666666666666e+02
1222 1 4.139166666666666e+03
1223 1 4.105000000000000e+03
1224 1 8.275000000000000e+03
1225 1 8.206666666666664e+03
1226 1 8.208333333333332e+03
1227 1 8.140000000000000e+03
1228 1 8.141666666666664e+03
1229 1 8.073333333333332e+03
1230 1 8.074999999999998e+03
1231 1 8.006666666666666e+03
1232 1 8.008333333333332e+03
1233 1 7.939999999999998e+03
1234 1 7.941666666666666e+03
1235 1 7.873333333333332e+03
1236 1 4.359749999999999e+03
1237 1 4.322166666666668e+03
1238 1 7.808333333333333e+02
1239 1 7.740000000000000e+02
1240 1 7.741666666666666e+02
1241 1 7.673333333333334e+02
1242 1 3.869166666666666e+02
1243 1 3.835000000000000e+02
1244 1 3.772499999999999e+03
1245 1 3.738333333333333e+03
1246 1 7.541666666666666e+03
1247 1 7.473333333333332e+03
1248 1 7.474999999999998e+03
1249 1 7.406666666666666e+03
1250 1 7.408333333333332e+03
1251 1 7.339999999999998e+03
1252 1 7.341666666666666e+03
1253 1 7.273333333333332e+03
1254 1 7.274999999999998e+03
1255 1 7.206666666666666e+03
1256 1 7.208333333333332e+03
1257 1 7.139999999999998e+03
1258 1 3.956416666666667e+03
1259 1 3.918833333333332e+03
1260 1 7.074999999999999e+02
1261 1 7.006666666666667e+02
1262 1 7.008333333333333e+02
1263 1 6.940000000000000e+02
1264 1 3.502500000000000e+02
1265 1 3.468333333333334e+02
1266 1 3.405833333333332e+03
1267 1 3.371666666666667e+03
1268 1 6.808333333333332e+03
1269 1 6.739999999999998e+03
1270 1 6.741666666666666e+03
1271 1 6.673333333333332e+03
1272 1 6.674999999999998e+03
1273 1 6.606666666666666e+03
1274 1 6.608333333333332e+03
1275 1 6.539999999999998e+03
1276 1 6.541666666666666e+03
1277 1 6.473333333333332e+03
1278 1 6.474999999999998e+03
1279 1 6.406666666666666e+03
1280 1 3.553083333333332e+03
1281 1 3.515500000000000e+03
1282 1 6.341666666666667e+02
1283 1 6.273333333333333e+02
1284 1 6.275000000000000e+02
1285 1 6.206666666666667e+02
1286 1 3.135833333333333e+02
1287 1 3.101666666666667e+02
1288 1 3.039166666666668e+03
1289 1 3.005000000000000e+03
1290 1 6.075000000000000e+03
1291 1 6.006666666666666e+03
1292 1 6.008333333333334e+03
1293 1 5.939999999999998e+03
1294 1 5.941666666666668e+03
1295 1 5.873333333333332e+03
1296 1 5.875000000000000e+03
1297 1 5.806666666666666e+03
1298 1 5.808333333333334e+03
1299 1 5.739999999999998e+03
1300 1 5.741666666666668e+03
1301 1 5.673333333333332e+03
1302 1 3.149750000000000e+03
1303 1 3.112166666666667e+03
1304 1 5.608333333333333e+02
1305 1 5.540000000000000e+02
1306 1 5.541666666666667e+02
1307 1 5.473333333333333e+02
1308 1 2.769166666666666e+02
1309 1 2.735000000000001e+02
1310 1 9.641666666666670e+02
1311 1 9.466666666666661e+02
1312 1 1.926666666666668e+03
1313 1 1.891666666666666e+03
1314 1 1.891666666666666e+03
1315 1 1.856666666666667e+03
1316 1 1.856666666666668e+03
1317 1 1.821666666666666e+03
1318 1 1.821666666666668e+03
1319 1 1.786666666666666e+03
1320 1 1.786666666666666e+03
1321 1 1.751666666666667e+03
1322 1 1.751666666666668e+03
1323 1 1.716666666666666e+03
1324 1 9.591666666666665e+02
1325 1 9.399166666666665e+02
1326 1 1.681666666666666e+02
1327 1 1.646666666666667e+02
1328 1 1.646666666666666e+02
1329 1 1.611666666666667e+02
1330 1 8.225000000000000e+01
1331 1 8.050000000000000e+01
