%%MatrixMarket matrix coordinate real general
%
1331 1 1330
2 1 6.666666666666666e+00
3 1 1.333333333333333e+01
4 1 2.000000000000000e+01
5 1 2.666666666666666e+01
6 1 3.333333333333333e+01
7 1 4.000000000000000e+01
8 1 4.666666666666666e+01
9 1 5.333333333333333e+01
10 1 3.000000000000000e+01
11 1 1.325000000000000e+02
12 1 1.450000000000000e+02
13 1 1.566666666666667e+02
14 1 1.683333333333333e+02
15 1 1.800000000000000e+02
16 1 1.916666666666666e+02
17 1 2.033333333333333e+02
18 1 2.150000000000000e+02
19 1 2.266666666666666e+02
20 1 1.200000000000000e+02
21 1 2.574999999999999e+02
22 1 2.616666666666667e+02
23 1 2.733333333333333e+02
24 1 2.849999999999999e+02
25 1 2.966666666666667e+02
26 1 3.083333333333333e+02
27 1 3.199999999999999e+02
28 1 3.316666666666666e+02
29 1 3.433333333333333e+02
30 1 1.783333333333333e+02
31 1 3.824999999999999e+02
32 1 3.783333333333333e+02
33 1 3.899999999999999e+02
34 1 4.016666666666666e+02
35 1 4.133333333333333e+02
36 1 4.249999999999999e+02
37 1 4.366666666666666e+02
38 1 4.483333333333333e+02
39 1 4.600000000000000e+02
40 1 2.366666666666667e+02
41 1 5.074999999999999e+02
42 1 4.950000000000000e+02
43 1 5.066666666666667e+02
44 1 5.183333333333333e+02
45 1 5.300000000000000e+02
46 1 5.416666666666666e+02
47 1 5.533333333333333e+02
48 1 5.650000000000000e+02
49 1 5.766666666666666e+02
50 1 2.949999999999999e+02
51 1 6.325000000000000e+02
52 1 6.116666666666665e+02
53 1 6.233333333333333e+02
54 1 6.350000000000000e+02
55 1 6.466666666666665e+02
56 1 6.583333333333333e+02
57 1 6.700000000000000e+02
58 1 6.816666666666665e+02
59 1 6.933333333333333e+02
60 1 3.533333333333333e+02
61 1 7.574999999999999e+02
62 1 7.283333333333333e+02
63 1 7.400000000000000e+02
64 1 7.516666666666665e+02
65 1 7.633333333333333e+02
66 1 7.750000000000000e+02
67 1 7.866666666666665e+02
68 1 7.983333333333333e+02
69 1 8.100000000000000e+02
70 1 4.116666666666666e+02
71 1 4.624999999999999e+02
72 1 4.190000000000000e+02
73 1 4.246666666666667e+02
74 1 4.303333333333333e+02
75 1 4.360000000000000e+02
76 1 4.416666666666667e+02
77 1 4.473333333333333e+02
78 1 4.530000000000000e+02
79 1 4.586666666666667e+02
80 1 2.330000000000000e+02
81 1 1.007500000000000e+02
82 1 9.616666666666667e+01
83 1 9.733333333333333e+01
84 1 9.849999999999999e+01
85 1 9.966666666666667e+01
86 1 1.008333333333333e+02
87 1 1.020000000000000e+02
88 1 1.031666666666667e+02
89 1 1.043333333333333e+02
90 1 5.283333333333333e+01
91 1 1.132500000000000e+02
92 1 1.078333333333333e+02
93 1 1.090000000000000e+02
94 1 1.101666666666667e+02
95 1 1.113333333333333e+02
96 1 1.125000000000000e+02
97 1 1.136666666666667e+02
98 1 1.148333333333333e+02
99 1 1.160000000000000e+02
100 1 5.866666666666666e+01
101 1 5.908333333333332e+01
102 1 5.216666666666666e+01
103 1 5.266666666666667e+01
104 1 5.316666666666666e+01
105 1 5.366666666666666e+01
106 1 5.416666666666667e+01
107 1 5.466666666666666e+01
108 1 5.516666666666666e+01
109 1 5.566666666666667e+01
110 1 2.816666666666666e+01
111 1 1.440000000000000e+03
112 1 1.441666666666667e+03
113 1 1.450000000000000e+03
114 1 1.458333333333333e+03
115 1 1.466666666666667e+03
116 1 1.475000000000000e+03
117 1 1.483333333333333e+03
118 1 1.491666666666667e+03
119 1 1.500000000000000e+03
120 1 7.558333333333333e+02
121 1 2.944999999999999e+03
122 1 2.746666666666666e+03
123 1 2.759999999999999e+03
124 1 2.773333333333333e+03
125 1 2.786666666666666e+03
126 1 2.799999999999999e+03
127 1 2.813333333333333e+03
128 1 2.826666666666666e+03
129 1 2.839999999999999e+03
130 1 1.431666666666667e+03
131 1 3.128333333333333e+03
132 1 2.879999999999999e+03
133 1 2.893333333333333e+03
134 1 2.906666666666666e+03
135 1 2.919999999999999e+03
136 1 2.933333333333333e+03
137 1 2.946666666666666e+03
138 1 2.959999999999999e+03
139 1 2.973333333333333e+03
140 1 1.498333333333333e+03
141 1 3.311666666666666e+03
142 1 3.013333333333333e+03
143 1 3.026666666666666e+03
144 1 3.039999999999999e+03
145 1 3.053333333333333e+03
146 1 3.066666666666666e+03
147 1 3.079999999999999e+03
148 1 3.093333333333333e+03
149 1 3.106666666666666e+03
150 1 1.565000000000000e+03
151 1 3.494999999999999e+03
152 1 3.146666666666666e+03
153 1 3.159999999999999e+03
154 1 3.173333333333333e+03
155 1 3.186666666666666e+03
156 1 3.199999999999999e+03
157 1 3.213333333333333e+03
158 1 3.226666666666666e+03
159 1 3.239999999999999e+03
160 1 1.631666666666667e+03
161 1 3.678333333333333e+03
162 1 3.279999999999999e+03
163 1 3.293333333333333e+03
164 1 3.306666666666666e+03
165 1 3.319999999999999e+03
166 1 3.333333333333333e+03
167 1 3.346666666666666e+03
168 1 3.359999999999999e+03
169 1 3.373333333333333e+03
170 1 1.698333333333333e+03
171 1 3.861666666666666e+03
172 1 3.413333333333333e+03
173 1 3.426666666666666e+03
174 1 3.439999999999999e+03
175 1 3.453333333333333e+03
176 1 3.466666666666666e+03
177 1 3.479999999999999e+03
178 1 3.493333333333333e+03
179 1 3.506666666666666e+03
180 1 1.765000000000000e+03
181 1 2.119000000000000e+03
182 1 1.724166666666667e+03
183 1 1.730000000000000e+03
184 1 1.735833333333333e+03
185 1 1.741666666666667e+03
186 1 1.747500000000000e+03
187 1 1.753333333333333e+03
188 1 1.759166666666667e+03
189 1 1.765000000000000e+03
190 1 8.889166666666667e+02
191 1 4.228333333333333e+02
192 1 3.680000000000000e+02
193 1 3.693333333333334e+02
194 1 3.706666666666666e+02
195 1 3.719999999999999e+02
196 1 3.733333333333334e+02
197 1 3.746666666666666e+02
198 1 3.759999999999999e+02
199 1 3.773333333333334e+02
200 1 1.898333333333333e+02
201 1 4.411666666666666e+02
202 1 3.813333333333334e+02
203 1 3.826666666666666e+02
204 1 3.839999999999999e+02
205 1 3.853333333333334e+02
206 1 3.866666666666666e+02
207 1 3.879999999999999e+02
208 1 3.893333333333334e+02
209 1 3.906666666666666e+02
210 1 1.965000000000000e+02
211 1 2.155000000000000e+02
212 1 1.671666666666667e+02
213 1 1.676666666666666e+02
214 1 1.681666666666667e+02
215 1 1.686666666666667e+02
216 1 1.691666666666666e+02
217 1 1.696666666666667e+02
218 1 1.701666666666667e+02
219 1 1.706666666666666e+02
220 1 8.591666666666667e+01
221 1 2.540000000000000e+03
222 1 2.358333333333333e+03
223 1 2.366666666666666e+03
224 1 2.375000000000000e+03
225 1 2.383333333333333e+03
226 1 2.391666666666666e+03
227 1 2.400000000000000e+03
228 1 2.408333333333333e+03
229 1 2.416666666666666e+03
230 1 1.214166666666667e+03
231 1 4.961666666666666e+03
232 1 4.213333333333332e+03
233 1 4.226666666666666e+03
234 1 4.239999999999999e+03
235 1 4.253333333333332e+03
236 1 4.266666666666666e+03
237 1 4.279999999999999e+03
238 1 4.293333333333332e+03
239 1 4.306666666666666e+03
240 1 2.165000000000000e+03
241 1 5.144999999999998e+03
242 1 4.346666666666666e+03
243 1 4.359999999999998e+03
244 1 4.373333333333332e+03
245 1 4.386666666666666e+03
246 1 4.399999999999998e+03
247 1 4.413333333333332e+03
248 1 4.426666666666666e+03
249 1 4.439999999999998e+03
250 1 2.231666666666666e+03
251 1 5.328333333333332e+03
252 1 4.479999999999998e+03
253 1 4.493333333333332e+03
254 1 4.506666666666666e+03
255 1 4.519999999999999e+03
256 1 4.533333333333332e+03
257 1 4.546666666666666e+03
258 1 4.559999999999999e+03
259 1 4.573333333333332e+03
260 1 2.298333333333333e+03
261 1 5.511666666666666e+03
262 1 4.613333333333332e+03
263 1 4.626666666666666e+03
264 1 4.639999999999999e+03
265 1 4.653333333333332e+03
266 1 4.666666666666666e+03
267 1 4.679999999999999e+03
268 1 4.693333333333332e+03
269 1 4.706666666666666e+03
270 1 2.365000000000000e+03
271 1 5.694999999999998e+03
272 1 4.746666666666665e+03
273 1 4.759999999999999e+03
274 1 4.773333333333332e+03
275 1 4.786666666666665e+03
276 1 4.799999999999999e+03
277 1 4.813333333333332e+03
278 1 4.826666666666665e+03
279 1 4.839999999999999e+03
280 1 2.431666666666666e+03
281 1 5.878333333333332e+03
282 1 4.879999999999999e+03
283 1 4.893333333333332e+03
284 1 4.906666666666665e+03
285 1 4.919999999999998e+03
286 1 4.933333333333332e+03
287 1 4.946666666666665e+03
288 1 4.959999999999998e+03
289 1 4.973333333333332e+03
290 1 2.498333333333333e+03
291 1 3.145666666666667e+03
292 1 2.365833333333333e+03
293 1 2.371666666666666e+03
294 1 2.377500000000000e+03
295 1 2.383333333333333e+03
296 1 2.389166666666666e+03
297 1 2.395000000000000e+03
298 1 2.400833333333333e+03
299 1 2.406666666666666e+03
300 1 1.209750000000000e+03
301 1 6.245000000000000e+02
302 1 5.146666666666666e+02
303 1 5.160000000000000e+02
304 1 5.173333333333334e+02
305 1 5.186666666666666e+02
306 1 5.200000000000000e+02
307 1 5.213333333333334e+02
308 1 5.226666666666666e+02
309 1 5.240000000000000e+02
310 1 2.631666666666667e+02
311 1 6.428333333333333e+02
312 1 5.280000000000000e+02
313 1 5.293333333333334e+02
314 1 5.306666666666666e+02
315 1 5.320000000000000e+02
316 1 5.333333333333334e+02
317 1 5.346666666666666e+02
318 1 5.360000000000000e+02
319 1 5.373333333333333e+02
320 1 2.698333333333333e+02
321 1 3.071666666666666e+02
322 1 2.221666666666667e+02
323 1 2.226666666666667e+02
324 1 2.231666666666667e+02
325 1 2.236666666666667e+02
326 1 2.241666666666667e+02
327 1 2.246666666666667e+02
328 1 2.251666666666667e+02
329 1 2.256666666666667e+02
330 1 1.134166666666667e+02
331 1 3.640000000000000e+03
332 1 3.275000000000000e+03
333 1 3.283333333333333e+03
334 1 3.291666666666667e+03
335 1 3.300000000000000e+03
336 1 3.308333333333333e+03
337 1 3.316666666666667e+03
338 1 3.325000000000000e+03
339 1 3.333333333333333e+03
340 1 1.672500000000000e+03
341 1 6.978333333333331e+03
342 1 5.679999999999999e+03
343 1 5.693333333333332e+03
344 1 5.706666666666664e+03
345 1 5.719999999999999e+03
346 1 5.733333333333332e+03
347 1 5.746666666666664e+03
348 1 5.759999999999999e+03
349 1 5.773333333333332e+03
350 1 2.898333333333333e+03
351 1 7.161666666666666e+03
352 1 5.813333333333332e+03
353 1 5.826666666666664e+03
354 1 5.839999999999999e+03
355 1 5.853333333333332e+03
356 1 5.866666666666664e+03
357 1 5.879999999999999e+03
358 1 5.893333333333332e+03
359 1 5.906666666666664e+03
360 1 2.965000000000000e+03
361 1 7.344999999999998e+03
362 1 5.946666666666664e+03
363 1 5.959999999999997e+03
364 1 5.973333333333332e+03
365 1 5.986666666666664e+03
366 1 5.999999999999997e+03
367 1 6.013333333333332e+03
368 1 6.026666666666664e+03
369 1 6.039999999999997e+03
370 1 3.031666666666667e+03
371 1 7.528333333333331e+03
372 1 6.079999999999997e+03
373 1 6.093333333333332e+03
374 1 6.106666666666664e+03
375 1 6.119999999999997e+03
376 1 6.133333333333332e+03
377 1 6.146666666666664e+03
378 1 6.159999999999997e+03
379 1 6.173333333333332e+03
380 1 3.098333333333333e+03
381 1 7.711666666666664e+03
382 1 6.213333333333332e+03
383 1 6.226666666666664e+03
384 1 6.239999999999997e+03
385 1 6.253333333333332e+03
386 1 6.266666666666664e+03
387 1 6.279999999999997e+03
388 1 6.293333333333332e+03
389 1 6.306666666666664e+03
390 1 3.165000000000000e+03
391 1 7.894999999999998e+03
392 1 6.346666666666664e+03
393 1 6.359999999999997e+03
394 1 6.373333333333332e+03
395 1 6.386666666666664e+03
396 1 6.399999999999997e+03
397 1 6.413333333333332e+03
398 1 6.426666666666664e+03
399 1 6.439999999999997e+03
400 1 3.231666666666666e+03
401 1 4.172333333333333e+03
402 1 3.007500000000000e+03
403 1 3.013333333333333e+03
404 1 3.019166666666667e+03
405 1 3.025000000000000e+03
406 1 3.030833333333333e+03
407 1 3.036666666666667e+03
408 1 3.042500000000000e+03
409 1 3.048333333333333e+03
410 1 1.530583333333333e+03
411 1 8.261666666666666e+02
412 1 6.613333333333334e+02
413 1 6.626666666666666e+02
414 1 6.640000000000000e+02
415 1 6.653333333333334e+02
416 1 6.666666666666666e+02
417 1 6.680000000000000e+02
418 1 6.693333333333334e+02
419 1 6.706666666666666e+02
420 1 3.365000000000000e+02
421 1 8.445000000000000e+02
422 1 6.746666666666666e+02
423 1 6.760000000000000e+02
424 1 6.773333333333334e+02
425 1 6.786666666666666e+02
426 1 6.800000000000000e+02
427 1 6.813333333333334e+02
428 1 6.826666666666666e+02
429 1 6.840000000000000e+02
430 1 3.431666666666667e+02
431 1 3.988333333333333e+02
432 1 2.771666666666666e+02
433 1 2.776666666666667e+02
434 1 2.781666666666666e+02
435 1 2.786666666666666e+02
436 1 2.791666666666667e+02
437 1 2.796666666666666e+02
438 1 2.801666666666666e+02
439 1 2.806666666666667e+02
440 1 1.409166666666666e+02
441 1 4.740000000000000e+03
442 1 4.191666666666666e+03
443 1 4.200000000000000e+03
444 1 4.208333333333333e+03
445 1 4.216666666666666e+03
446 1 4.225000000000000e+03
447 1 4.233333333333333e+03
448 1 4.241666666666666e+03
449 1 4.250000000000000e+03
450 1 2.130833333333333e+03
451 1 8.994999999999998e+03
452 1 7.146666666666664e+03
453 1 7.159999999999998e+03
454 1 7.173333333333331e+03
455 1 7.186666666666664e+03
456 1 7.199999999999998e+03
457 1 7.213333333333331e+03
458 1 7.226666666666664e+03
459 1 7.239999999999998e+03
460 1 3.631666666666666e+03
461 1 9.178333333333332e+03
462 1 7.279999999999998e+03
463 1 7.293333333333329e+03
464 1 7.306666666666664e+03
465 1 7.319999999999998e+03
466 1 7.333333333333329e+03
467 1 7.346666666666664e+03
468 1 7.359999999999998e+03
469 1 7.373333333333329e+03
470 1 3.698333333333333e+03
471 1 9.361666666666664e+03
472 1 7.413333333333329e+03
473 1 7.426666666666664e+03
474 1 7.439999999999998e+03
475 1 7.453333333333329e+03
476 1 7.466666666666664e+03
477 1 7.479999999999998e+03
478 1 7.493333333333329e+03
479 1 7.506666666666664e+03
480 1 3.765000000000000e+03
481 1 9.544999999999996e+03
482 1 7.546666666666664e+03
483 1 7.559999999999998e+03
484 1 7.573333333333329e+03
485 1 7.586666666666664e+03
486 1 7.599999999999998e+03
487 1 7.613333333333329e+03
488 1 7.626666666666664e+03
489 1 7.639999999999998e+03
490 1 3.831666666666666e+03
491 1 9.728333333333332e+03
492 1 7.679999999999998e+03
493 1 7.693333333333329e+03
494 1 7.706666666666664e+03
495 1 7.719999999999998e+03
496 1 7.733333333333329e+03
497 1 7.746666666666664e+03
498 1 7.759999999999998e+03
499 1 7.773333333333329e+03
500 1 3.898333333333333e+03
501 1 9.911666666666664e+03
502 1 7.813333333333329e+03
503 1 7.826666666666664e+03
504 1 7.839999999999998e+03
505 1 7.853333333333329e+03
506 1 7.866666666666664e+03
507 1 7.879999999999998e+03
508 1 7.893333333333329e+03
509 1 7.906666666666664e+03
510 1 3.965000000000000e+03
511 1 5.199000000000000e+03
512 1 3.649166666666667e+03
513 1 3.655000000000000e+03
514 1 3.660833333333333e+03
515 1 3.666666666666667e+03
516 1 3.672500000000000e+03
517 1 3.678333333333333e+03
518 1 3.684166666666667e+03
519 1 3.690000000000000e+03
520 1 1.851416666666667e+03
521 1 1.027833333333333e+03
522 1 8.080000000000000e+02
523 1 8.093333333333334e+02
524 1 8.106666666666665e+02
525 1 8.120000000000000e+02
526 1 8.133333333333334e+02
527 1 8.146666666666665e+02
528 1 8.160000000000000e+02
529 1 8.173333333333334e+02
530 1 4.098333333333333e+02
531 1 1.046166666666667e+03
532 1 8.213333333333334e+02
533 1 8.226666666666665e+02
534 1 8.240000000000000e+02
535 1 8.253333333333334e+02
536 1 8.266666666666665e+02
537 1 8.279999999999999e+02
538 1 8.293333333333334e+02
539 1 8.306666666666665e+02
540 1 4.165000000000000e+02
541 1 4.905000000000000e+02
542 1 3.321666666666666e+02
543 1 3.326666666666667e+02
544 1 3.331666666666667e+02
545 1 3.336666666666666e+02
546 1 3.341666666666667e+02
547 1 3.346666666666667e+02
548 1 3.351666666666666e+02
549 1 3.356666666666667e+02
550 1 1.684166666666667e+02
551 1 5.840000000000000e+03
552 1 5.108333333333333e+03
553 1 5.116666666666666e+03
554 1 5.125000000000000e+03
555 1 5.133333333333333e+03
556 1 5.141666666666666e+03
557 1 5.150000000000000e+03
558 1 5.158333333333333e+03
559 1 5.166666666666666e+03
560 1 2.589166666666667e+03
561 1 1.101166666666666e+04
562 1 8.613333333333328e+03
563 1 8.626666666666664e+03
564 1 8.639999999999996e+03
565 1 8.653333333333328e+03
566 1 8.666666666666664e+03
567 1 8.679999999999996e+03
568 1 8.693333333333328e+03
569 1 8.706666666666664e+03
570 1 4.365000000000000e+03
571 1 1.119500000000000e+04
572 1 8.746666666666664e+03
573 1 8.759999999999996e+03
574 1 8.773333333333328e+03
575 1 8.786666666666664e+03
576 1 8.799999999999996e+03
577 1 8.813333333333328e+03
578 1 8.826666666666664e+03
579 1 8.839999999999996e+03
580 1 4.431666666666666e+03
581 1 1.137833333333333e+04
582 1 8.879999999999996e+03
583 1 8.893333333333328e+03
584 1 8.906666666666664e+03
585 1 8.919999999999996e+03
586 1 8.933333333333328e+03
587 1 8.946666666666664e+03
588 1 8.959999999999996e+03
589 1 8.973333333333328e+03
590 1 4.498333333333333e+03
591 1 1.156166666666666e+04
592 1 9.013333333333328e+03
593 1 9.026666666666664e+03
594 1 9.039999999999996e+03
595 1 9.053333333333328e+03
596 1 9.066666666666664e+03
597 1 9.079999999999996e+03
598 1 9.093333333333328e+03
599 1 9.106666666666664e+03
600 1 4.565000000000000e+03
601 1 1.174500000000000e+04
602 1 9.146666666666664e+03
603 1 9.159999999999996e+03
604 1 9.173333333333328e+03
605 1 9.186666666666664e+03
606 1 9.199999999999996e+03
607 1 9.213333333333328e+03
608 1 9.226666666666664e+03
609 1 9.239999999999996e+03
610 1 4.631666666666666e+03
611 1 1.192833333333333e+04
612 1 9.279999999999996e+03
613 1 9.293333333333328e+03
614 1 9.306666666666664e+03
615 1 9.319999999999996e+03
616 1 9.333333333333328e+03
617 1 9.346666666666664e+03
618 1 9.359999999999996e+03
619 1 9.373333333333328e+03
620 1 4.698333333333332e+03
621 1 6.225666666666665e+03
622 1 4.290833333333333e+03
623 1 4.296666666666666e+03
624 1 4.302499999999999e+03
625 1 4.308333333333333e+03
626 1 4.314166666666666e+03
627 1 4.319999999999999e+03
628 1 4.325833333333333e+03
629 1 4.331666666666666e+03
630 1 2.172250000000000e+03
631 1 1.229500000000000e+03
632 1 9.546666666666665e+02
633 1 9.560000000000000e+02
634 1 9.573333333333334e+02
635 1 9.586666666666665e+02
636 1 9.600000000000000e+02
637 1 9.613333333333334e+02
638 1 9.626666666666665e+02
639 1 9.640000000000000e+02
640 1 4.831666666666666e+02
641 1 1.247833333333333e+03
642 1 9.680000000000000e+02
643 1 9.693333333333334e+02
644 1 9.706666666666665e+02
645 1 9.720000000000000e+02
646 1 9.733333333333334e+02
647 1 9.746666666666665e+02
648 1 9.760000000000000e+02
649 1 9.773333333333334e+02
650 1 4.898333333333333e+02
651 1 5.821666666666667e+02
652 1 3.871666666666666e+02
653 1 3.876666666666666e+02
654 1 3.881666666666667e+02
655 1 3.886666666666666e+02
656 1 3.891666666666666e+02
657 1 3.896666666666667e+02
658 1 3.901666666666666e+02
659 1 3.906666666666666e+02
660 1 1.959166666666667e+02
661 1 6.940000000000000e+03
662 1 6.024999999999998e+03
663 1 6.033333333333333e+03
664 1 6.041666666666667e+03
665 1 6.049999999999998e+03
666 1 6.058333333333333e+03
667 1 6.066666666666667e+03
668 1 6.074999999999998e+03
669 1 6.083333333333333e+03
670 1 3.047500000000000e+03
671 1 1.302833333333333e+04
672 1 1.008000000000000e+04
673 1 1.009333333333333e+04
674 1 1.010666666666667e+04
675 1 1.012000000000000e+04
676 1 1.013333333333333e+04
677 1 1.014666666666667e+04
678 1 1.016000000000000e+04
679 1 1.017333333333333e+04
680 1 5.098333333333332e+03
681 1 1.321166666666666e+04
682 1 1.021333333333333e+04
683 1 1.022666666666667e+04
684 1 1.024000000000000e+04
685 1 1.025333333333333e+04
686 1 1.026666666666667e+04
687 1 1.028000000000000e+04
688 1 1.029333333333333e+04
689 1 1.030666666666667e+04
690 1 5.165000000000000e+03
691 1 1.339500000000000e+04
692 1 1.034666666666667e+04
693 1 1.036000000000000e+04
694 1 1.037333333333333e+04
695 1 1.038666666666667e+04
696 1 1.040000000000000e+04
697 1 1.041333333333333e+04
698 1 1.042666666666667e+04
699 1 1.044000000000000e+04
700 1 5.231666666666667e+03
701 1 1.357833333333333e+04
702 1 1.047999999999999e+04
703 1 1.049333333333333e+04
704 1 1.050666666666667e+04
705 1 1.051999999999999e+04
706 1 1.053333333333333e+04
707 1 1.054666666666667e+04
708 1 1.055999999999999e+04
709 1 1.057333333333333e+04
710 1 5.298333333333332e+03
711 1 1.376166666666666e+04
712 1 1.061333333333333e+04
713 1 1.062666666666667e+04
714 1 1.063999999999999e+04
715 1 1.065333333333333e+04
716 1 1.066666666666667e+04
717 1 1.068000000000000e+04
718 1 1.069333333333333e+04
719 1 1.070666666666666e+04
720 1 5.365000000000000e+03
721 1 1.394500000000000e+04
722 1 1.074666666666666e+04
723 1 1.076000000000000e+04
724 1 1.077333333333333e+04
725 1 1.078666666666666e+04
726 1 1.080000000000000e+04
727 1 1.081333333333333e+04
728 1 1.082666666666666e+04
729 1 1.084000000000000e+04
730 1 5.431666666666667e+03
731 1 7.252333333333333e+03
732 1 4.932499999999999e+03
733 1 4.938333333333334e+03
734 1 4.944166666666666e+03
735 1 4.949999999999999e+03
736 1 4.955833333333334e+03
737 1 4.961666666666666e+03
738 1 4.967499999999999e+03
739 1 4.973333333333334e+03
740 1 2.493083333333333e+03
741 1 1.431166666666667e+03
742 1 1.101333333333333e+03
743 1 1.102666666666667e+03
744 1 1.104000000000000e+03
745 1 1.105333333333333e+03
746 1 1.106666666666667e+03
747 1 1.108000000000000e+03
748 1 1.109333333333333e+03
749 1 1.110666666666667e+03
750 1 5.565000000000000e+02
751 1 1.449500000000000e+03
752 1 1.114666666666667e+03
753 1 1.116000000000000e+03
754 1 1.117333333333333e+03
755 1 1.118666666666667e+03
756 1 1.120000000000000e+03
757 1 1.121333333333333e+03
758 1 1.122666666666667e+03
759 1 1.124000000000000e+03
760 1 5.631666666666666e+02
761 1 6.738333333333333e+02
762 1 4.421666666666666e+02
763 1 4.426666666666666e+02
764 1 4.431666666666666e+02
765 1 4.436666666666666e+02
766 1 4.441666666666666e+02
767 1 4.446666666666666e+02
768 1 4.451666666666666e+02
769 1 4.456666666666666e+02
770 1 2.234166666666666e+02
771 1 8.040000000000000e+03
772 1 6.941666666666665e+03
773 1 6.949999999999999e+03
774 1 6.958333333333333e+03
775 1 6.966666666666665e+03
776 1 6.974999999999999e+03
777 1 6.983333333333333e+03
778 1 6.991666666666665e+03
779 1 6.999999999999999e+03
780 1 3.505833333333333e+03
781 1 1.504500000000000e+04
782 1 1.154666666666666e+04
783 1 1.156000000000000e+04
784 1 1.157333333333333e+04
785 1 1.158666666666666e+04
786 1 1.160000000000000e+04
787 1 1.161333333333333e+04
788 1 1.162666666666666e+04
789 1 1.164000000000000e+04
790 1 5.831666666666665e+03
791 1 1.522833333333333e+04
792 1 1.168000000000000e+04
793 1 1.169333333333333e+04
794 1 1.170666666666666e+04
795 1 1.172000000000000e+04
796 1 1.173333333333333e+04
797 1 1.174666666666666e+04
798 1 1.176000000000000e+04
799 1 1.177333333333333e+04
800 1 5.898333333333332e+03
801 1 1.541166666666666e+04
802 1 1.181333333333333e+04
803 1 1.182666666666666e+04
804 1 1.184000000000000e+04
805 1 1.185333333333333e+04
806 1 1.186666666666666e+04
807 1 1.188000000000000e+04
808 1 1.189333333333333e+04
809 1 1.190666666666666e+04
810 1 5.965000000000000e+03
811 1 1.559500000000000e+04
812 1 1.194666666666666e+04
813 1 1.196000000000000e+04
814 1 1.197333333333333e+04
815 1 1.198666666666666e+04
816 1 1.200000000000000e+04
817 1 1.201333333333333e+04
818 1 1.202666666666666e+04
819 1 1.204000000000000e+04
820 1 6.031666666666665e+03
821 1 1.577833333333333e+04
822 1 1.208000000000000e+04
823 1 1.209333333333333e+04
824 1 1.210666666666666e+04
825 1 1.212000000000000e+04
826 1 1.213333333333333e+04
827 1 1.214666666666666e+04
828 1 1.216000000000000e+04
829 1 1.217333333333333e+04
830 1 6.098333333333332e+03
831 1 1.596166666666666e+04
832 1 1.221333333333333e+04
833 1 1.222666666666666e+04
834 1 1.224000000000000e+04
835 1 1.225333333333333e+04
836 1 1.226666666666666e+04
837 1 1.228000000000000e+04
838 1 1.229333333333333e+04
839 1 1.230666666666666e+04
840 1 6.165000000000000e+03
841 1 8.279000000000000e+03
842 1 5.574166666666666e+03
843 1 5.580000000000000e+03
844 1 5.585833333333334e+03
845 1 5.591666666666666e+03
846 1 5.597500000000000e+03
847 1 5.603333333333334e+03
848 1 5.609166666666666e+03
849 1 5.615000000000000e+03
850 1 2.813916666666667e+03
851 1 1.632833333333333e+03
852 1 1.248000000000000e+03
853 1 1.249333333333333e+03
854 1 1.250666666666667e+03
855 1 1.252000000000000e+03
856 1 1.253333333333333e+03
857 1 1.254666666666667e+03
858 1 1.256000000000000e+03
859 1 1.257333333333333e+03
860 1 6.298333333333333e+02
861 1 1.651166666666667e+03
862 1 1.261333333333333e+03
863 1 1.262666666666667e+03
864 1 1.264000000000000e+03
865 1 1.265333333333333e+03
866 1 1.266666666666667e+03
867 1 1.268000000000000e+03
868 1 1.269333333333333e+03
869 1 1.270666666666667e+03
870 1 6.364999999999999e+02
871 1 7.655000000000000e+02
872 1 4.971666666666666e+02
873 1 4.976666666666665e+02
874 1 4.981666666666666e+02
875 1 4.986666666666666e+02
876 1 4.991666666666665e+02
877 1 4.996666666666666e+02
878 1 5.001666666666666e+02
879 1 5.006666666666665e+02
880 1 2.509166666666667e+02
881 1 9.140000000000000e+03
882 1 7.858333333333333e+03
883 1 7.866666666666665e+03
884 1 7.875000000000000e+03
885 1 7.883333333333333e+03
886 1 7.891666666666665e+03
887 1 7.900000000000000e+03
888 1 7.908333333333333e+03
889 1 7.916666666666665e+03
890 1 3.964166666666666e+03
891 1 1.706166666666666e+04
892 1 1.301333333333333e+04
893 1 1.302666666666666e+04
894 1 1.304000000000000e+04
895 1 1.305333333333333e+04
896 1 1.306666666666666e+04
897 1 1.308000000000000e+04
898 1 1.309333333333333e+04
899 1 1.310666666666666e+04
900 1 6.565000000000000e+03
901 1 1.724500000000000e+04
902 1 1.314666666666666e+04
903 1 1.316000000000000e+04
904 1 1.317333333333333e+04
905 1 1.318666666666666e+04
906 1 1.320000000000000e+04
907 1 1.321333333333333e+04
908 1 1.322666666666666e+04
909 1 1.324000000000000e+04
910 1 6.631666666666666e+03
911 1 1.742833333333333e+04
912 1 1.328000000000000e+04
913 1 1.329333333333333e+04
914 1 1.330666666666666e+04
915 1 1.332000000000000e+04
916 1 1.333333333333333e+04
917 1 1.334666666666666e+04
918 1 1.336000000000000e+04
919 1 1.337333333333333e+04
920 1 6.698333333333333e+03
921 1 1.761166666666666e+04
922 1 1.341333333333333e+04
923 1 1.342666666666666e+04
924 1 1.344000000000000e+04
925 1 1.345333333333333e+04
926 1 1.346666666666666e+04
927 1 1.348000000000000e+04
928 1 1.349333333333333e+04
929 1 1.350666666666666e+04
930 1 6.765000000000000e+03
931 1 1.779499999999999e+04
932 1 1.354666666666666e+04
933 1 1.356000000000000e+04
934 1 1.357333333333333e+04
935 1 1.358666666666666e+04
936 1 1.360000000000000e+04
937 1 1.361333333333333e+04
938 1 1.362666666666666e+04
939 1 1.364000000000000e+04
940 1 6.831666666666666e+03
941 1 1.797833333333333e+04
942 1 1.368000000000000e+04
943 1 1.369333333333333e+04
944 1 1.370666666666666e+04
945 1 1.372000000000000e+04
946 1 1.373333333333333e+04
947 1 1.374666666666666e+04
948 1 1.376000000000000e+04
949 1 1.377333333333333e+04
950 1 6.898333333333333e+03
951 1 9.305666666666666e+03
952 1 6.215833333333334e+03
953 1 6.221666666666666e+03
954 1 6.227499999999998e+03
955 1 6.233333333333334e+03
956 1 6.239166666666666e+03
957 1 6.244999999999998e+03
958 1 6.250833333333334e+03
959 1 6.256666666666666e+03
960 1 3.134750000000000e+03
961 1 1.834500000000000e+03
962 1 1.394666666666667e+03
963 1 1.396000000000000e+03
964 1 1.397333333333333e+03
965 1 1.398666666666667e+03
966 1 1.400000000000000e+03
967 1 1.401333333333333e+03
968 1 1.402666666666667e+03
969 1 1.404000000000000e+03
970 1 7.031666666666667e+02
971 1 1.852833333333333e+03
972 1 1.408000000000000e+03
973 1 1.409333333333333e+03
974 1 1.410666666666667e+03
975 1 1.412000000000000e+03
976 1 1.413333333333333e+03
977 1 1.414666666666667e+03
978 1 1.416000000000000e+03
979 1 1.417333333333333e+03
980 1 7.098333333333333e+02
981 1 8.571666666666665e+02
982 1 5.521666666666667e+02
983 1 5.526666666666666e+02
984 1 5.531666666666667e+02
985 1 5.536666666666667e+02
986 1 5.541666666666666e+02
987 1 5.546666666666667e+02
988 1 5.551666666666667e+02
989 1 5.556666666666666e+02
990 1 2.784166666666666e+02
991 1 1.024000000000000e+04
992 1 8.775000000000000e+03
993 1 8.783333333333332e+03
994 1 8.791666666666664e+03
995 1 8.800000000000000e+03
996 1 8.808333333333332e+03
997 1 8.816666666666664e+03
998 1 8.825000000000000e+03
999 1 8.833333333333332e+03
1000 1 4.422500000000000e+03
1001 1 1.907833333333333e+04
1002 1 1.448000000000000e+04
1003 1 1.449333333333333e+04
1004 1 1.450666666666666e+04
1005 1 1.452000000000000e+04
1006 1 1.453333333333333e+04
1007 1 1.454666666666666e+04
1008 1 1.456000000000000e+04
1009 1 1.457333333333333e+04
1010 1 7.298333333333333e+03
1011 1 1.926166666666666e+04
1012 1 1.461333333333333e+04
1013 1 1.462666666666666e+04
1014 1 1.464000000000000e+04
1015 1 1.465333333333333e+04
1016 1 1.466666666666666e+04
1017 1 1.468000000000000e+04
1018 1 1.469333333333333e+04
1019 1 1.470666666666666e+04
1020 1 7.365000000000000e+03
1021 1 1.944499999999999e+04
1022 1 1.474666666666666e+04
1023 1 1.476000000000000e+04
1024 1 1.477333333333333e+04
1025 1 1.478666666666666e+04
1026 1 1.480000000000000e+04
1027 1 1.481333333333333e+04
1028 1 1.482666666666666e+04
1029 1 1.484000000000000e+04
1030 1 7.431666666666666e+03
1031 1 1.962833333333333e+04
1032 1 1.488000000000000e+04
1033 1 1.489333333333333e+04
1034 1 1.490666666666666e+04
1035 1 1.492000000000000e+04
1036 1 1.493333333333333e+04
1037 1 1.494666666666666e+04
1038 1 1.496000000000000e+04
1039 1 1.497333333333333e+04
1040 1 7.498333333333333e+03
1041 1 1.981166666666666e+04
1042 1 1.501333333333333e+04
1043 1 1.502666666666666e+04
1044 1 1.504000000000000e+04
1045 1 1.505333333333333e+04
1046 1 1.506666666666666e+04
1047 1 1.508000000000000e+04
1048 1 1.509333333333333e+04
1049 1 1.510666666666666e+04
1050 1 7.565000000000000e+03
1051 1 1.999499999999999e+04
1052 1 1.514666666666666e+04
1053 1 1.516000000000000e+04
1054 1 1.517333333333333e+04
1055 1 1.518666666666666e+04
1056 1 1.520000000000000e+04
1057 1 1.521333333333333e+04
1058 1 1.522666666666666e+04
1059 1 1.524000000000000e+04
1060 1 7.631666666666666e+03
1061 1 1.033233333333333e+04
1062 1 6.857499999999998e+03
1063 1 6.863333333333334e+03
1064 1 6.869166666666666e+03
1065 1 6.874999999999998e+03
1066 1 6.880833333333334e+03
1067 1 6.886666666666666e+03
1068 1 6.892499999999998e+03
1069 1 6.898333333333334e+03
1070 1 3.455583333333334e+03
1071 1 2.036166666666667e+03
1072 1 1.541333333333333e+03
1073 1 1.542666666666667e+03
1074 1 1.544000000000000e+03
1075 1 1.545333333333333e+03
1076 1 1.546666666666667e+03
1077 1 1.548000000000000e+03
1078 1 1.549333333333333e+03
1079 1 1.550666666666667e+03
1080 1 7.764999999999999e+02
1081 1 2.054500000000000e+03
1082 1 1.554666666666667e+03
1083 1 1.556000000000000e+03
1084 1 1.557333333333333e+03
1085 1 1.558666666666667e+03
1086 1 1.560000000000000e+03
1087 1 1.561333333333333e+03
1088 1 1.562666666666667e+03
1089 1 1.564000000000000e+03
1090 1 7.831666666666667e+02
1091 1 9.488333333333333e+02
1092 1 6.071666666666667e+02
1093 1 6.076666666666667e+02
1094 1 6.081666666666666e+02
1095 1 6.086666666666667e+02
1096 1 6.091666666666667e+02
1097 1 6.096666666666666e+02
1098 1 6.101666666666667e+02
1099 1 6.106666666666667e+02
1100 1 3.059166666666667e+02
1101 1 4.006666666666667e+03
1102 1 2.351666666666666e+03
1103 1 2.353333333333334e+03
1104 1 2.355000000000000e+03
1105 1 2.356666666666666e+03
1106 1 2.358333333333334e+03
1107 1 2.360000000000000e+03
1108 1 2.361666666666666e+03
1109 1 2.363333333333334e+03
1110 1 1.184166666666667e+03
1111 1 7.212499999999999e+03
1112 1 2.968333333333332e+03
1113 1 2.970000000000002e+03
1114 1 2.971666666666664e+03
1115 1 2.973333333333332e+03
1116 1 2.975000000000002e+03
1117 1 2.976666666666664e+03
1118 1 2.978333333333332e+03
1119 1 2.980000000000002e+03
1120 1 1.495000000000000e+03
1121 1 7.270833333333333e+03
1122 1 2.985000000000002e+03
1123 1 2.986666666666664e+03
1124 1 2.988333333333332e+03
1125 1 2.990000000000002e+03
1126 1 2.991666666666664e+03
1127 1 2.993333333333332e+03
1128 1 2.995000000000002e+03
1129 1 2.996666666666664e+03
1130 1 1.503333333333333e+03
1131 1 7.329166666666666e+03
1132 1 3.001666666666664e+03
1133 1 3.003333333333332e+03
1134 1 3.005000000000002e+03
1135 1 3.006666666666664e+03
1136 1 3.008333333333332e+03
1137 1 3.010000000000002e+03
1138 1 3.011666666666664e+03
1139 1 3.013333333333332e+03
1140 1 1.511666666666667e+03
1141 1 7.387499999999999e+03
1142 1 3.018333333333332e+03
1143 1 3.020000000000002e+03
1144 1 3.021666666666664e+03
1145 1 3.023333333333332e+03
1146 1 3.025000000000002e+03
1147 1 3.026666666666664e+03
1148 1 3.028333333333332e+03
1149 1 3.030000000000002e+03
1150 1 1.520000000000000e+03
1151 1 7.445833333333333e+03
1152 1 3.035000000000002e+03
1153 1 3.036666666666664e+03
1154 1 3.038333333333332e+03
1155 1 3.040000000000002e+03
1156 1 3.041666666666664e+03
1157 1 3.043333333333332e+03
1158 1 3.045000000000002e+03
1159 1 3.046666666666664e+03
1160 1 1.528333333333333e+03
1161 1 7.504166666666666e+03
1162 1 3.051666666666664e+03
1163 1 3.053333333333332e+03
1164 1 3.055000000000002e+03
1165 1 3.056666666666664e+03
1166 1 3.058333333333332e+03
1167 1 3.060000000000002e+03
1168 1 3.061666666666664e+03
1169 1 3.063333333333332e+03
1170 1 1.536666666666667e+03
1171 1 3.746500000000001e+03
1172 1 8.468333333333321e+02
1173 1 8.469999999999982e+02
1174 1 8.471666666666679e+02
1175 1 8.473333333333321e+02
1176 1 8.474999999999982e+02
1177 1 8.476666666666679e+02
1178 1 8.478333333333321e+02
1179 1 8.479999999999982e+02
1180 1 4.267500000000000e+02
1181 1 7.620833333333333e+02
1182 1 3.084999999999998e+02
1183 1 3.086666666666667e+02
1184 1 3.088333333333335e+02
1185 1 3.089999999999998e+02
1186 1 3.091666666666667e+02
1187 1 3.093333333333335e+02
1188 1 3.094999999999998e+02
1189 1 3.096666666666667e+02
1190 1 1.553333333333334e+02
1191 1 7.679166666666666e+02
1192 1 3.101666666666667e+02
1193 1 3.103333333333335e+02
1194 1 3.104999999999998e+02
1195 1 3.106666666666667e+02
1196 1 3.108333333333335e+02
1197 1 3.109999999999998e+02
1198 1 3.111666666666667e+02
1199 1 3.113333333333335e+02
1200 1 1.561666666666666e+02
1201 1 3.397500000000000e+02
1202 1 6.000000000000011e+01
1203 1 6.000000000000000e+01
1204 1 6.000000000000000e+01
1205 1 6.000000000000011e+01
1206 1 6.000000000000000e+01
1207 1 6.000000000000000e+01
1208 1 6.000000000000011e+01
1209 1 6.000000000000000e+01
1210 1 3.025000000000006e+01
1211 1 3.833333333333333e+03
1212 1 7.656666666666666e+03
1213 1 7.613333333333332e+03
1214 1 7.569999999999999e+03
1215 1 7.526666666666666e+03
1216 1 7.483333333333332e+03
1217 1 7.439999999999999e+03
1218 1 4.083166666666667e+03
1219 1 7.353333333333334e+02
1220 1 7.310000000000000e+02
1221 1 3.649999999999999e+02
1222 1 6.547499999999999e+03
1223 1 1.307500000000000e+04
1224 1 1.298666666666667e+04
1225 1 1.289833333333333e+04
1226 1 1.281000000000000e+04
1227 1 1.272166666666667e+04
1228 1 1.263333333333333e+04
1229 1 6.930499999999999e+03
1230 1 1.245666666666667e+03
1231 1 1.236833333333333e+03
1232 1 6.174166666666666e+02
1233 1 6.061666666666666e+03
1234 1 1.210333333333333e+04
1235 1 1.201500000000000e+04
1236 1 1.192666666666666e+04
1237 1 1.183833333333333e+04
1238 1 1.175000000000000e+04
1239 1 1.166166666666666e+04
1240 1 6.396083333333334e+03
1241 1 1.148500000000000e+03
1242 1 1.139666666666667e+03
1243 1 5.688333333333334e+02
1244 1 5.575833333333333e+03
1245 1 1.113166666666666e+04
1246 1 1.104333333333333e+04
1247 1 1.095500000000000e+04
1248 1 1.086666666666666e+04
1249 1 1.077833333333333e+04
1250 1 1.069000000000000e+04
1251 1 5.861666666666666e+03
1252 1 1.051333333333333e+03
1253 1 1.042500000000000e+03
1254 1 5.202500000000000e+02
1255 1 5.090000000000000e+03
1256 1 1.016000000000000e+04
1257 1 1.007166666666666e+04
1258 1 9.983333333333334e+03
1259 1 9.895000000000000e+03
1260 1 9.806666666666664e+03
1261 1 9.718333333333334e+03
1262 1 5.327249999999999e+03
1263 1 9.541666666666665e+02
1264 1 9.453333333333335e+02
1265 1 4.716666666666666e+02
1266 1 4.604166666666666e+03
1267 1 9.188333333333334e+03
1268 1 9.100000000000000e+03
1269 1 9.011666666666664e+03
1270 1 8.923333333333334e+03
1271 1 8.835000000000000e+03
1272 1 8.746666666666664e+03
1273 1 4.792833333333333e+03
1274 1 8.570000000000000e+02
1275 1 8.481666666666665e+02
1276 1 4.230833333333334e+02
1277 1 4.118333333333333e+03
1278 1 8.216666666666664e+03
1279 1 8.128333333333334e+03
1280 1 8.040000000000000e+03
1281 1 7.951666666666664e+03
1282 1 7.863333333333334e+03
1283 1 7.775000000000000e+03
1284 1 4.258416666666667e+03
1285 1 7.598333333333335e+02
1286 1 7.509999999999999e+02
1287 1 3.745000000000000e+02
1288 1 3.632500000000001e+03
1289 1 7.245000000000000e+03
1290 1 7.156666666666664e+03
1291 1 7.068333333333334e+03
1292 1 6.980000000000000e+03
1293 1 6.891666666666664e+03
1294 1 6.803333333333336e+03
1295 1 3.724000000000000e+03
1296 1 6.626666666666665e+02
1297 1 6.538333333333335e+02
1298 1 3.259166666666666e+02
1299 1 3.146666666666666e+03
1300 1 6.273333333333336e+03
1301 1 6.185000000000000e+03
1302 1 6.096666666666664e+03
1303 1 6.008333333333336e+03
1304 1 5.920000000000000e+03
1305 1 5.831666666666664e+03
1306 1 3.189583333333333e+03
1307 1 5.655000000000000e+02
1308 1 5.566666666666665e+02
1309 1 2.773333333333334e+02
1310 1 2.660833333333333e+03
1311 1 5.301666666666664e+03
1312 1 5.213333333333336e+03
1313 1 5.125000000000000e+03
1314 1 5.036666666666664e+03
1315 1 4.948333333333336e+03
1316 1 4.860000000000000e+03
1317 1 2.655166666666667e+03
1318 1 4.683333333333333e+02
1319 1 4.595000000000000e+02
1320 1 2.287500000000000e+02
1321 1 7.250000000000005e+02
1322 1 1.440000000000000e+03
1323 1 1.394999999999999e+03
1324 1 1.350000000000000e+03
1325 1 1.305000000000000e+03
1326 1 1.259999999999999e+03
1327 1 1.215000000000000e+03
1328 1 6.592499999999991e+02
1329 1 1.125000000000000e+02
1330 1 1.080000000000001e+02
1331 1 5.350000000000000e+01
