%%MatrixMarket matrix coordinate complex general
       224       224      1000
         1         1 -2.184600000000000080E+02  0.000000000000000000E+00
         1         9  6.400000000000000000E+01  0.000000000000000000E+00
         1        10  6.400000000000000000E+01  0.000000000000000000E+00
         1        15  6.400000000000000000E+01  0.000000000000000000E+00
         1        16  6.400000000000000000E+01  0.000000000000000000E+00
         2         2 -2.184600000000000080E+02  0.000000000000000000E+00
         2        10  6.400000000000000000E+01  0.000000000000000000E+00
         2        12  6.400000000000000000E+01  0.000000000000000000E+00
         2        13  6.400000000000000000E+01  0.000000000000000000E+00
         2        15  6.400000000000000000E+01  0.000000000000000000E+00
         3         3 -2.184600000000000080E+02  0.000000000000000000E+00
         3         8  6.400000000000000000E+01  0.000000000000000000E+00
         3        10  6.400000000000000000E+01  0.000000000000000000E+00
         3        12  6.400000000000000000E+01  0.000000000000000000E+00
         4         4 -2.184600000000000080E+02  0.000000000000000000E+00
         4         7  6.400000000000000000E+01  0.000000000000000000E+00
         4         8  6.400000000000000000E+01  0.000000000000000000E+00
         4         9  6.400000000000000000E+01  0.000000000000000000E+00
         4        10  6.400000000000000000E+01  0.000000000000000000E+00
         5         5 -2.184600000000000080E+02  0.000000000000000000E+00
         5         6  6.400000000000000000E+01  0.000000000000000000E+00
         5         7  6.400000000000000000E+01  0.000000000000000000E+00
         5         8  6.400000000000000000E+01  0.000000000000000000E+00
         6         5  6.400000000000000000E+01  0.000000000000000000E+00
         6         6 -2.184600000000000080E+02  0.000000000000000000E+00
         6       223  6.400000000000000000E+01  0.000000000000000000E+00
         6       224  6.400000000000000000E+01  0.000000000000000000E+00
         7         4  6.400000000000000000E+01  0.000000000000000000E+00
         7         5  6.400000000000000000E+01  0.000000000000000000E+00
         7         7 -2.184600000000000080E+02  0.000000000000000000E+00
         7       222  6.400000000000000000E+01  0.000000000000000000E+00
         7       223  6.400000000000000000E+01  0.000000000000000000E+00
         8         3  6.400000000000000000E+01  0.000000000000000000E+00
         8         4  6.400000000000000000E+01  0.000000000000000000E+00
         8         5  6.400000000000000000E+01  0.000000000000000000E+00
         8         8 -2.184600000000000080E+02  0.000000000000000000E+00
         9         1  6.400000000000000000E+01  0.000000000000000000E+00
         9         4  6.400000000000000000E+01  0.000000000000000000E+00
         9         9 -2.184600000000000080E+02  0.000000000000000000E+00
         9       221  6.400000000000000000E+01  0.000000000000000000E+00
         9       222  6.400000000000000000E+01  0.000000000000000000E+00
        10         1  6.400000000000000000E+01  0.000000000000000000E+00
        10         2  6.400000000000000000E+01  0.000000000000000000E+00
        10         3  6.400000000000000000E+01  0.000000000000000000E+00
        10         4  6.400000000000000000E+01  0.000000000000000000E+00
        10        10 -2.184600000000000080E+02  0.000000000000000000E+00
        11        11 -2.184600000000000080E+02  0.000000000000000000E+00
        11        12  6.400000000000000000E+01  0.000000000000000000E+00
        11        13  6.400000000000000000E+01  0.000000000000000000E+00
        11        14  6.400000000000000000E+01  0.000000000000000000E+00
        12         2  6.400000000000000000E+01  0.000000000000000000E+00
        12         3  6.400000000000000000E+01  0.000000000000000000E+00
        12        11  6.400000000000000000E+01  0.000000000000000000E+00
        12        12 -2.184600000000000080E+02  0.000000000000000000E+00
        13         2  6.400000000000000000E+01  0.000000000000000000E+00
        13        11  6.400000000000000000E+01  0.000000000000000000E+00
        13        13 -2.184600000000000080E+02  0.000000000000000000E+00
        13        73  6.400000000000000000E+01  0.000000000000000000E+00
        13        74  6.400000000000000000E+01  0.000000000000000000E+00
        14        11  6.400000000000000000E+01  0.000000000000000000E+00
        14        14 -2.184600000000000080E+02  0.000000000000000000E+00
        14        72  6.400000000000000000E+01  0.000000000000000000E+00
        14        73  6.400000000000000000E+01  0.000000000000000000E+00
        15         1  6.400000000000000000E+01  0.000000000000000000E+00
        15         2  6.400000000000000000E+01  0.000000000000000000E+00
        15        15 -2.184600000000000080E+02  0.000000000000000000E+00
        15        74  6.400000000000000000E+01  0.000000000000000000E+00
        15        75  6.400000000000000000E+01  0.000000000000000000E+00
        16         1  6.400000000000000000E+01  0.000000000000000000E+00
        16        16 -2.184600000000000080E+02  0.000000000000000000E+00
        16        75  6.400000000000000000E+01  0.000000000000000000E+00
        16       220  6.400000000000000000E+01  0.000000000000000000E+00
        16       221  6.400000000000000000E+01  0.000000000000000000E+00
        17        17 -6.396500000000000341E+01 -2.654400000000000048E+01
        17        18  6.400000000000000000E+01  0.000000000000000000E+00
        17        21  6.400000000000000000E+01  0.000000000000000000E+00
        17        31  6.400000000000000000E+01  0.000000000000000000E+00
        17        34  2.262699999999999889E+01  0.000000000000000000E+00
        18        17  2.262699999999999889E+01  0.000000000000000000E+00
        18        18 -2.184600000000000080E+02  0.000000000000000000E+00
        18        24  6.400000000000000000E+01  0.000000000000000000E+00
        18        29  6.400000000000000000E+01  0.000000000000000000E+00
        18        30  2.262699999999999889E+01  0.000000000000000000E+00
        19        19 -2.184600000000000080E+02  0.000000000000000000E+00
        19        24  6.400000000000000000E+01  0.000000000000000000E+00
        19        27  6.400000000000000000E+01  0.000000000000000000E+00
        19        28  6.400000000000000000E+01  0.000000000000000000E+00
        19        29  6.400000000000000000E+01  0.000000000000000000E+00
        20        20 -2.184600000000000080E+02  0.000000000000000000E+00
        20        22  6.400000000000000000E+01  0.000000000000000000E+00
        20        24  6.400000000000000000E+01  0.000000000000000000E+00
        20        28  6.400000000000000000E+01  0.000000000000000000E+00
        21        17  2.262699999999999889E+01  0.000000000000000000E+00
        21        21 -2.184600000000000080E+02  0.000000000000000000E+00
        21        22  6.400000000000000000E+01  0.000000000000000000E+00
        21        24  6.400000000000000000E+01  0.000000000000000000E+00
        21        35  6.400000000000000000E+01  0.000000000000000000E+00
        22        20  6.400000000000000000E+01  0.000000000000000000E+00
        22        21  6.400000000000000000E+01  0.000000000000000000E+00
        22        22 -2.184600000000000080E+02  0.000000000000000000E+00
        22        23  6.400000000000000000E+01  0.000000000000000000E+00
        23        22  6.400000000000000000E+01  0.000000000000000000E+00
        23        23 -2.184600000000000080E+02  0.000000000000000000E+00
        23        35  6.400000000000000000E+01  0.000000000000000000E+00
        23       193  6.400000000000000000E+01  0.000000000000000000E+00
        24        18  6.400000000000000000E+01  0.000000000000000000E+00
        24        19  6.400000000000000000E+01  0.000000000000000000E+00
        24        20  6.400000000000000000E+01  0.000000000000000000E+00
        24        21  6.400000000000000000E+01  0.000000000000000000E+00
        24        24 -2.184600000000000080E+02  0.000000000000000000E+00
        25        25 -2.184600000000000080E+02  0.000000000000000000E+00
        25        26  6.400000000000000000E+01  0.000000000000000000E+00
        25        27  6.400000000000000000E+01  0.000000000000000000E+00
        25        28  6.400000000000000000E+01  0.000000000000000000E+00
        26        25  6.400000000000000000E+01  0.000000000000000000E+00
        26        26 -2.184600000000000080E+02  0.000000000000000000E+00
        26        72  6.400000000000000000E+01  0.000000000000000000E+00
        26        82  6.400000000000000000E+01  0.000000000000000000E+00
        27        19  6.400000000000000000E+01  0.000000000000000000E+00
        27        25  6.400000000000000000E+01  0.000000000000000000E+00
        27        27 -2.184600000000000080E+02  0.000000000000000000E+00
        27        50  6.400000000000000000E+01  0.000000000000000000E+00
        27        82  6.400000000000000000E+01  0.000000000000000000E+00
        28        19  6.400000000000000000E+01  0.000000000000000000E+00
        28        20  6.400000000000000000E+01  0.000000000000000000E+00
        28        25  6.400000000000000000E+01  0.000000000000000000E+00
        28        28 -2.184600000000000080E+02  0.000000000000000000E+00
        29        18  6.400000000000000000E+01  0.000000000000000000E+00
        29        19  6.400000000000000000E+01  0.000000000000000000E+00
        29        29 -2.184600000000000080E+02  0.000000000000000000E+00
        29        50  6.400000000000000000E+01  0.000000000000000000E+00
        29        51  2.262699999999999889E+01  0.000000000000000000E+00
        30        18  6.400000000000000000E+01  0.000000000000000000E+00
        30        30 -6.396500000000000341E+01 -2.654400000000000048E+01
        30        34  2.262699999999999889E+01  0.000000000000000000E+00
        30        51  2.262699999999999889E+01  0.000000000000000000E+00
        30        52  6.399999999999999710E-05  0.000000000000000000E+00
        31        17  2.262699999999999889E+01  0.000000000000000000E+00
        31        31 -2.184600000000000080E+02  0.000000000000000000E+00
        31        33  2.262699999999999889E+01  0.000000000000000000E+00
        31        35  6.400000000000000000E+01  0.000000000000000000E+00
        31        45  6.400000000000000000E+01  0.000000000000000000E+00
        32        32 -2.184599999999999921E-04 -3.753999999999999915E+01
        32        34  2.262699999999999889E+01  0.000000000000000000E+00
        32        43  6.399999999999999710E-05  0.000000000000000000E+00
        32        46  6.399999999999999710E-05  0.000000000000000000E+00
        32        52  6.399999999999999710E-05  0.000000000000000000E+00
        33        31  6.400000000000000000E+01  0.000000000000000000E+00
        33        33 -6.396500000000000341E+01 -2.654400000000000048E+01
        33        34  2.262699999999999889E+01  0.000000000000000000E+00
        33        39  2.262699999999999889E+01  0.000000000000000000E+00
        33        43  6.399999999999999710E-05  0.000000000000000000E+00
        34        17  2.262699999999999889E+01  0.000000000000000000E+00
        34        30  2.262699999999999889E+01  0.000000000000000000E+00
        34        32  6.399999999999999710E-05  0.000000000000000000E+00
        34        33  2.262699999999999889E+01  0.000000000000000000E+00
        34        34 -6.396500000000000341E+01 -2.654400000000000048E+01
        35        21  6.400000000000000000E+01  0.000000000000000000E+00
        35        23  6.400000000000000000E+01  0.000000000000000000E+00
        35        31  6.400000000000000000E+01  0.000000000000000000E+00
        35        35 -2.184600000000000080E+02  0.000000000000000000E+00
        35        36  6.400000000000000000E+01  0.000000000000000000E+00
        36        35  6.400000000000000000E+01  0.000000000000000000E+00
        36        36 -2.184600000000000080E+02  0.000000000000000000E+00
        36        45  6.400000000000000000E+01  0.000000000000000000E+00
        36       193  6.400000000000000000E+01  0.000000000000000000E+00
        36       194  6.400000000000000000E+01  0.000000000000000000E+00
        37        37 -2.184599999999999921E-04 -3.753999999999999915E+01
        37        39  2.262699999999999889E+01  0.000000000000000000E+00
        37        41  2.262699999999999889E+01  0.000000000000000000E+00
        37        43  6.399999999999999710E-05  0.000000000000000000E+00
        37        44  6.399999999999999710E-05  0.000000000000000000E+00
        38        38 -6.396500000000000341E+01 -2.654400000000000048E+01
        38        39  2.262699999999999889E+01  0.000000000000000000E+00
        38        40  6.400000000000000000E+01  0.000000000000000000E+00
        38        41  2.262699999999999889E+01  0.000000000000000000E+00
        38        42  2.262699999999999889E+01  0.000000000000000000E+00
        39        33  2.262699999999999889E+01  0.000000000000000000E+00
        39        37  6.399999999999999710E-05  0.000000000000000000E+00
        39        38  2.262699999999999889E+01  0.000000000000000000E+00
        39        39 -6.396500000000000341E+01 -2.654400000000000048E+01
        39        45  6.400000000000000000E+01  0.000000000000000000E+00
        40        38  2.262699999999999889E+01  0.000000000000000000E+00
        40        40 -2.184600000000000080E+02  0.000000000000000000E+00
        40        45  6.400000000000000000E+01  0.000000000000000000E+00
        40       194  6.400000000000000000E+01  0.000000000000000000E+00
        40       195  6.400000000000000000E+01  0.000000000000000000E+00
        41        37  6.399999999999999710E-05  0.000000000000000000E+00
        41        38  2.262699999999999889E+01  0.000000000000000000E+00
        41        41 -6.396500000000000341E+01 -2.654400000000000048E+01
        41       131  6.399999999999999710E-05  0.000000000000000000E+00
        41       133  2.262699999999999889E+01  0.000000000000000000E+00
        42        38  2.262699999999999889E+01  0.000000000000000000E+00
        42        42 -6.396500000000000341E+01 -2.654400000000000048E+01
        42       133  2.262699999999999889E+01  0.000000000000000000E+00
        42       195  6.400000000000000000E+01  0.000000000000000000E+00
        42       196  6.400000000000000000E+01  0.000000000000000000E+00
        43        32  6.399999999999999710E-05  0.000000000000000000E+00
        43        33  2.262699999999999889E+01  0.000000000000000000E+00
        43        37  6.399999999999999710E-05  0.000000000000000000E+00
        43        43 -2.184599999999999921E-04 -3.753999999999999915E+01
        43        49  6.399999999999999710E-05  0.000000000000000000E+00
        44        37  6.399999999999999710E-05  0.000000000000000000E+00
        44        44 -2.184599999999999921E-04 -3.753999999999999915E+01
        44        49  6.399999999999999710E-05  0.000000000000000000E+00
        44       102  6.400000000000000000E+01  0.000000000000000000E+00
        44       131  6.399999999999999710E-05  0.000000000000000000E+00
        45        31  6.400000000000000000E+01  0.000000000000000000E+00
        45        36  6.400000000000000000E+01  0.000000000000000000E+00
        45        39  2.262699999999999889E+01  0.000000000000000000E+00
        45        40  6.400000000000000000E+01  0.000000000000000000E+00
        45        45 -2.184600000000000080E+02  0.000000000000000000E+00
        46        32  6.399999999999999710E-05  0.000000000000000000E+00
        46        46 -2.184599999999999921E-04 -3.753999999999999915E+01
        46        47  6.399999999999999710E-05  0.000000000000000000E+00
        46        49  6.399999999999999710E-05  0.000000000000000000E+00
        46       114  6.400000000000000000E+01  0.000000000000000000E+00
        47        46  6.399999999999999710E-05  0.000000000000000000E+00
        47        47 -2.184599999999999921E-04 -3.753999999999999915E+01
        47        52  6.399999999999999710E-05  0.000000000000000000E+00
        47        69  6.399999999999999710E-05  0.000000000000000000E+00
        47       113  6.400000000000000000E+01  0.000000000000000000E+00
        48        48 -6.396500000000000341E+01 -2.654400000000000048E+01
        48        54  2.262699999999999889E+01  0.000000000000000000E+00
        48        55  6.400000000000000000E+01  0.000000000000000000E+00
        48        65  2.262699999999999889E+01  0.000000000000000000E+00
        48        67  6.400000000000000000E+01  0.000000000000000000E+00
        49        43  6.399999999999999710E-05  0.000000000000000000E+00
        49        44  6.399999999999999710E-05  0.000000000000000000E+00
        49        46  6.399999999999999710E-05  0.000000000000000000E+00
        49        49 -2.184599999999999921E-04 -3.753999999999999915E+01
        49        56  6.400000000000000000E+01  0.000000000000000000E+00
        50        27  6.400000000000000000E+01  0.000000000000000000E+00
        50        29  6.400000000000000000E+01  0.000000000000000000E+00
        50        50 -2.184600000000000080E+02  0.000000000000000000E+00
        50        54  2.262699999999999889E+01  0.000000000000000000E+00
        50        55  6.400000000000000000E+01  0.000000000000000000E+00
        51        29  6.400000000000000000E+01  0.000000000000000000E+00
        51        30  2.262699999999999889E+01  0.000000000000000000E+00
        51        51 -6.396500000000000341E+01 -2.654400000000000048E+01
        51        53  6.399999999999999710E-05  0.000000000000000000E+00
        51        54  2.262699999999999889E+01  0.000000000000000000E+00
        52        30  2.262699999999999889E+01  0.000000000000000000E+00
        52        32  6.399999999999999710E-05  0.000000000000000000E+00
        52        47  6.399999999999999710E-05  0.000000000000000000E+00
        52        52 -2.184599999999999921E-04 -3.753999999999999915E+01
        52        53  6.399999999999999710E-05  0.000000000000000000E+00
        53        51  2.262699999999999889E+01  0.000000000000000000E+00
        53        52  6.399999999999999710E-05  0.000000000000000000E+00
        53        53 -2.184599999999999921E-04 -3.753999999999999915E+01
        53        68  2.262699999999999889E+01  0.000000000000000000E+00
        53        69  6.399999999999999710E-05  0.000000000000000000E+00
        54        48  2.262699999999999889E+01  0.000000000000000000E+00
        54        50  6.400000000000000000E+01  0.000000000000000000E+00
        54        51  2.262699999999999889E+01  0.000000000000000000E+00
        54        54 -6.396500000000000341E+01 -2.654400000000000048E+01
        54        68  2.262699999999999889E+01  0.000000000000000000E+00
        55        48  2.262699999999999889E+01  0.000000000000000000E+00
        55        50  6.400000000000000000E+01  0.000000000000000000E+00
        55        55 -2.184600000000000080E+02  0.000000000000000000E+00
        55        81  6.400000000000000000E+01  0.000000000000000000E+00
        55        82  6.400000000000000000E+01  0.000000000000000000E+00
        56        49  6.399999999999999710E-05  0.000000000000000000E+00
        56        56 -2.184600000000000080E+02  0.000000000000000000E+00
        56       102  6.400000000000000000E+01  0.000000000000000000E+00
        56       114  6.400000000000000000E+01  0.000000000000000000E+00
        56       129  6.400000000000000000E+01  0.000000000000000000E+00
        57        57 -6.396500000000000341E+01 -2.654400000000000048E+01
        57        64  6.399999999999999710E-05  0.000000000000000000E+00
        57        65  2.262699999999999889E+01  0.000000000000000000E+00
        57        66  2.262699999999999889E+01  0.000000000000000000E+00
        57        67  6.400000000000000000E+01  0.000000000000000000E+00
        58        58 -2.184599999999999921E-04 -3.753999999999999915E+01
        58        60  6.399999999999999710E-05  0.000000000000000000E+00
        58        61  6.399999999999999710E-05  0.000000000000000000E+00
        58        64  6.399999999999999710E-05  0.000000000000000000E+00
        58        65  2.262699999999999889E+01  0.000000000000000000E+00
        59        59 -2.184600000000000080E+02  0.000000000000000000E+00
        59        60  6.399999999999999710E-05  0.000000000000000000E+00
        59        61  6.399999999999999710E-05  0.000000000000000000E+00
        59        62  6.400000000000000000E+01  0.000000000000000000E+00
        59        63  6.400000000000000000E+01  0.000000000000000000E+00
        60        58  6.399999999999999710E-05  0.000000000000000000E+00
        60        59  6.400000000000000000E+01  0.000000000000000000E+00
        60        60 -2.184599999999999921E-04 -3.753999999999999915E+01
        60       104  6.400000000000000000E+01  0.000000000000000000E+00
        60       105  6.399999999999999710E-05  0.000000000000000000E+00
        61        58  6.399999999999999710E-05  0.000000000000000000E+00
        61        59  6.400000000000000000E+01  0.000000000000000000E+00
        61        61 -2.184599999999999921E-04 -3.753999999999999915E+01
        61        68  2.262699999999999889E+01  0.000000000000000000E+00
        61        69  6.399999999999999710E-05  0.000000000000000000E+00
        62        59  6.400000000000000000E+01  0.000000000000000000E+00
        62        62 -2.184600000000000080E+02  0.000000000000000000E+00
        62       103  6.400000000000000000E+01  0.000000000000000000E+00
        62       104  6.400000000000000000E+01  0.000000000000000000E+00
        62       112  6.400000000000000000E+01  0.000000000000000000E+00
        63        59  6.400000000000000000E+01  0.000000000000000000E+00
        63        63 -2.184600000000000080E+02  0.000000000000000000E+00
        63        69  6.399999999999999710E-05  0.000000000000000000E+00
        63       112  6.400000000000000000E+01  0.000000000000000000E+00
        63       113  6.400000000000000000E+01  0.000000000000000000E+00
        64        57  2.262699999999999889E+01  0.000000000000000000E+00
        64        58  6.399999999999999710E-05  0.000000000000000000E+00
        64        64 -2.184599999999999921E-04 -3.753999999999999915E+01
        64        70  2.262699999999999889E+01  0.000000000000000000E+00
        64       105  6.399999999999999710E-05  0.000000000000000000E+00
        65        48  2.262699999999999889E+01  0.000000000000000000E+00
        65        57  2.262699999999999889E+01  0.000000000000000000E+00
        65        58  6.399999999999999710E-05  0.000000000000000000E+00
        65        65 -6.396500000000000341E+01 -2.654400000000000048E+01
        65        68  2.262699999999999889E+01  0.000000000000000000E+00
        66        57  2.262699999999999889E+01  0.000000000000000000E+00
        66        66 -6.396500000000000341E+01 -2.654400000000000048E+01
        66        70  2.262699999999999889E+01  0.000000000000000000E+00
        66        71  6.400000000000000000E+01  0.000000000000000000E+00
        66        80  6.400000000000000000E+01  0.000000000000000000E+00
        67        48  2.262699999999999889E+01  0.000000000000000000E+00
        67        57  2.262699999999999889E+01  0.000000000000000000E+00
        67        67 -2.184600000000000080E+02  0.000000000000000000E+00
        67        80  6.400000000000000000E+01  0.000000000000000000E+00
        67        81  6.400000000000000000E+01  0.000000000000000000E+00
        68        53  6.399999999999999710E-05  0.000000000000000000E+00
        68        54  2.262699999999999889E+01  0.000000000000000000E+00
        68        61  6.399999999999999710E-05  0.000000000000000000E+00
        68        65  2.262699999999999889E+01  0.000000000000000000E+00
        68        68 -6.396500000000000341E+01 -2.654400000000000048E+01
        69        47  6.399999999999999710E-05  0.000000000000000000E+00
        69        53  6.399999999999999710E-05  0.000000000000000000E+00
        69        61  6.399999999999999710E-05  0.000000000000000000E+00
        69        63  6.400000000000000000E+01  0.000000000000000000E+00
        69        69 -2.184599999999999921E-04 -3.753999999999999915E+01
        70        64  6.399999999999999710E-05  0.000000000000000000E+00
        70        66  2.262699999999999889E+01  0.000000000000000000E+00
        70        70 -6.396500000000000341E+01 -2.654400000000000048E+01
        70        83  2.262699999999999889E+01  0.000000000000000000E+00
        70        84  6.399999999999999710E-05  0.000000000000000000E+00
        71        66  2.262699999999999889E+01  0.000000000000000000E+00
        71        71 -2.184600000000000080E+02  0.000000000000000000E+00
        71        76  6.400000000000000000E+01  0.000000000000000000E+00
        71        77  6.400000000000000000E+01  0.000000000000000000E+00
        71        83  2.262699999999999889E+01  0.000000000000000000E+00
        72        14  6.400000000000000000E+01  0.000000000000000000E+00
        72        26  6.400000000000000000E+01  0.000000000000000000E+00
        72        72 -2.184600000000000080E+02  0.000000000000000000E+00
        72        79  6.400000000000000000E+01  0.000000000000000000E+00
        73        13  6.400000000000000000E+01  0.000000000000000000E+00
        73        14  6.400000000000000000E+01  0.000000000000000000E+00
        73        73 -2.184600000000000080E+02  0.000000000000000000E+00
        73        78  6.400000000000000000E+01  0.000000000000000000E+00
        73        79  6.400000000000000000E+01  0.000000000000000000E+00
        74        13  6.400000000000000000E+01  0.000000000000000000E+00
        74        15  6.400000000000000000E+01  0.000000000000000000E+00
        74        74 -2.184600000000000080E+02  0.000000000000000000E+00
        74        77  6.400000000000000000E+01  0.000000000000000000E+00
        74        78  6.400000000000000000E+01  0.000000000000000000E+00
        75        15  6.400000000000000000E+01  0.000000000000000000E+00
        75        16  6.400000000000000000E+01  0.000000000000000000E+00
        75        75 -2.184600000000000080E+02  0.000000000000000000E+00
        75        76  6.400000000000000000E+01  0.000000000000000000E+00
        75        77  6.400000000000000000E+01  0.000000000000000000E+00
        76        71  6.400000000000000000E+01  0.000000000000000000E+00
        76        75  6.400000000000000000E+01  0.000000000000000000E+00
        76        76 -2.184600000000000080E+02  0.000000000000000000E+00
        76       219  6.400000000000000000E+01  0.000000000000000000E+00
        76       220  6.400000000000000000E+01  0.000000000000000000E+00
        77        71  6.400000000000000000E+01  0.000000000000000000E+00
        77        74  6.400000000000000000E+01  0.000000000000000000E+00
        77        75  6.400000000000000000E+01  0.000000000000000000E+00
        77        77 -2.184600000000000080E+02  0.000000000000000000E+00
        77        80  6.400000000000000000E+01  0.000000000000000000E+00
        78        73  6.400000000000000000E+01  0.000000000000000000E+00
        78        74  6.400000000000000000E+01  0.000000000000000000E+00
        78        78 -2.184600000000000080E+02  0.000000000000000000E+00
        78        80  6.400000000000000000E+01  0.000000000000000000E+00
        78        81  6.400000000000000000E+01  0.000000000000000000E+00
        79        72  6.400000000000000000E+01  0.000000000000000000E+00
        79        73  6.400000000000000000E+01  0.000000000000000000E+00
        79        79 -2.184600000000000080E+02  0.000000000000000000E+00
        79        81  6.400000000000000000E+01  0.000000000000000000E+00
        79        82  6.400000000000000000E+01  0.000000000000000000E+00
        80        66  2.262699999999999889E+01  0.000000000000000000E+00
        80        67  6.400000000000000000E+01  0.000000000000000000E+00
        80        77  6.400000000000000000E+01  0.000000000000000000E+00
        80        78  6.400000000000000000E+01  0.000000000000000000E+00
        80        80 -2.184600000000000080E+02  0.000000000000000000E+00
        81        55  6.400000000000000000E+01  0.000000000000000000E+00
        81        67  6.400000000000000000E+01  0.000000000000000000E+00
        81        78  6.400000000000000000E+01  0.000000000000000000E+00
        81        79  6.400000000000000000E+01  0.000000000000000000E+00
        81        81 -2.184600000000000080E+02  0.000000000000000000E+00
        82        26  6.400000000000000000E+01  0.000000000000000000E+00
        82        27  6.400000000000000000E+01  0.000000000000000000E+00
        82        55  6.400000000000000000E+01  0.000000000000000000E+00
        82        79  6.400000000000000000E+01  0.000000000000000000E+00
        82        82 -2.184600000000000080E+02  0.000000000000000000E+00
        83        70  2.262699999999999889E+01  0.000000000000000000E+00
        83        71  6.400000000000000000E+01  0.000000000000000000E+00
        83        83 -6.396500000000000341E+01 -2.654400000000000048E+01
        83       218  2.262699999999999889E+01  0.000000000000000000E+00
        83       219  6.400000000000000000E+01  0.000000000000000000E+00
        84        70  2.262699999999999889E+01  0.000000000000000000E+00
        84        84 -2.184599999999999921E-04 -3.753999999999999915E+01
        84       105  6.399999999999999710E-05  0.000000000000000000E+00
        84       217  6.399999999999999710E-05  0.000000000000000000E+00
        84       218  2.262699999999999889E+01  0.000000000000000000E+00
        85        85 -2.184600000000000080E+02  0.000000000000000000E+00
        85        95  6.400000000000000000E+01  0.000000000000000000E+00
        85        99  6.400000000000000000E+01  0.000000000000000000E+00
        85       100  6.400000000000000000E+01  0.000000000000000000E+00
        85       101  6.400000000000000000E+01  0.000000000000000000E+00
        86        86 -2.184600000000000080E+02  0.000000000000000000E+00
        86        87  6.400000000000000000E+01  0.000000000000000000E+00
        86        95  6.400000000000000000E+01  0.000000000000000000E+00
        86        98  6.400000000000000000E+01  0.000000000000000000E+00
        86        99  6.400000000000000000E+01  0.000000000000000000E+00
        87        86  6.400000000000000000E+01  0.000000000000000000E+00
        87        87 -2.184600000000000080E+02  0.000000000000000000E+00
        87        94  6.400000000000000000E+01  0.000000000000000000E+00
        87        96  6.400000000000000000E+01  0.000000000000000000E+00
        87        97  6.400000000000000000E+01  0.000000000000000000E+00
        88        88 -2.184600000000000080E+02  0.000000000000000000E+00
        88        92  6.400000000000000000E+01  0.000000000000000000E+00
        88        93  6.400000000000000000E+01  0.000000000000000000E+00
        88        94  6.400000000000000000E+01  0.000000000000000000E+00
        88        96  6.400000000000000000E+01  0.000000000000000000E+00
        89        89 -2.184600000000000080E+02  0.000000000000000000E+00
        89        92  6.400000000000000000E+01  0.000000000000000000E+00
        89        94  6.400000000000000000E+01  0.000000000000000000E+00
        89       108  6.400000000000000000E+01  0.000000000000000000E+00
        89       109  6.400000000000000000E+01  0.000000000000000000E+00
        90        90 -2.184600000000000080E+02  0.000000000000000000E+00
        90        92  6.400000000000000000E+01  0.000000000000000000E+00
        90        93  6.400000000000000000E+01  0.000000000000000000E+00
        90       206  6.400000000000000000E+01  0.000000000000000000E+00
        90       207  6.400000000000000000E+01  0.000000000000000000E+00
        91        91 -2.184600000000000080E+02  0.000000000000000000E+00
        91        92  6.400000000000000000E+01  0.000000000000000000E+00
        91       108  6.400000000000000000E+01  0.000000000000000000E+00
        91       207  6.400000000000000000E+01  0.000000000000000000E+00
        91       208  6.400000000000000000E+01  0.000000000000000000E+00
        92        88  6.400000000000000000E+01  0.000000000000000000E+00
        92        89  6.400000000000000000E+01  0.000000000000000000E+00
        92        90  6.400000000000000000E+01  0.000000000000000000E+00
        92        91  6.400000000000000000E+01  0.000000000000000000E+00
        92        92 -2.184600000000000080E+02  0.000000000000000000E+00
        93        88  6.400000000000000000E+01  0.000000000000000000E+00
        93        90  6.400000000000000000E+01  0.000000000000000000E+00
        93        93 -2.184600000000000080E+02  0.000000000000000000E+00
        93       130  6.400000000000000000E+01  0.000000000000000000E+00
        93       132  6.400000000000000000E+01  0.000000000000000000E+00
        94        87  6.400000000000000000E+01  0.000000000000000000E+00
        94        88  6.400000000000000000E+01  0.000000000000000000E+00
        94        89  6.400000000000000000E+01  0.000000000000000000E+00
        94        94 -2.184600000000000080E+02  0.000000000000000000E+00
        94        95  6.400000000000000000E+01  0.000000000000000000E+00
        95        85  6.400000000000000000E+01  0.000000000000000000E+00
        95        86  6.400000000000000000E+01  0.000000000000000000E+00
        95        94  6.400000000000000000E+01  0.000000000000000000E+00
        95        95 -2.184600000000000080E+02  0.000000000000000000E+00
        95       109  6.400000000000000000E+01  0.000000000000000000E+00
        96        87  6.400000000000000000E+01  0.000000000000000000E+00
        96        88  6.400000000000000000E+01  0.000000000000000000E+00
        96        96 -2.184600000000000080E+02  0.000000000000000000E+00
        96       129  6.400000000000000000E+01  0.000000000000000000E+00
        96       130  6.400000000000000000E+01  0.000000000000000000E+00
        97        87  6.400000000000000000E+01  0.000000000000000000E+00
        97        97 -2.184600000000000080E+02  0.000000000000000000E+00
        97        98  6.400000000000000000E+01  0.000000000000000000E+00
        97       114  6.400000000000000000E+01  0.000000000000000000E+00
        97       129  6.400000000000000000E+01  0.000000000000000000E+00
        98        86  6.400000000000000000E+01  0.000000000000000000E+00
        98        97  6.400000000000000000E+01  0.000000000000000000E+00
        98        98 -2.184600000000000080E+02  0.000000000000000000E+00
        98       112  6.400000000000000000E+01  0.000000000000000000E+00
        98       113  6.400000000000000000E+01  0.000000000000000000E+00
        99        85  6.400000000000000000E+01  0.000000000000000000E+00
        99        86  6.400000000000000000E+01  0.000000000000000000E+00
        99        99 -2.184600000000000080E+02  0.000000000000000000E+00
        99       103  6.400000000000000000E+01  0.000000000000000000E+00
        99       112  6.400000000000000000E+01  0.000000000000000000E+00
       100        85  6.400000000000000000E+01  0.000000000000000000E+00
       100       100 -2.184600000000000080E+02  0.000000000000000000E+00
       100       103  6.400000000000000000E+01  0.000000000000000000E+00
       100       214  6.400000000000000000E+01  0.000000000000000000E+00
       100       215  6.400000000000000000E+01  0.000000000000000000E+00
       101        85  6.400000000000000000E+01  0.000000000000000000E+00
       101       101 -2.184600000000000080E+02  0.000000000000000000E+00
       101       109  6.400000000000000000E+01  0.000000000000000000E+00
       101       213  6.400000000000000000E+01  0.000000000000000000E+00
       101       214  6.400000000000000000E+01  0.000000000000000000E+00
       102        44  6.399999999999999710E-05  0.000000000000000000E+00
       102        56  6.400000000000000000E+01  0.000000000000000000E+00
       102       102 -2.184600000000000080E+02  0.000000000000000000E+00
       102       120  6.400000000000000000E+01  0.000000000000000000E+00
       102       121  6.400000000000000000E+01  0.000000000000000000E+00
       103        62  6.400000000000000000E+01  0.000000000000000000E+00
       103        99  6.400000000000000000E+01  0.000000000000000000E+00
       103       100  6.400000000000000000E+01  0.000000000000000000E+00
       103       103 -2.184600000000000080E+02  0.000000000000000000E+00
       103       107  6.400000000000000000E+01  0.000000000000000000E+00
       104        60  6.399999999999999710E-05  0.000000000000000000E+00
       104        62  6.400000000000000000E+01  0.000000000000000000E+00
       104       104 -2.184600000000000080E+02  0.000000000000000000E+00
       104       106  6.400000000000000000E+01  0.000000000000000000E+00
       104       107  6.400000000000000000E+01  0.000000000000000000E+00
       105        60  6.399999999999999710E-05  0.000000000000000000E+00
       105        64  6.399999999999999710E-05  0.000000000000000000E+00
       105        84  6.399999999999999710E-05  0.000000000000000000E+00
       105       105 -2.184599999999999921E-04 -3.753999999999999915E+01
       105       106  6.400000000000000000E+01  0.000000000000000000E+00
       106       104  6.400000000000000000E+01  0.000000000000000000E+00
       106       105  6.399999999999999710E-05  0.000000000000000000E+00
       106       106 -2.184600000000000080E+02  0.000000000000000000E+00
       106       216  6.400000000000000000E+01  0.000000000000000000E+00
       106       217  6.399999999999999710E-05  0.000000000000000000E+00
       107       103  6.400000000000000000E+01  0.000000000000000000E+00
       107       104  6.400000000000000000E+01  0.000000000000000000E+00
       107       107 -2.184600000000000080E+02  0.000000000000000000E+00
       107       215  6.400000000000000000E+01  0.000000000000000000E+00
       107       216  6.400000000000000000E+01  0.000000000000000000E+00
       108        89  6.400000000000000000E+01  0.000000000000000000E+00
       108        91  6.400000000000000000E+01  0.000000000000000000E+00
       108       108 -2.184600000000000080E+02  0.000000000000000000E+00
       108       110  6.400000000000000000E+01  0.000000000000000000E+00
       108       111  6.400000000000000000E+01  0.000000000000000000E+00
       109        89  6.400000000000000000E+01  0.000000000000000000E+00
       109        95  6.400000000000000000E+01  0.000000000000000000E+00
       109       101  6.400000000000000000E+01  0.000000000000000000E+00
       109       109 -2.184600000000000080E+02  0.000000000000000000E+00
       109       110  6.400000000000000000E+01  0.000000000000000000E+00
       110       108  6.400000000000000000E+01  0.000000000000000000E+00
       110       109  6.400000000000000000E+01  0.000000000000000000E+00
       110       110 -2.184600000000000080E+02  0.000000000000000000E+00
       110       212  6.400000000000000000E+01  0.000000000000000000E+00
       110       213  6.400000000000000000E+01  0.000000000000000000E+00
       111       108  6.400000000000000000E+01  0.000000000000000000E+00
       111       111 -2.184600000000000080E+02  0.000000000000000000E+00
       111       208  6.400000000000000000E+01  0.000000000000000000E+00
       111       211  6.400000000000000000E+01  0.000000000000000000E+00
       111       212  6.400000000000000000E+01  0.000000000000000000E+00
       112        62  6.400000000000000000E+01  0.000000000000000000E+00
       112        63  6.400000000000000000E+01  0.000000000000000000E+00
       112        98  6.400000000000000000E+01  0.000000000000000000E+00
       112        99  6.400000000000000000E+01  0.000000000000000000E+00
       112       112 -2.184600000000000080E+02  0.000000000000000000E+00
       113        47  6.399999999999999710E-05  0.000000000000000000E+00
       113        63  6.400000000000000000E+01  0.000000000000000000E+00
       113        98  6.400000000000000000E+01  0.000000000000000000E+00
       113       113 -2.184600000000000080E+02  0.000000000000000000E+00
       113       114  6.400000000000000000E+01  0.000000000000000000E+00
       114        46  6.399999999999999710E-05  0.000000000000000000E+00
       114        56  6.400000000000000000E+01  0.000000000000000000E+00
       114        97  6.400000000000000000E+01  0.000000000000000000E+00
       114       113  6.400000000000000000E+01  0.000000000000000000E+00
       114       114 -2.184600000000000080E+02  0.000000000000000000E+00
       115       115 -2.184599999999999921E-04 -3.753999999999999915E+01
       115       119  6.400000000000000000E+01  0.000000000000000000E+00
       115       121  6.400000000000000000E+01  0.000000000000000000E+00
       115       124  6.399999999999999710E-05  0.000000000000000000E+00
       115       126  6.399999999999999710E-05  0.000000000000000000E+00
       116       116 -2.184600000000000080E+02  0.000000000000000000E+00
       116       118  6.400000000000000000E+01  0.000000000000000000E+00
       116       119  6.400000000000000000E+01  0.000000000000000000E+00
       116       120  6.400000000000000000E+01  0.000000000000000000E+00
       116       121  6.400000000000000000E+01  0.000000000000000000E+00
       117       117 -2.184600000000000080E+02  0.000000000000000000E+00
       117       118  6.400000000000000000E+01  0.000000000000000000E+00
       117       119  6.400000000000000000E+01  0.000000000000000000E+00
       117       204  6.400000000000000000E+01  0.000000000000000000E+00
       117       205  6.400000000000000000E+01  0.000000000000000000E+00
       118       116  6.400000000000000000E+01  0.000000000000000000E+00
       118       117  6.400000000000000000E+01  0.000000000000000000E+00
       118       118 -2.184600000000000080E+02  0.000000000000000000E+00
       118       130  6.400000000000000000E+01  0.000000000000000000E+00
       118       132  6.400000000000000000E+01  0.000000000000000000E+00
       119       115  6.399999999999999710E-05  0.000000000000000000E+00
       119       116  6.400000000000000000E+01  0.000000000000000000E+00
       119       117  6.400000000000000000E+01  0.000000000000000000E+00
       119       119 -2.184600000000000080E+02  0.000000000000000000E+00
       119       128  6.400000000000000000E+01  0.000000000000000000E+00
       120       102  6.400000000000000000E+01  0.000000000000000000E+00
       120       116  6.400000000000000000E+01  0.000000000000000000E+00
       120       120 -2.184600000000000080E+02  0.000000000000000000E+00
       120       129  6.400000000000000000E+01  0.000000000000000000E+00
       120       130  6.400000000000000000E+01  0.000000000000000000E+00
       121       102  6.400000000000000000E+01  0.000000000000000000E+00
       121       115  6.399999999999999710E-05  0.000000000000000000E+00
       121       116  6.400000000000000000E+01  0.000000000000000000E+00
       121       121 -2.184600000000000080E+02  0.000000000000000000E+00
       121       131  6.399999999999999710E-05  0.000000000000000000E+00
       122       122 -2.184599999999999921E-04 -3.753999999999999915E+01
       122       124  6.399999999999999710E-05  0.000000000000000000E+00
       122       125  2.262699999999999889E+01  0.000000000000000000E+00
       122       126  6.399999999999999710E-05  0.000000000000000000E+00
       122       127  2.262699999999999889E+01  0.000000000000000000E+00
       123       123 -2.184599999999999921E-04 -3.753999999999999915E+01
       123       124  6.399999999999999710E-05  0.000000000000000000E+00
       123       125  2.262699999999999889E+01  0.000000000000000000E+00
       123       202  2.262699999999999889E+01  0.000000000000000000E+00
       123       203  6.399999999999999710E-05  0.000000000000000000E+00
       124       115  6.399999999999999710E-05  0.000000000000000000E+00
       124       122  6.399999999999999710E-05  0.000000000000000000E+00
       124       123  6.399999999999999710E-05  0.000000000000000000E+00
       124       124 -2.184599999999999921E-04 -3.753999999999999915E+01
       124       128  6.400000000000000000E+01  0.000000000000000000E+00
       125       122  6.399999999999999710E-05  0.000000000000000000E+00
       125       123  6.399999999999999710E-05  0.000000000000000000E+00
       125       125 -6.396500000000000341E+01 -2.654400000000000048E+01
       125       182  2.262699999999999889E+01  0.000000000000000000E+00
       125       183  2.262699999999999889E+01  0.000000000000000000E+00
       126       115  6.399999999999999710E-05  0.000000000000000000E+00
       126       122  6.399999999999999710E-05  0.000000000000000000E+00
       126       126 -2.184599999999999921E-04 -3.753999999999999915E+01
       126       131  6.399999999999999710E-05  0.000000000000000000E+00
       126       133  2.262699999999999889E+01  0.000000000000000000E+00
       127       122  6.399999999999999710E-05  0.000000000000000000E+00
       127       127 -6.396500000000000341E+01 -2.654400000000000048E+01
       127       133  2.262699999999999889E+01  0.000000000000000000E+00
       127       183  2.262699999999999889E+01  0.000000000000000000E+00
       127       196  6.400000000000000000E+01  0.000000000000000000E+00
       128       119  6.400000000000000000E+01  0.000000000000000000E+00
       128       124  6.399999999999999710E-05  0.000000000000000000E+00
       128       128 -2.184600000000000080E+02  0.000000000000000000E+00
       128       203  6.399999999999999710E-05  0.000000000000000000E+00
       128       204  6.400000000000000000E+01  0.000000000000000000E+00
       129        56  6.400000000000000000E+01  0.000000000000000000E+00
       129        96  6.400000000000000000E+01  0.000000000000000000E+00
       129        97  6.400000000000000000E+01  0.000000000000000000E+00
       129       120  6.400000000000000000E+01  0.000000000000000000E+00
       129       129 -2.184600000000000080E+02  0.000000000000000000E+00
       130        93  6.400000000000000000E+01  0.000000000000000000E+00
       130        96  6.400000000000000000E+01  0.000000000000000000E+00
       130       118  6.400000000000000000E+01  0.000000000000000000E+00
       130       120  6.400000000000000000E+01  0.000000000000000000E+00
       130       130 -2.184600000000000080E+02  0.000000000000000000E+00
       131        41  2.262699999999999889E+01  0.000000000000000000E+00
       131        44  6.399999999999999710E-05  0.000000000000000000E+00
       131       121  6.400000000000000000E+01  0.000000000000000000E+00
       131       126  6.399999999999999710E-05  0.000000000000000000E+00
       131       131 -2.184599999999999921E-04 -3.753999999999999915E+01
       132        93  6.400000000000000000E+01  0.000000000000000000E+00
       132       118  6.400000000000000000E+01  0.000000000000000000E+00
       132       132 -2.184600000000000080E+02  0.000000000000000000E+00
       132       205  6.400000000000000000E+01  0.000000000000000000E+00
       132       206  6.400000000000000000E+01  0.000000000000000000E+00
       133        41  2.262699999999999889E+01  0.000000000000000000E+00
       133        42  2.262699999999999889E+01  0.000000000000000000E+00
       133       126  6.399999999999999710E-05  0.000000000000000000E+00
       133       127  2.262699999999999889E+01  0.000000000000000000E+00
       133       133 -6.396500000000000341E+01 -2.654400000000000048E+01
       134       134 -2.184600000000000080E+02  0.000000000000000000E+00
       134       142  6.400000000000000000E+01  0.000000000000000000E+00
       134       143  6.400000000000000000E+01  0.000000000000000000E+00
       134       148  6.400000000000000000E+01  0.000000000000000000E+00
       134       149  6.400000000000000000E+01  0.000000000000000000E+00
       135       135 -2.184600000000000080E+02  0.000000000000000000E+00
       135       143  6.400000000000000000E+01  0.000000000000000000E+00
       135       145  6.400000000000000000E+01  0.000000000000000000E+00
       135       146  6.400000000000000000E+01  0.000000000000000000E+00
       135       148  6.400000000000000000E+01  0.000000000000000000E+00
       136       136 -2.184600000000000080E+02  0.000000000000000000E+00
       136       141  6.400000000000000000E+01  0.000000000000000000E+00
       136       143  6.400000000000000000E+01  0.000000000000000000E+00
       136       145  6.400000000000000000E+01  0.000000000000000000E+00
       137       137 -2.184600000000000080E+02  0.000000000000000000E+00
       137       140  6.400000000000000000E+01  0.000000000000000000E+00
       137       141  6.400000000000000000E+01  0.000000000000000000E+00
       137       142  6.400000000000000000E+01  0.000000000000000000E+00
       137       143  6.400000000000000000E+01  0.000000000000000000E+00
       138       138 -2.184600000000000080E+02  0.000000000000000000E+00
       138       139  6.400000000000000000E+01  0.000000000000000000E+00
       138       140  6.400000000000000000E+01  0.000000000000000000E+00
       138       141  6.400000000000000000E+01  0.000000000000000000E+00
       139       138  6.400000000000000000E+01  0.000000000000000000E+00
       139       139 -2.184600000000000080E+02  0.000000000000000000E+00
       139       193  6.400000000000000000E+01  0.000000000000000000E+00
       139       194  6.400000000000000000E+01  0.000000000000000000E+00
       140       137  6.400000000000000000E+01  0.000000000000000000E+00
       140       138  6.400000000000000000E+01  0.000000000000000000E+00
       140       140 -2.184600000000000080E+02  0.000000000000000000E+00
       140       194  6.400000000000000000E+01  0.000000000000000000E+00
       140       195  6.400000000000000000E+01  0.000000000000000000E+00
       141       136  6.400000000000000000E+01  0.000000000000000000E+00
       141       137  6.400000000000000000E+01  0.000000000000000000E+00
       141       138  6.400000000000000000E+01  0.000000000000000000E+00
       141       141 -2.184600000000000080E+02  0.000000000000000000E+00
       142       134  6.400000000000000000E+01  0.000000000000000000E+00
       142       137  6.400000000000000000E+01  0.000000000000000000E+00
       142       142 -2.184600000000000080E+02  0.000000000000000000E+00
       142       195  6.400000000000000000E+01  0.000000000000000000E+00
       142       196  6.400000000000000000E+01  0.000000000000000000E+00
       143       134  6.400000000000000000E+01  0.000000000000000000E+00
       143       135  6.400000000000000000E+01  0.000000000000000000E+00
       143       136  6.400000000000000000E+01  0.000000000000000000E+00
       143       137  6.400000000000000000E+01  0.000000000000000000E+00
       143       143 -2.184600000000000080E+02  0.000000000000000000E+00
       144       144 -2.184600000000000080E+02  0.000000000000000000E+00
       144       145  6.400000000000000000E+01  0.000000000000000000E+00
       144       146  6.400000000000000000E+01  0.000000000000000000E+00
       144       147  6.400000000000000000E+01  0.000000000000000000E+00
       145       135  6.400000000000000000E+01  0.000000000000000000E+00
       145       136  6.400000000000000000E+01  0.000000000000000000E+00
       145       144  6.400000000000000000E+01  0.000000000000000000E+00
       145       145 -2.184600000000000080E+02  0.000000000000000000E+00
       146       135  6.400000000000000000E+01  0.000000000000000000E+00
       146       144  6.400000000000000000E+01  0.000000000000000000E+00
       146       146 -2.184600000000000080E+02  0.000000000000000000E+00
       146       190  6.400000000000000000E+01  0.000000000000000000E+00
       146       191  6.400000000000000000E+01  0.000000000000000000E+00
       147       144  6.400000000000000000E+01  0.000000000000000000E+00
       147       147 -2.184600000000000080E+02  0.000000000000000000E+00
       147       191  6.400000000000000000E+01  0.000000000000000000E+00
       147       192  6.400000000000000000E+01  0.000000000000000000E+00
       148       134  6.400000000000000000E+01  0.000000000000000000E+00
       148       135  6.400000000000000000E+01  0.000000000000000000E+00
       148       148 -2.184600000000000080E+02  0.000000000000000000E+00
       148       186  6.400000000000000000E+01  0.000000000000000000E+00
       148       190  6.400000000000000000E+01  0.000000000000000000E+00
       149       134  6.400000000000000000E+01  0.000000000000000000E+00
       149       149 -2.184600000000000080E+02  0.000000000000000000E+00
       149       183  2.262699999999999889E+01  0.000000000000000000E+00
       149       186  6.400000000000000000E+01  0.000000000000000000E+00
       149       196  6.400000000000000000E+01  0.000000000000000000E+00
       150       150 -2.184600000000000080E+02  0.000000000000000000E+00
       150       159  6.400000000000000000E+01  0.000000000000000000E+00
       150       160  6.400000000000000000E+01  0.000000000000000000E+00
       150       163  6.400000000000000000E+01  0.000000000000000000E+00
       150       164  6.400000000000000000E+01  0.000000000000000000E+00
       151       151 -2.184600000000000080E+02  0.000000000000000000E+00
       151       160  6.400000000000000000E+01  0.000000000000000000E+00
       151       161  6.400000000000000000E+01  0.000000000000000000E+00
       151       162  6.400000000000000000E+01  0.000000000000000000E+00
       151       163  6.400000000000000000E+01  0.000000000000000000E+00
       152       152 -2.184600000000000080E+02  0.000000000000000000E+00
       152       155  6.400000000000000000E+01  0.000000000000000000E+00
       152       160  6.400000000000000000E+01  0.000000000000000000E+00
       152       161  6.400000000000000000E+01  0.000000000000000000E+00
       153       153 -2.184600000000000080E+02  0.000000000000000000E+00
       153       155  6.400000000000000000E+01  0.000000000000000000E+00
       153       156  6.400000000000000000E+01  0.000000000000000000E+00
       153       159  6.400000000000000000E+01  0.000000000000000000E+00
       153       160  6.400000000000000000E+01  0.000000000000000000E+00
       154       154 -2.184600000000000080E+02  0.000000000000000000E+00
       154       156  6.400000000000000000E+01  0.000000000000000000E+00
       154       158  6.400000000000000000E+01  0.000000000000000000E+00
       154       159  6.400000000000000000E+01  0.000000000000000000E+00
       155       152  6.400000000000000000E+01  0.000000000000000000E+00
       155       153  6.400000000000000000E+01  0.000000000000000000E+00
       155       155 -2.184600000000000080E+02  0.000000000000000000E+00
       155       157  6.400000000000000000E+01  0.000000000000000000E+00
       156       153  6.400000000000000000E+01  0.000000000000000000E+00
       156       154  6.400000000000000000E+01  0.000000000000000000E+00
       156       156 -2.184600000000000080E+02  0.000000000000000000E+00
       156       157  6.400000000000000000E+01  0.000000000000000000E+00
       157       155  6.400000000000000000E+01  0.000000000000000000E+00
       157       156  6.400000000000000000E+01  0.000000000000000000E+00
       157       157 -2.184600000000000080E+02  0.000000000000000000E+00
       158       154  6.400000000000000000E+01  0.000000000000000000E+00
       158       158 -2.184600000000000080E+02  0.000000000000000000E+00
       158       170  6.400000000000000000E+01  0.000000000000000000E+00
       158       192  6.400000000000000000E+01  0.000000000000000000E+00
       159       150  6.400000000000000000E+01  0.000000000000000000E+00
       159       153  6.400000000000000000E+01  0.000000000000000000E+00
       159       154  6.400000000000000000E+01  0.000000000000000000E+00
       159       159 -2.184600000000000080E+02  0.000000000000000000E+00
       159       170  6.400000000000000000E+01  0.000000000000000000E+00
       160       150  6.400000000000000000E+01  0.000000000000000000E+00
       160       151  6.400000000000000000E+01  0.000000000000000000E+00
       160       152  6.400000000000000000E+01  0.000000000000000000E+00
       160       153  6.400000000000000000E+01  0.000000000000000000E+00
       160       160 -2.184600000000000080E+02  0.000000000000000000E+00
       161       151  6.400000000000000000E+01  0.000000000000000000E+00
       161       152  6.400000000000000000E+01  0.000000000000000000E+00
       161       161 -2.184600000000000080E+02  0.000000000000000000E+00
       161       181  6.400000000000000000E+01  0.000000000000000000E+00
       162       151  6.400000000000000000E+01  0.000000000000000000E+00
       162       162 -2.184600000000000080E+02  0.000000000000000000E+00
       162       165  6.400000000000000000E+01  0.000000000000000000E+00
       162       169  6.400000000000000000E+01  0.000000000000000000E+00
       162       181  6.400000000000000000E+01  0.000000000000000000E+00
       163       150  6.400000000000000000E+01  0.000000000000000000E+00
       163       151  6.400000000000000000E+01  0.000000000000000000E+00
       163       163 -2.184600000000000080E+02  0.000000000000000000E+00
       163       168  6.400000000000000000E+01  0.000000000000000000E+00
       163       169  6.400000000000000000E+01  0.000000000000000000E+00
       164       150  6.400000000000000000E+01  0.000000000000000000E+00
       164       164 -2.184600000000000080E+02  0.000000000000000000E+00
       164       167  6.400000000000000000E+01  0.000000000000000000E+00
       164       168  6.400000000000000000E+01  0.000000000000000000E+00
       164       170  6.400000000000000000E+01  0.000000000000000000E+00
       165       162  6.400000000000000000E+01  0.000000000000000000E+00
       165       165 -2.184600000000000080E+02  0.000000000000000000E+00
       165       174  6.400000000000000000E+01  0.000000000000000000E+00
       165       179  6.400000000000000000E+01  0.000000000000000000E+00
       165       180  6.400000000000000000E+01  0.000000000000000000E+00
       166       166 -2.184600000000000080E+02  0.000000000000000000E+00
       166       173  6.400000000000000000E+01  0.000000000000000000E+00
       166       175  6.400000000000000000E+01  0.000000000000000000E+00
       166       199  6.400000000000000000E+01  0.000000000000000000E+00
       166       200  6.400000000000000000E+01  0.000000000000000000E+00
       167       164  6.400000000000000000E+01  0.000000000000000000E+00
       167       167 -2.184600000000000080E+02  0.000000000000000000E+00
       167       171  6.400000000000000000E+01  0.000000000000000000E+00
       167       175  6.400000000000000000E+01  0.000000000000000000E+00
       167       176  6.400000000000000000E+01  0.000000000000000000E+00
       168       163  6.400000000000000000E+01  0.000000000000000000E+00
       168       164  6.400000000000000000E+01  0.000000000000000000E+00
       168       168 -2.184600000000000080E+02  0.000000000000000000E+00
       168       173  6.400000000000000000E+01  0.000000000000000000E+00
       168       175  6.400000000000000000E+01  0.000000000000000000E+00
       169       162  6.400000000000000000E+01  0.000000000000000000E+00
       169       163  6.400000000000000000E+01  0.000000000000000000E+00
       169       169 -2.184600000000000080E+02  0.000000000000000000E+00
       169       173  6.400000000000000000E+01  0.000000000000000000E+00
       169       174  6.400000000000000000E+01  0.000000000000000000E+00
       170       158  6.400000000000000000E+01  0.000000000000000000E+00
       170       159  6.400000000000000000E+01  0.000000000000000000E+00
       170       164  6.400000000000000000E+01  0.000000000000000000E+00
       170       170 -2.184600000000000080E+02  0.000000000000000000E+00
       170       171  6.400000000000000000E+01  0.000000000000000000E+00
       171       167  6.400000000000000000E+01  0.000000000000000000E+00
       171       170  6.400000000000000000E+01  0.000000000000000000E+00
       171       171 -2.184600000000000080E+02  0.000000000000000000E+00
       171       191  6.400000000000000000E+01  0.000000000000000000E+00
       171       192  6.400000000000000000E+01  0.000000000000000000E+00
       172       172 -2.184600000000000080E+02  0.000000000000000000E+00
       172       173  6.400000000000000000E+01  0.000000000000000000E+00
       172       174  6.400000000000000000E+01  0.000000000000000000E+00
       172       198  6.400000000000000000E+01  0.000000000000000000E+00
       172       199  6.400000000000000000E+01  0.000000000000000000E+00
       173       166  6.400000000000000000E+01  0.000000000000000000E+00
       173       168  6.400000000000000000E+01  0.000000000000000000E+00
       173       169  6.400000000000000000E+01  0.000000000000000000E+00
       173       172  6.400000000000000000E+01  0.000000000000000000E+00
       173       173 -2.184600000000000080E+02  0.000000000000000000E+00
       174       165  6.400000000000000000E+01  0.000000000000000000E+00
       174       169  6.400000000000000000E+01  0.000000000000000000E+00
       174       172  6.400000000000000000E+01  0.000000000000000000E+00
       174       174 -2.184600000000000080E+02  0.000000000000000000E+00
       174       185  6.400000000000000000E+01  0.000000000000000000E+00
       175       166  6.400000000000000000E+01  0.000000000000000000E+00
       175       167  6.400000000000000000E+01  0.000000000000000000E+00
       175       168  6.400000000000000000E+01  0.000000000000000000E+00
       175       175 -2.184600000000000080E+02  0.000000000000000000E+00
       175       184  6.400000000000000000E+01  0.000000000000000000E+00
       176       167  6.400000000000000000E+01  0.000000000000000000E+00
       176       176 -2.184600000000000080E+02  0.000000000000000000E+00
       176       184  6.400000000000000000E+01  0.000000000000000000E+00
       176       190  6.400000000000000000E+01  0.000000000000000000E+00
       176       191  6.400000000000000000E+01  0.000000000000000000E+00
       177       177 -2.184600000000000080E+02  0.000000000000000000E+00
       177       179  6.400000000000000000E+01  0.000000000000000000E+00
       177       197  6.400000000000000000E+01  0.000000000000000000E+00
       177       209  6.400000000000000000E+01  0.000000000000000000E+00
       177       210  6.400000000000000000E+01  0.000000000000000000E+00
       178       178 -2.184600000000000080E+02  0.000000000000000000E+00
       178       179  6.400000000000000000E+01  0.000000000000000000E+00
       178       180  6.400000000000000000E+01  0.000000000000000000E+00
       178       209  6.400000000000000000E+01  0.000000000000000000E+00
       179       165  6.400000000000000000E+01  0.000000000000000000E+00
       179       177  6.400000000000000000E+01  0.000000000000000000E+00
       179       178  6.400000000000000000E+01  0.000000000000000000E+00
       179       179 -2.184600000000000080E+02  0.000000000000000000E+00
       179       185  6.400000000000000000E+01  0.000000000000000000E+00
       180       165  6.400000000000000000E+01  0.000000000000000000E+00
       180       178  6.400000000000000000E+01  0.000000000000000000E+00
       180       180 -2.184600000000000080E+02  0.000000000000000000E+00
       180       181  6.400000000000000000E+01  0.000000000000000000E+00
       181       161  6.400000000000000000E+01  0.000000000000000000E+00
       181       162  6.400000000000000000E+01  0.000000000000000000E+00
       181       180  6.400000000000000000E+01  0.000000000000000000E+00
       181       181 -2.184600000000000080E+02  0.000000000000000000E+00
       182       125  2.262699999999999889E+01  0.000000000000000000E+00
       182       182 -6.396500000000000341E+01 -2.654400000000000048E+01
       182       188  6.400000000000000000E+01  0.000000000000000000E+00
       182       201  6.400000000000000000E+01  0.000000000000000000E+00
       182       202  2.262699999999999889E+01  0.000000000000000000E+00
       183       125  2.262699999999999889E+01  0.000000000000000000E+00
       183       127  2.262699999999999889E+01  0.000000000000000000E+00
       183       149  6.400000000000000000E+01  0.000000000000000000E+00
       183       183 -6.396500000000000341E+01 -2.654400000000000048E+01
       183       188  6.400000000000000000E+01  0.000000000000000000E+00
       184       175  6.400000000000000000E+01  0.000000000000000000E+00
       184       176  6.400000000000000000E+01  0.000000000000000000E+00
       184       184 -2.184600000000000080E+02  0.000000000000000000E+00
       184       189  6.400000000000000000E+01  0.000000000000000000E+00
       184       200  6.400000000000000000E+01  0.000000000000000000E+00
       185       174  6.400000000000000000E+01  0.000000000000000000E+00
       185       179  6.400000000000000000E+01  0.000000000000000000E+00
       185       185 -2.184600000000000080E+02  0.000000000000000000E+00
       185       197  6.400000000000000000E+01  0.000000000000000000E+00
       185       198  6.400000000000000000E+01  0.000000000000000000E+00
       186       148  6.400000000000000000E+01  0.000000000000000000E+00
       186       149  6.400000000000000000E+01  0.000000000000000000E+00
       186       186 -2.184600000000000080E+02  0.000000000000000000E+00
       186       188  6.400000000000000000E+01  0.000000000000000000E+00
       186       189  6.400000000000000000E+01  0.000000000000000000E+00
       187       187 -2.184600000000000080E+02  0.000000000000000000E+00
       187       188  6.400000000000000000E+01  0.000000000000000000E+00
       187       189  6.400000000000000000E+01  0.000000000000000000E+00
       187       200  6.400000000000000000E+01  0.000000000000000000E+00
       187       201  6.400000000000000000E+01  0.000000000000000000E+00
       188       182  2.262699999999999889E+01  0.000000000000000000E+00
       188       183  2.262699999999999889E+01  0.000000000000000000E+00
       188       186  6.400000000000000000E+01  0.000000000000000000E+00
       188       187  6.400000000000000000E+01  0.000000000000000000E+00
       188       188 -2.184600000000000080E+02  0.000000000000000000E+00
       189       184  6.400000000000000000E+01  0.000000000000000000E+00
       189       186  6.400000000000000000E+01  0.000000000000000000E+00
       189       187  6.400000000000000000E+01  0.000000000000000000E+00
       189       189 -2.184600000000000080E+02  0.000000000000000000E+00
       189       190  6.400000000000000000E+01  0.000000000000000000E+00
       190       146  6.400000000000000000E+01  0.000000000000000000E+00
       190       148  6.400000000000000000E+01  0.000000000000000000E+00
       190       176  6.400000000000000000E+01  0.000000000000000000E+00
       190       189  6.400000000000000000E+01  0.000000000000000000E+00
       190       190 -2.184600000000000080E+02  0.000000000000000000E+00
       191       146  6.400000000000000000E+01  0.000000000000000000E+00
       191       147  6.400000000000000000E+01  0.000000000000000000E+00
       191       171  6.400000000000000000E+01  0.000000000000000000E+00
       191       176  6.400000000000000000E+01  0.000000000000000000E+00
       191       191 -2.184600000000000080E+02  0.000000000000000000E+00
       192       147  6.400000000000000000E+01  0.000000000000000000E+00
       192       158  6.400000000000000000E+01  0.000000000000000000E+00
       192       171  6.400000000000000000E+01  0.000000000000000000E+00
       192       192 -2.184600000000000080E+02  0.000000000000000000E+00
       193        23  6.400000000000000000E+01  0.000000000000000000E+00
       193        36  6.400000000000000000E+01  0.000000000000000000E+00
       193       139  6.400000000000000000E+01  0.000000000000000000E+00
       193       193 -2.184600000000000080E+02  0.000000000000000000E+00
       194        36  6.400000000000000000E+01  0.000000000000000000E+00
       194        40  6.400000000000000000E+01  0.000000000000000000E+00
       194       139  6.400000000000000000E+01  0.000000000000000000E+00
       194       140  6.400000000000000000E+01  0.000000000000000000E+00
       194       194 -2.184600000000000080E+02  0.000000000000000000E+00
       195        40  6.400000000000000000E+01  0.000000000000000000E+00
       195        42  2.262699999999999889E+01  0.000000000000000000E+00
       195       140  6.400000000000000000E+01  0.000000000000000000E+00
       195       142  6.400000000000000000E+01  0.000000000000000000E+00
       195       195 -2.184600000000000080E+02  0.000000000000000000E+00
       196        42  2.262699999999999889E+01  0.000000000000000000E+00
       196       127  2.262699999999999889E+01  0.000000000000000000E+00
       196       142  6.400000000000000000E+01  0.000000000000000000E+00
       196       149  6.400000000000000000E+01  0.000000000000000000E+00
       196       196 -2.184600000000000080E+02  0.000000000000000000E+00
       197       177  6.400000000000000000E+01  0.000000000000000000E+00
       197       185  6.400000000000000000E+01  0.000000000000000000E+00
       198       172  6.400000000000000000E+01  0.000000000000000000E+00
       198       185  6.400000000000000000E+01  0.000000000000000000E+00
       199       166  6.400000000000000000E+01  0.000000000000000000E+00
       199       172  6.400000000000000000E+01  0.000000000000000000E+00
       200       166  6.400000000000000000E+01  0.000000000000000000E+00
       200       184  6.400000000000000000E+01  0.000000000000000000E+00
       200       187  6.400000000000000000E+01  0.000000000000000000E+00
       201       182  2.262699999999999889E+01  0.000000000000000000E+00
       201       187  6.400000000000000000E+01  0.000000000000000000E+00
       202       123  6.399999999999999710E-05  0.000000000000000000E+00
       202       182  2.262699999999999889E+01  0.000000000000000000E+00
       203       123  6.399999999999999710E-05  0.000000000000000000E+00
       203       128  6.400000000000000000E+01  0.000000000000000000E+00
       204       117  6.400000000000000000E+01  0.000000000000000000E+00
       204       128  6.400000000000000000E+01  0.000000000000000000E+00
       205       117  6.400000000000000000E+01  0.000000000000000000E+00
       205       132  6.400000000000000000E+01  0.000000000000000000E+00
       206        90  6.400000000000000000E+01  0.000000000000000000E+00
       206       132  6.400000000000000000E+01  0.000000000000000000E+00
       207        90  6.400000000000000000E+01  0.000000000000000000E+00
       207        91  6.400000000000000000E+01  0.000000000000000000E+00
       208        91  6.400000000000000000E+01  0.000000000000000000E+00
       208       111  6.400000000000000000E+01  0.000000000000000000E+00
       209       177  6.400000000000000000E+01  0.000000000000000000E+00
       209       178  6.400000000000000000E+01  0.000000000000000000E+00
       210       177  6.400000000000000000E+01  0.000000000000000000E+00
       211       111  6.400000000000000000E+01  0.000000000000000000E+00
       212       110  6.400000000000000000E+01  0.000000000000000000E+00
       212       111  6.400000000000000000E+01  0.000000000000000000E+00
       213       101  6.400000000000000000E+01  0.000000000000000000E+00
       213       110  6.400000000000000000E+01  0.000000000000000000E+00
       214       100  6.400000000000000000E+01  0.000000000000000000E+00
       214       101  6.400000000000000000E+01  0.000000000000000000E+00
       215       100  6.400000000000000000E+01  0.000000000000000000E+00
       215       107  6.400000000000000000E+01  0.000000000000000000E+00
       216       106  6.400000000000000000E+01  0.000000000000000000E+00
       216       107  6.400000000000000000E+01  0.000000000000000000E+00
       217        84  6.399999999999999710E-05  0.000000000000000000E+00
       217       106  6.400000000000000000E+01  0.000000000000000000E+00
       218        83  2.262699999999999889E+01  0.000000000000000000E+00
       218        84  6.399999999999999710E-05  0.000000000000000000E+00
       219        76  6.400000000000000000E+01  0.000000000000000000E+00
       219        83  2.262699999999999889E+01  0.000000000000000000E+00
       220        16  6.400000000000000000E+01  0.000000000000000000E+00
       220        76  6.400000000000000000E+01  0.000000000000000000E+00
       221         9  6.400000000000000000E+01  0.000000000000000000E+00
       221        16  6.400000000000000000E+01  0.000000000000000000E+00
       222         7  6.400000000000000000E+01  0.000000000000000000E+00
       222         9  6.400000000000000000E+01  0.000000000000000000E+00
       223         6  6.400000000000000000E+01  0.000000000000000000E+00
       223         7  6.400000000000000000E+01  0.000000000000000000E+00
       224         6  6.400000000000000000E+01  0.000000000000000000E+00
