|sol( 1)| |     1.0000000000E+00 | 
|sol( 2)| |     2.0000000000E+00 | 
|sol( 3)| |     3.0000000000E+00 | 
|sol( 4)| |     4.0000000000E+00 | 
|sol( 5)| |     5.0000000000E+00 | 
|sol( 6)| |     6.0000000000E+00 | 
|sol( 7)| |     7.0000000000E+00 | 
|sol( 8)| |     8.0000000000E+00 | 
|sol( 9)| |     9.0000000000E+00 | 
