001 R   une façon de de lancer les dés pour savoir ce qui ce qui va sortir
        00:00:00.000 - 00:00:03.015

002 B   le lancer de dés qui veut pas de 7
        00:00:03.015 - 00:00:04.748

003 O   [micro]
        00:00:03.016 - 00:00:04.233

004 Y   ça a pas marché parce qu'elle a fait un 7
        00:00:03.016 - 00:00:04.774
        (0.07)

005 R   [rire]
        00:00:04.841 - 00:00:05.414

006 O   [discussion en anglais]
        00:00:05.300 - 00:00:09.683

007 Y   (xxx) ça
        00:00:06.083 - 00:00:06.699

008 Y   (xxx)
        00:00:09.300 - 00:00:10.666

009 W   la l'avantage d'un 7 c'est (xxx) de ses petits moutons
        00:00:09.783 - 00:00:12.866

010 O   [dés]
        00:00:10.850 - 00:00:11.633
        (0.15)

011 R   ah ben c'est un 8
        00:00:13.016 - 00:00:13.833
        (0.10)

012 W   oh
        00:00:13.933 - 00:00:14.399
        (0.35)

013 B   bon ben ça je prends hein (xxx)
        00:00:14.749 - 00:00:16.816

014 W   oh non c'est encore plus triste
        00:00:14.817 - 00:00:17.188
        (0.03)

015 Y   ah je l'ai bien pensé tiens
        00:00:17.216 - 00:00:19.100

016 R   ah oui oui non ça c'est non c'est vraiment nul
        00:00:17.759 - 00:00:20.194

017 B   encore des moutons
        00:00:18.366 - 00:00:19.633

018 W   oui
        00:00:20.061 - 00:00:20.594
        (0.29)

019 R   c'est vraiment nul
        00:00:20.882 - 00:00:21.876
        (0.77)

020 R   moi je voulais mes 2 moutons
        00:00:22.642 - 00:00:23.880

021 Y   c'est vrai que ça aurait mis 6 moutons en jeu
        00:00:23.497 - 00:00:27.885

022 W   ben
        00:00:23.750 - 00:00:24.100

023 B   mais du coup j'ai quand même des petits projets
        00:00:25.015 - 00:00:27.891

024 R   mouais
        00:00:25.833 - 00:00:26.349

025 W   4
        00:00:26.857 - 00:00:27.487
        (0.36)

026 W   je j'ai que des petits villages moi
        00:00:28.249 - 00:00:30.216

027 Y   (xxx) moutons ?
        00:00:28.683 - 00:00:29.324

028 B   oui
        00:00:29.602 - 00:00:30.377
        (0.29)

029 Y   (xxx)
        00:00:30.664 - 00:00:31.785

030 B   étonnamment
        00:00:30.733 - 00:00:31.756

031 W   (xxx)
        00:00:31.047 - 00:00:31.733
        (0.05)

032 O   [discussion en anglais]
        00:00:31.830 - 00:00:47.483

033 B   est-ce que je peux avoir du bois ? s'il te plaît
        00:00:33.376 - 00:00:36.971

034 R   tu peux
        00:00:36.376 - 00:00:37.173

035 R   voilà le bois
        00:00:38.666 - 00:00:39.840

036 B   euh merci (xxx) je fais n'importe quoi
        00:00:40.072 - 00:00:42.970

037 W   fait avec des moutons qu'elle nous a volés
        00:00:40.337 - 00:00:42.171

038 B   est-ce que quelqu'un aimerait échanger euh quelqu'un aimerait des moutons ? tu parlais de moutons
        00:00:43.086 - 00:00:47.994

039 R   ah si tu veux j'ai 3 moutons contre 3 moutons [rire] ah 3 moutons contre 4 moutons [rire]
        00:00:47.897 - 00:00:54.289

040 W   ben j'aimerais bien des moutons mais
        00:00:48.594 - 00:00:50.956

041 W   j'ai bien peur de n'avoir littéralement rien à offrir
        00:00:53.318 - 00:00:55.942

042 B   ah oui effectivement
        00:00:55.746 - 00:00:57.739
        (0.12)

043 B   est-ce que tu veux des moutons JAUNE ?
        00:00:57.859 - 00:00:59.646

044 Y   non
        00:00:59.072 - 00:00:59.652
        (0.06)

045 W   1 mouton un petit [pron p'tit] mouton c'est mignon
        00:00:59.713 - 00:01:02.175

046 Y   hum non
        00:01:01.132 - 00:01:02.175
        (0.22)

047 W   2 moutons alors ?
        00:01:02.397 - 00:01:03.478
        (1.03)

048 Y   contre quoi euh ?
        00:01:04.513 - 00:01:05.495
        (0.05)

049 B   ah non ben 2 hein j'ai jamais dit ça c'est pas moi qui parle
        00:01:05.540 - 00:01:08.788

050 W   [rire]
        00:01:06.825 - 00:01:07.307
        (0.54)

051 Y   contre quoi au juste ?
        00:01:09.329 - 00:01:10.745

052 B   ben moi 1 mouton contre du foin blé ou que sais-je
        00:01:09.963 - 00:01:15.165

053 Y   (xxx)
        00:01:14.954 - 00:01:15.990
        (1.38)

054 R   hé nope
        00:01:17.366 - 00:01:18.376

055 B   t'es sûr ?
        00:01:17.513 - 00:01:18.174

056 Y   (xxx)
        00:01:18.190 - 00:01:19.287

057 B   mais et contre euh (xxx)
        00:01:18.990 - 00:01:22.807
        (0.24)

058 R   contre rien est-ce que tu donnerais du blé ? [rire]
        00:01:23.045 - 00:01:27.339

059 Y   voilà c'est ça
        00:01:24.073 - 00:01:25.211
        (0.45)

060 R   franchement ça te permettrait d'éviter de perdre des cartes
        00:01:27.785 - 00:01:31.554

061 W   (xxx)
        00:01:30.633 - 00:01:32.357

062 R   c'est à moi du coup ?
        00:01:32.129 - 00:01:32.995
        (1.26)

063 B   pourquoi j'ai pas continué cette route ? c'était (xxx) que j'étais capable de faire (xxx)
        00:01:34.253 - 00:01:38.605

064 W   ts
        00:01:36.145 - 00:01:37.108

065 R   du coup c'est bon ou ?
        00:01:38.357 - 00:01:39.660

066 B   oui oui pardon c'est bon tu peux y aller je je fais que me plaindre
        00:01:39.148 - 00:01:42.385

067 R   non c'est pas grave
        00:01:39.981 - 00:01:40.816

068 O   [dés]
        00:01:40.274 - 00:01:42.396
        (0.09)

069 W   oui
        00:01:42.490 - 00:01:43.421

070 R   6 alors 6 1 bois ici et alors là mais non c'est nul
        00:01:42.999 - 00:01:48.390

071 W   ça c'est bien ça me fait oublier la tristesse des moutons
        00:01:44.308 - 00:01:46.757

072 Y   (xxx)
        00:01:46.858 - 00:01:47.478
        (0.49)

073 Y   (xxx)
        00:01:48.877 - 00:01:49.701
        (0.34)

074 R   hop hop
        00:01:50.038 - 00:01:51.271

075 B   merci
        00:01:51.271 - 00:01:52.294

076 R   est-ce que quelqu'un veut des moutons ? non ?
        00:01:51.954 - 00:01:54.027
        (0.03)

077 Y   non
        00:01:54.056 - 00:01:54.637

078 B   (xxx)
        00:01:54.486 - 00:01:55.229
        (0.03)

079 W   ah j'aimerais bien des moutons mais (xxx) plus
        00:01:55.257 - 00:01:57.857

080 R   2 moutons contre 1 pierre et 1 de paille
        00:01:57.706 - 00:02:00.541
        (0.68)

081 W   tu sais ce que tu viens de me donner ?
        00:02:01.222 - 00:02:02.571

082 R   je sais
        00:02:02.571 - 00:02:03.742
        (0.19)

083 R   tiens
        00:02:03.937 - 00:02:04.386

084 W   tu sais qu'il y a ni l'un ni l'autre dedans
        00:02:04.329 - 00:02:06.204
        (1.33)

085 O   [dés]
        00:02:07.534 - 00:02:08.733
        (0.32)

086 Y   6
        00:02:09.053 - 00:02:09.728

087 R   non mais non c'est pas possible ça
        00:02:09.386 - 00:02:11.709
        (0.93)

088 R   oh là là
        00:02:12.640 - 00:02:13.408

089 W   [soupir] mais si
        00:02:12.665 - 00:02:14.880
        (1.33)

090 R   ça m'arrange pas du tout ça
        00:02:16.207 - 00:02:17.461

091 B   merci
        00:02:16.415 - 00:02:17.054

092 Y   alors
        00:02:17.223 - 00:02:18.094
        (1.38)

093 Y   si quelqu'un veut de l'argile euh
        00:02:19.473 - 00:02:21.104
        (0.28)

094 B   [rire]
        00:02:21.389 - 00:02:22.636

095 R   [rire]
        00:02:21.484 - 00:02:22.191
        (0.23)

096 W   euh moi je vais faire 2 routes
        00:02:22.869 - 00:02:25.037

097 Y   toi t'as eu euh t'as ce qu'il te faut là
        00:02:23.070 - 00:02:24.595
        (0.84)

098 R   oh
        00:02:25.875 - 00:02:26.337

099 Y   1 2 3 4 5 6 ah c'est moi 6 d'abord
        00:02:26.353 - 00:02:30.219
        (1.52)

100 R   ouais on a égalité là
        00:02:31.743 - 00:02:33.213

101 Y   je suis pas je ne suis pas encore inquiété
        00:02:32.878 - 00:02:35.060

102 O   [discussion en anglais]
        00:02:33.668 - 00:02:41.309

103 R   t'as pas voulu passer là
        00:02:37.567 - 00:02:40.353

104 B   oh (xxx)
        00:02:40.939 - 00:02:42.197

105 W   pour aller où ? en vrai je partirais d'ici si je voulais passer là
        00:02:41.309 - 00:02:44.822
        (0.28)

106 R   ah ouais et puis t'as le port des 3 mou(interrup-)
        00:02:45.103 - 00:02:47.251

107 B   oh mais je suis tellement bête
        00:02:45.687 - 00:02:47.472
        (0.93)

108 B   j'avais pas vu que j'avais accédé à ce truc-là
        00:02:48.397 - 00:02:51.272

109 Y   (xxx)
        00:02:49.191 - 00:02:50.535

110 W   ah non pardon (xxx) fini je suis désolée
        00:02:49.352 - 00:02:51.221

111 O   [dés]
        00:02:50.989 - 00:02:52.393

112 R   c'était ton plan initial
        00:02:52.401 - 00:02:54.576

113 Y   5
        00:02:53.069 - 00:02:53.610
        (0.06)

114 R   5 alors oh 2 pierres pour moi oui
        00:02:54.635 - 00:02:58.242

115 W   et 2 moutons pour toi
        00:02:58.104 - 00:02:59.356

116 Y   et euh 2 moutons
        00:02:58.414 - 00:02:59.707

117 R   et 2 moutons et oh 1 pierre là
        00:02:59.053 - 00:03:01.534

118 B   [bb]
        00:02:59.424 - 00:03:00.141

119 W   et 1 pierre pour moi
        00:02:59.959 - 00:03:00.979

120 W   merci
        00:03:01.049 - 00:03:01.640

121 Y   (xxx)
        00:03:01.087 - 00:03:02.757

122 B   tu vas te faire harceler en terme de troc
        00:03:01.553 - 00:03:03.857

123 R   et 1 mou(interrup-) et 2 moutons pour moi ah ben voilà qui veut des moutons ?
        00:03:02.050 - 00:03:06.292

124 Y   incroyable
        00:03:04.121 - 00:03:04.808

125 Y   ah tu (xxx) là
        00:03:05.959 - 00:03:07.191

126 B   oh bah non
        00:03:06.727 - 00:03:07.282
        (0.35)

127 R   [rire]
        00:03:07.635 - 00:03:08.382
        (0.38)

128 B   mets de la pierre [rire]
        00:03:08.767 - 00:03:10.447

129 R   [rire]
        00:03:09.850 - 00:03:10.620
        (0.31)

130 B   contre des moutons
        00:03:10.933 - 00:03:11.923

131 Y   hum
        00:03:11.430 - 00:03:11.943
        (1.33)

132 R   là c'est négociable
        00:03:13.271 - 00:03:14.551
        (0.24)

133 R   mais pas des moutons
        00:03:14.792 - 00:03:16.228

134 B   c'est vrai ?
        00:03:15.035 - 00:03:15.447

135 B   oh
        00:03:15.624 - 00:03:16.005
        (0.99)

136 B   tu veux quoi ?
        00:03:17.214 - 00:03:17.946

137 R   ah ça dépend
        00:03:17.254 - 00:03:18.277
        (1.12)

138 R   ah oui c'est vrai que t'as 3 3 moutons (xxx)
        00:03:19.395 - 00:03:22.005

139 B   (xxx) commencer les négociations ici mon tour est bientôt arrivé
        00:03:20.405 - 00:03:23.498

140 R   [rire]
        00:03:23.323 - 00:03:24.160

141 B   tu veux tu veux de l'argile ? ça peut marcher aussi
        00:03:23.541 - 00:03:25.765
        (0.42)

142 R   euh de la paille moi
        00:03:26.181 - 00:03:28.279
        (0.41)

143 B   oh le seul truc que j'ai pas
        00:03:28.691 - 00:03:30.283

144 Y   je vais m'assurer encore un peu j'échange ça contre 1 bois
        00:03:29.705 - 00:03:33.440
        (0.39)

145 R   il va construire une route
        00:03:33.826 - 00:03:35.536

146 Y   je vais construire une route
        00:03:34.100 - 00:03:35.358
        (0.37)

147 W   ts
        00:03:35.903 - 00:03:36.256

148 Y   je m'assure encore 1 tour
        00:03:35.978 - 00:03:37.182

149 R   mouais
        00:03:37.048 - 00:03:37.475
        (0.48)

150 W   hum
        00:03:37.957 - 00:03:38.161
        (1.14)

151 Y   (xxx)
        00:03:39.301 - 00:03:40.957
        (2.38)

152 Y   euh
        00:03:43.332 - 00:03:44.246
        (5.43)

153 Y   puis je vais changer ça je vais le mettre
        00:03:49.679 - 00:03:53.462
        (0.08)

154 W   ça c'est une excellente idée jeune homme
        00:03:53.537 - 00:03:55.245

155 Y   ici
        00:03:55.150 - 00:03:55.660
        (0.05)

156 R   pff
        00:03:55.712 - 00:03:56.314
        (0.50)

157 R   oh non
        00:03:56.811 - 00:03:57.632
        (0.05)

158 Y   (xxx)
        00:03:57.682 - 00:03:58.982

159 W   c'est bête j'étais en train de vouloir dire que je (xxx)
        00:03:58.867 - 00:04:02.179

160 Y   toute façon ah oui je vole 1 carte
        00:03:59.943 - 00:04:02.537

161 O   [discussion en anglais]
        00:04:01.856 - 00:04:15.346

162 Y   je sais plus ce qu'elle a
        00:04:06.099 - 00:04:07.446

163 R   ah parce que tu pourrais le savoir ?
        00:04:07.517 - 00:04:09.050

164 Y   je devrais le savoir
        00:04:08.935 - 00:04:09.935

165 R   [rire]
        00:04:09.881 - 00:04:10.881

166 B   elle a toujours des moutons
        00:04:12.892 - 00:04:13.892

167 W   et tu peux aussi piocher chez lui hein
        00:04:14.597 - 00:04:16.532

168 Y   oui mais il y a un 5 il y a un 5 qui vient de tomber en fait donc je sais
        00:04:14.644 - 00:04:18.064

169 R   ben oui c'est pour ça [rire] (xxx)
        00:04:16.895 - 00:04:21.323

170 Y   donc je sais (xxx)
        00:04:18.960 - 00:04:20.410

171 W   donc voilà
        00:04:19.179 - 00:04:20.179

172 Y   euh je vais piocher chez toi
        00:04:21.123 - 00:04:22.784
        (0.04)

173 R   si tu veux des moutons c'est là alors
        00:04:22.827 - 00:04:24.748

174 Y   c'est sûr
        00:04:24.718 - 00:04:25.230

175 W   oh bah c'est sûr
        00:04:24.971 - 00:04:25.971
        (0.04)

176 Y   disons que moi j'ai aucune hum moyen d'avoir des moutons à part ça donc euh
        00:04:26.007 - 00:04:29.050

177 W   libérer les moutons
        00:04:27.418 - 00:04:29.582
        (0.77)

178 Y   ça m'arrange (xxx)
        00:04:30.353 - 00:04:31.877
        (0.77)

179 W   tu veux des moutons ?
        00:04:32.651 - 00:04:33.651
        (1.31)

180 R   c'est bon du coup ?
        00:04:34.962 - 00:04:35.962

181 Y   ah j'ai aucun moyen d'en d'en avoir autrement
        00:04:35.142 - 00:04:37.575

182 W   ouais
        00:04:36.679 - 00:04:37.057
        (0.09)

183 R   (xxx) ou 2 argiles aussi
        00:04:37.669 - 00:04:40.064

184 Y   (xxx) en avoir
        00:04:37.877 - 00:04:38.697

185 Y   tiens
        00:04:40.004 - 00:04:40.509
        (8.01)

186 B   ah ben de toute façon [pron t'façon]  faut que je joue donc
        00:04:48.519 - 00:04:50.383

187 O   [dés]
        00:04:50.189 - 00:04:51.353
        (0.29)

188 R   4 euh 4 il y a rien là et là oh là là
        00:04:51.640 - 00:04:55.496

189 W   4
        00:04:51.834 - 00:04:52.366

190 B   hum hum
        00:04:52.034 - 00:04:53.022

191 Y   (xxx)
        00:04:54.474 - 00:04:55.071

192 W   ts [rire]
        00:04:55.388 - 00:04:56.122

193 R   3 blés
        00:04:55.683 - 00:04:56.402
        (0.88)

194 R   ouille ouille ouille ouille ouille ouille il est bien parti quand même
        00:04:57.286 - 00:05:00.175

195 O   [discussion en anglais]
        00:04:59.387 - 00:05:26.100

196 W   ah j'avais jamais tilté que c'était pas la même couleur là et là
        00:05:01.632 - 00:05:05.081

197 R   de quoi ?
        00:05:05.529 - 00:05:06.119

198 W   eh j'étais persuadée que c'était du bleu qui (xxx) mais en fait non pas du tout
        00:05:06.588 - 00:05:11.487

199 R   (xxx)
        00:05:11.886 - 00:05:12.526

200 B   que faire que faire ?
        00:05:12.860 - 00:05:14.653

201 Y   au départ c'était le bleu
        00:05:14.088 - 00:05:15.161

202 R   hum
        00:05:15.833 - 00:05:16.215

203 Y   avec le (xxx)
        00:05:15.911 - 00:05:16.808

204 W   ah c'est pour ça que j'ai confondu
        00:05:16.457 - 00:05:18.178

205 R   mais il est pas trop tombé le 11
        00:05:16.750 - 00:05:18.705

206 Y   et après j'ai construit 2 villes là donc
        00:05:17.604 - 00:05:20.210

207 W   il est toujours plus tombé que le 3
        00:05:20.044 - 00:05:21.514

208 R   le 3 n'est pas tombé [rire]
        00:05:22.795 - 00:05:24.426

209 W   hum c'est pour ça que je (xxx) remarque le 2 n'est jamais tombé non plus
        00:05:23.799 - 00:05:27.250

210 R   [toux]
        00:05:25.685 - 00:05:26.317

211 O   [discussion en anglais]
        00:05:27.126 - 00:05:57.867

212 R   non
        00:05:27.615 - 00:05:28.262

213 W   le 12 est déjà tombé 2 fois
        00:05:28.582 - 00:05:29.806

214 B   du coup j'aimerais bien 1 euh je peux prendre 1 blé avec ça ?
        00:05:28.707 - 00:05:32.180

215 R   non faut que tu mettes une colonie d'abord
        00:05:33.295 - 00:05:35.837

216 B   c'est ça ?
        00:05:33.437 - 00:05:34.222

217 B   oh
        00:05:36.419 - 00:05:36.931

218 W   et c'est pas comme ça en fait c'est 2 blés contre n'importe quelle ressource
        00:05:36.794 - 00:05:39.808

219 R   [rire]
        00:05:36.970 - 00:05:38.779

220 B   ah bon ?
        00:05:40.280 - 00:05:40.926

221 W   (xxx) c'est pour ça que je veux des moutons tout le temps
        00:05:40.361 - 00:05:42.936

222 R   oui
        00:05:40.926 - 00:05:41.365

223 B   hum hum
        00:05:42.936 - 00:05:43.745

224 W   c'est pour ça que lui il échange des pierres (xxx)
        00:05:43.382 - 00:05:45.343

225 R   hum hum
        00:05:43.594 - 00:05:44.614

226 B   ben
        00:05:48.572 - 00:05:49.307

227 B   je vais me morfondre alors
        00:05:49.750 - 00:05:51.250

228 B   oui je (xxx)
        00:05:54.860 - 00:05:57.269

229 R   tu veux pas échanger ?
        00:05:57.555 - 00:05:58.935
        (1.24)

230 B   bah [pf] personne veut jamais échanger avec moi
        00:06:00.170 - 00:06:03.264

231 R   de quoi ?
        00:06:02.926 - 00:06:03.680
        (0.24)

232 W   si t'as pas de but pour les échanges n'échange pas
        00:06:03.923 - 00:06:06.200
        (0.19)

233 W   tu vas plus arranger les autres que tu vas (xxx)
        00:06:06.385 - 00:06:09.010

234 B   ouais c'est ça
        00:06:07.904 - 00:06:08.885

235 O   [discussion en anglais]
        00:06:08.730 - 00:06:10.770

236 W   et je ne dis pas ça parce que j'ai pas (xxx)
        00:06:10.734 - 00:06:12.626

237 R   si t'as d(interrup-) si t'as
        00:06:11.763 - 00:06:13.109

238 Y   sauf si t'échanges avec la banque
        00:06:12.252 - 00:06:13.574

239 B   non mais en plus
        00:06:12.561 - 00:06:13.560
        (0.10)

240 R   si t'as de la paille moi ça m'intéresse
        00:06:13.672 - 00:06:15.331

241 W   oui
        00:06:14.011 - 00:06:14.369

242 B   non non je j'en cherche hum de toute urgence
        00:06:15.231 - 00:06:18.279

243 R   non ?
        00:06:15.963 - 00:06:16.315

244 R   ah
        00:06:17.370 - 00:06:17.710

245 O   [dés]
        00:06:17.609 - 00:06:19.845
        (1.04)

246 R   4 mais non c'est pas possible ça
        00:06:20.887 - 00:06:22.747
        (0.52)

247 R   oh là là bon t'as de la paille toi [rire]
        00:06:23.269 - 00:06:26.650

248 W   [rire]
        00:06:23.517 - 00:06:24.170

249 W   (xxx)
        00:06:25.012 - 00:06:26.233
        (0.65)

250 R   alors euh comment dire ?
        00:06:27.296 - 00:06:30.046

251 Y   donc je sais quoi jeter si euh
        00:06:28.693 - 00:06:30.776
        (0.93)

252 R   2 pailles contre 2 moutons ?
        00:06:31.703 - 00:06:33.018
        (1.22)

253 Y   non
        00:06:34.238 - 00:06:34.709
        (0.31)

254 R   quoi?
        00:06:35.015 - 00:06:35.351
        (1.80)

255 Y   (xxx) des moutons déjà
        00:06:37.150 - 00:06:38.920
        (1.16)

256 R   hum
        00:06:40.078 - 00:06:40.538
        (0.11)

257 Y   (xxx) moutons
        00:06:40.651 - 00:06:41.940
        (1.26)

258 R   euh
        00:06:43.203 - 00:06:44.298
        (5.33)

259 R   ts ça m'arrange pas si tu dis non [rire]
        00:06:49.632 - 00:06:54.048
        (0.75)

260 R   euh
        00:06:54.793 - 00:06:55.445
        (1.17)

261 Y   après euh (xxx) donner 1 paille contre 1 pierre
        00:06:56.615 - 00:06:59.716
        (2.32)

262 R   1 paille contre 1 pierre
        00:07:02.031 - 00:07:03.428
        (0.30)

263 Y   ouais
        00:07:03.724 - 00:07:04.093
        (5.99)

264 O   [discussion en anglais]
        00:07:10.079 - 00:07:19.236

265 R   mouais non
        00:07:10.999 - 00:07:12.221

266 R   hum
        00:07:15.328 - 00:07:15.868

267 R   2 pailles contre 2 moutons et 1 pierre
        00:07:18.939 - 00:07:21.466
        (2.96)

268 W   attends c'est qui qui donne la p(interrup-)
        00:07:24.425 - 00:07:25.305

269 Y   oui
        00:07:24.618 - 00:07:24.952
        (0.03)

270 W   ah c'est lui
        00:07:25.334 - 00:07:26.015
        (3.08)

271 R   hop
        00:07:29.094 - 00:07:29.635
        (1.45)

272 R   hop
        00:07:31.080 - 00:07:31.853
        (1.66)

273 R   est-ce que c'est intelligent ce que j'ai fait ? [rire]
        00:07:33.513 - 00:07:37.693

274 W   très franchement j'aimerais que ça ne le soit pas mais
        00:07:37.054 - 00:07:39.527

275 R   je vais prendre 1 carte développement
        00:07:39.283 - 00:07:40.770
        (0.74)

276 O   [discussions]
        00:07:41.506 - 00:07:48.541

277 R   donc pitié que ce soit ce que je veux hein
        00:07:43.432 - 00:07:45.824

278 R   euh si par contre ça on va pas se gêner
        00:07:45.906 - 00:07:48.021

279 W   non
        00:07:48.455 - 00:07:49.466

280 R   [rire]
        00:07:49.466 - 00:07:50.105

281 B   [rire]
        00:07:49.587 - 00:07:50.343

282 R   euh tu ah non non non il y a pas le la moitié des cartes avec celui-là
        00:07:50.162 - 00:07:54.040
        (0.08)

283 W   mais c'est pas très très gentil
        00:07:54.121 - 00:07:55.716

284 Y   heureusement
        00:07:54.522 - 00:07:55.254

285 R   hum ouais
        00:07:55.391 - 00:07:56.229
        (3.07)

286 Y   eh oui
        00:07:59.297 - 00:07:59.905
        (1.41)

287 R   ça m'arrange pas
        00:08:01.315 - 00:08:02.108
        (0.59)

288 R   1 mouton contre 1 pierre quelqu'un ?
        00:08:02.702 - 00:08:04.436
        (0.94)

289 W   c'est qui qui donne le mouton c'est qui qui donne la pierre ?
        00:08:05.374 - 00:08:07.187

290 B   ouais
        00:08:06.520 - 00:08:06.906
        (0.42)

291 R   euh moi je donne le mouton
        00:08:07.603 - 00:08:08.584
        (0.57)

292 B   non [rire]
        00:08:09.150 - 00:08:10.186
        (0.71)

293 R   oh mais j'aurais dû prendre toi je sais ce que t'as oh c'est nul
        00:08:10.898 - 00:08:13.873
        (0.39)

294 Y   hum c'est vrai que elle a qu'1 carte et on sait ce que c'est et en plus c'est que tu voulais
        00:08:14.264 - 00:08:18.729

295 R   non mais je suis trop nul
        00:08:14.948 - 00:08:16.178

296 R   ben oui oui en plus c'est tr(interrup-) ben oui c'est triste
        00:08:16.626 - 00:08:20.233
        (0.26)

297 R   c'est triste j'ai pas réfléchi
        00:08:20.498 - 00:08:21.871

298 W   heureusement que tu n'as pas un deuxième chevalier
        00:08:21.871 - 00:08:23.659
        (0.06)

299 R   ouais
        00:08:23.717 - 00:08:24.265
        (0.09)

300 W   est-ce que tu as de quoi faire un deuxième chevalier ?
        00:08:24.354 - 00:08:26.083
        (0.77)

301 W   enfin potentiel deuxième chevalier
        00:08:26.854 - 00:08:28.479

302 R   joue [rire]
        00:08:28.201 - 00:08:30.037

303 O   [dés]
        00:08:30.037 - 00:08:31.320
        (0.62)

304 W   oui
        00:08:31.941 - 00:08:32.594
        (0.09)

305 R   [rire]
        00:08:32.683 - 00:08:34.460

306 W   j'ai du de la paille
        00:08:33.656 - 00:08:35.239
        (0.33)

307 Y   alors j'ai 2 pailles aussi et (xxx)
        00:08:35.572 - 00:08:38.031

308 W   (xxx)
        00:08:35.637 - 00:08:36.075

309 R   oh là là oh là là et moi je me fais encore avoir oh là là
        00:08:36.906 - 00:08:41.093

310 Y   moi je croule sous la paille
        00:08:39.135 - 00:08:41.302

311 B   merci
        00:08:39.488 - 00:08:40.084

312 W   c'est trop cool
        00:08:41.124 - 00:08:42.786

313 R   et moi je suis sur la paille moi [rire]
        00:08:42.786 - 00:08:45.046
        (1.03)

314 Y   alors
        00:08:46.073 - 00:08:46.669

315 R   bon
        00:08:46.406 - 00:08:46.802
        (0.28)

316 B   hum
        00:08:47.079 - 00:08:47.558

317 R   oh qu'est-ce tu fais avec ta paille ? [rire] t'es content (xxx)
        00:08:47.510 - 00:08:51.270
        (0.59)

318 W   ben
        00:08:51.859 - 00:08:52.933

319 R   1 paille contre 1 mouton ? euh 1 pierre contre 1 mouton ? ah bah non
        00:08:52.531 - 00:08:56.124
        (0.88)

320 W   est-ce que quelqu'un voudrait de la paille ?
        00:08:56.999 - 00:08:58.760
        (0.74)

321 R   [rire] moi j'en veux bien hein
        00:08:59.502 - 00:09:03.285

322 Y   oui moi bien sûr
        00:09:00.499 - 00:09:01.645

323 W   [rire]
        00:09:01.523 - 00:09:02.476

324 Y   (xxx)
        00:09:02.572 - 00:09:03.399
        (1.10)

325 W   ouais mais contre quoi ?
        00:09:04.494 - 00:09:05.491
        (1.64)

326 R   2 pailles contre 1 mouton
        00:09:07.128 - 00:09:08.355
        (0.36)

327 W   non par contre 1 paille contre 2 moutons ça peut être négociable
        00:09:08.714 - 00:09:11.602

328 R   pff
        00:09:11.464 - 00:09:11.962
        (0.39)

329 B   [rire]
        00:09:12.352 - 00:09:12.953

330 W   ok ok
        00:09:12.920 - 00:09:13.592

331 R   [n]
        00:09:13.592 - 00:09:14.063
        (0.48)

332 W   tant pis pour toi
        00:09:14.547 - 00:09:15.641

333 R   ouais
        00:09:15.641 - 00:09:16.037
        (0.52)

334 R   ah suivant
        00:09:16.561 - 00:09:17.442
        (0.31)

335 W   vas-y
        00:09:17.750 - 00:09:18.447
        (0.62)

336 W   tu peux y aller
        00:09:19.071 - 00:09:20.045
        (0.29)

337 W   (xxx) tu es une tête de mouton
        00:09:20.336 - 00:09:22.832

338 O   [dés]
        00:09:20.793 - 00:09:22.178
        (0.04)

339 R   7 ah ça c'est bien ça
        00:09:22.873 - 00:09:25.370

340 Y   1 2 3 4 5 6 7 8 9 10 11
        00:09:24.006 - 00:09:27.609

341 W   ça c'est triste c'est à ton tour en plus
        00:09:24.928 - 00:09:27.140

342 R   11 ça fait 5
        00:09:27.555 - 00:09:29.018

343 Y   (xxx) 5
        00:09:27.691 - 00:09:29.304

344 W   ouais
        00:09:29.090 - 00:09:29.437
        (0.18)

345 R   ah ça c'est bien [rire]
        00:09:29.615 - 00:09:32.021

346 W   en fait ça devrait être un don généreux aux personnes (xxx)
        00:09:31.740 - 00:09:34.449

347 B   et quand on a 7 pile poil ?
        00:09:32.936 - 00:09:35.150
        (0.51)

348 W   c'est bon
        00:09:35.660 - 00:09:36.320
        (0.29)

349 B   c'est vrai ?
        00:09:36.614 - 00:09:37.366
        (0.44)

350 W   bah on avait dit oui
        00:09:37.804 - 00:09:38.646
        (0.04)

351 R   ouais je crois ouais
        00:09:38.683 - 00:09:39.552

352 Y   on en a combien ?
        00:09:38.913 - 00:09:39.866

353 R   allez on va dire oui
        00:09:39.754 - 00:09:40.772
        (1.28)

354 Y   parce qu'elle en a 7 ?
        00:09:42.057 - 00:09:42.983

355 R   on va dire 7 on va dire 7
        00:09:42.513 - 00:09:44.222

356 B   oui hum hum
        00:09:43.120 - 00:09:43.759
        (0.11)

357 W   7 pile poil
        00:09:44.330 - 00:09:45.333
        (0.38)

358 Y   j'aurais dit non mais on va suivre les règles de la majorité
        00:09:45.717 - 00:09:49.379

359 W   (xxx)
        00:09:47.454 - 00:09:47.992

360 W   c'est toi qui as les règles
        00:09:48.539 - 00:09:49.455
        (0.66)

361 B   [rire] mais non
        00:09:50.113 - 00:09:52.156

362 R   je vais regarder
        00:09:50.720 - 00:09:51.795

363 R   voleur
        00:09:52.089 - 00:09:52.524
        (0.28)

364 W   j'aime bien passer pour (xxx)
        00:09:52.807 - 00:09:54.426

365 R   euh
        00:09:54.426 - 00:09:54.965
        (0.79)

366 Y   alors j'échange ça contre 1 carte développement
        00:09:55.754 - 00:09:57.719

367 R   euh euh euh
        00:09:57.031 - 00:09:58.414
        (1.07)

368 W   ah
        00:09:59.486 - 00:09:59.983
        (0.44)

369 R   euh
        00:10:00.422 - 00:10:01.713
        (3.44)

370 Y   et je euh vais utiliser
        00:10:05.153 - 00:10:07.957

371 B   je crois qu'on avait dit plus que 7
        00:10:07.000 - 00:10:08.623
        (0.65)

372 R   oh c'est c'est pas grave on va faire comme ça
        00:10:09.277 - 00:10:12.137

373 W   mais mais mais non mais qu'est-ce que t'as contre les pauvres moutons ?
        00:10:10.906 - 00:10:14.081

374 B   après on se met d'accord (xxx)
        00:10:13.957 - 00:10:16.641

375 Y   et euh
        00:10:14.606 - 00:10:15.256

376 O   [discussion en anglais]
        00:10:15.354 - 00:10:24.320

377 R   ah c'est ça celui qui possède plus que 7 cartes
        00:10:24.320 - 00:10:26.808
        (0.13)

378 W   plus c'est strictement supérieur du coup
        00:10:26.938 - 00:10:29.292

379 B   ah on est bon
        00:10:27.237 - 00:10:28.008

380 R   c'est bon
        00:10:28.630 - 00:10:29.051

381 Y   d'accord
        00:10:29.143 - 00:10:29.610

382 B   parfait
        00:10:29.324 - 00:10:29.888
        (1.31)

383 Y   euh je vais réutiliser ça pour 1 carte développement
        00:10:31.196 - 00:10:34.017

384 W   c'est bien parce que du coup il a même pas vu que tu l'avais pris
        00:10:33.957 - 00:10:35.923

385 R   c'est
        00:10:34.561 - 00:10:34.982
        (0.20)

386 R   si si j'ai vu et en plus il a pris celle qu'il fallait pas
        00:10:36.119 - 00:10:39.393

387 B   hum hum
        00:10:36.404 - 00:10:37.083

388 Y   hop
        00:10:39.165 - 00:10:39.736
        (0.46)

389 R   oh là là mais il est à 9 ?
        00:10:40.194 - 00:10:42.046

390 Y   comme ça
        00:10:40.282 - 00:10:41.017

391 W   [rire]
        00:10:40.603 - 00:10:41.288
        (0.99)

392 Y   et ça et je vais prendre ça
        00:10:43.040 - 00:10:45.585

393 W   ah mais c'est pour ça
        00:10:43.580 - 00:10:44.846
        (0.60)

394 R   ah wow wow wow wow wow wow attends 1 2 3 4 5 6 7 8 9 ok
        00:10:46.184 - 00:10:51.837

395 Y   j'suis à 9
        00:10:49.347 - 00:10:50.093
        (0.05)

396 R   bon il va falloir prendre le la route ou euh ou les chevaliers mais les chevaliers ça va être compliqué
        00:10:51.891 - 00:10:56.615

397 W   hum
        00:10:52.111 - 00:10:52.521
        (0.20)

398 W   euh t'es plus proche d'avoir les chevaliers c'est toi qui as déjà dépensé pour les chevaliers
        00:10:56.811 - 00:11:00.350

399 Y   euh
        00:10:58.367 - 00:10:58.880
        (0.30)

400 B   merci
        00:11:00.650 - 00:11:01.650

401 R   attends (xxx) encore
        00:11:01.512 - 00:11:03.062

402 Y   (xxx)
        00:11:01.768 - 00:11:03.053

403 W   je t'échange chaque ressource que tu veux contre 3 moutons
        00:11:01.793 - 00:11:04.140

404 R   il te reste des cartes ?
        00:11:04.023 - 00:11:04.887
        (0.12)

405 Y   il m'en reste 2
        00:11:05.008 - 00:11:05.665
        (0.22)

406 R   oh là là
        00:11:05.886 - 00:11:06.642

407 Y   on va plus euh vouloir m'échanger quoi que ce soit
        00:11:06.642 - 00:11:08.911

408 R   [rire]
        00:11:08.765 - 00:11:09.636
        (0.26)

409 B   vous avez fini le troc ?
        00:11:09.894 - 00:11:11.151

410 Y   (xxx)
        00:11:11.155 - 00:11:11.571

411 R   (xxx)
        00:11:11.317 - 00:11:11.703

412 W   tu peux y aller
        00:11:11.462 - 00:11:12.094

413 B   c'est bon ?
        00:11:11.919 - 00:11:12.373

414 O   [dés]
        00:11:12.254 - 00:11:13.516
        (0.43)

415 B   (xxx)
        00:11:13.942 - 00:11:14.844

416 Y   8
        00:11:14.720 - 00:11:15.275

417 R   8 ah
        00:11:14.791 - 00:11:15.987

418 W   oui
        00:11:15.364 - 00:11:15.869

419 B   oui c'est très bien
        00:11:15.582 - 00:11:17.116

420 R   alors 2 moutons à droite
        00:11:16.131 - 00:11:17.589

421 Y   ah j'aurais dû commencer par (xxx)
        00:11:17.167 - 00:11:19.282

422 B   ah c'est exactement ce qu'il me fallait
        00:11:18.323 - 00:11:19.932

423 R   2 moutons à gauche et 2 moutons ici
        00:11:19.105 - 00:11:21.616

424 O   [discussions]
        00:11:20.126 - 00:11:32.137

425 W   c'est vrai que j'ai 2 moutons
        00:11:22.555 - 00:11:23.864

426 B   je mets une colonie
        00:11:24.241 - 00:11:26.230

427 B   là
        00:11:29.863 - 00:11:30.615

428 Y   est-ce que tu as assez de paille pour
        00:11:31.193 - 00:11:31.898

429 B   euh hum bah non mais [pf] je
        00:11:31.818 - 00:11:35.443

430 R   maintenant il va falloir les transformer en ville ts
        00:11:32.580 - 00:11:34.951
        (2.64)

431 B   qu'est-ce que j'ai envie de faire en fait ?
        00:11:38.085 - 00:11:39.824
        (0.05)

432 R   [toux]
        00:11:39.874 - 00:11:40.455
        (2.68)

433 B   donc là c'est 2 pailles contre un truc ça ne me sert à rien
        00:11:43.136 - 00:11:46.590
        (1.48)

434 B   est-ce que quelqu'un veut des moutons ?
        00:11:48.066 - 00:11:50.319
        (0.68)

435 R   contre des moutons ? [rire]
        00:11:50.997 - 00:11:52.810

436 W   alors je dirais bien que oui mais
        00:11:51.131 - 00:11:53.083
        (0.56)

437 Y   non
        00:11:53.641 - 00:11:54.204
        (0.03)

438 W   mais contre quoi tu les donnes ?
        00:11:54.234 - 00:11:56.108
        (0.70)

439 B   bah en fait c'est soit des m(interrup-) enfin
        00:11:56.813 - 00:11:59.123
        (0.45)

440 B   j'aimerais de la paille [rire] (0.6s) et de la pierre
        00:11:59.574 - 00:12:03.517
        (1.76)

441 W   tu as combien de moutons ?
        00:12:05.278 - 00:12:06.552
        (1.04)

442 B   tu aimerais combien de moutons ? [rire]
        00:12:07.597 - 00:12:09.300
        (1.30)

443 W   on il y a jamais trop de moutons
        00:12:10.596 - 00:12:12.375

444 B   (xxx) [rire]
        00:12:11.183 - 00:12:13.046
        (0.87)

445 W   je suis en train de réfléchir si c'est intelligent je suis pas sûre
        00:12:13.916 - 00:12:16.703
        (2.07)

446 W   ouais non c'est pas assez
        00:12:18.777 - 00:12:20.141

447 B   t'aurais quoi de la paille ou de la pierre ? ouais
        00:12:18.892 - 00:12:20.998
        (0.40)

448 W   non non désolée
        00:12:21.397 - 00:12:22.677
        (0.96)

449 O   [dés]
        00:12:23.638 - 00:12:29.705

450 R   je me permets
        00:12:25.172 - 00:12:26.000

451 W   tu devrais avoir honte
        00:12:27.459 - 00:12:28.390

452 R   [toux]
        00:12:29.367 - 00:12:30.505
        (0.39)

453 R   8 mais non
        00:12:30.898 - 00:12:32.645

454 W   ouais des moutons
        00:12:32.160 - 00:12:33.747
        (0.14)

455 R   j'en ai marre des moutons j'ai pas le port des moutons c'est horrible
        00:12:33.892 - 00:12:37.814

456 B   hum hum hum
        00:12:34.115 - 00:12:36.053
        (0.57)

457 W   tu peux faire des dons désintéressés de moutons
        00:12:38.384 - 00:12:40.699
        (0.22)

458 W   à au joueur qui a la couleur la plus proche des moutons
        00:12:40.920 - 00:12:43.639

459 B   [rire]
        00:12:41.057 - 00:12:41.770

460 Y   (xxx)
        00:12:41.620 - 00:12:42.287

461 R   est-ce que quelqu'un a de la paille ou de la pierre contre des moutons ?
        00:12:42.954 - 00:12:46.160
        (0.47)

462 W   contre combien de moutons ?
        00:12:46.626 - 00:12:47.699
        (0.31)

463 R   je sais pas euh 3 moutons contre 1 paille et 1 pierre
        00:12:48.011 - 00:12:51.321

464 B   (xxx)
        00:12:49.114 - 00:12:50.862

465 W   [rire] (xxx)
        00:12:49.275 - 00:12:49.666

466 Y   elles ont toutes les 2 des moutons mais
        00:12:50.224 - 00:12:52.582

467 W   ou 1 pierre tu veux dire
        00:12:51.524 - 00:12:52.871
        (0.18)

468 R   non hum
        00:12:53.050 - 00:12:54.204

469 W   non alors
        00:12:54.011 - 00:12:54.873
        (0.76)

470 Y   c'est vrai que toi t'as le port des moutons
        00:12:55.636 - 00:12:57.237

471 R   4 moutons contre 1 paille et 1 pierre
        00:12:55.971 - 00:12:58.310
        (0.18)

472 W   ou 1 pierre tu veux dire
        00:12:58.494 - 00:12:59.793

473 R   non mais eh ça te fait ça te fait 2 ressources de ton choix (xxx)
        00:12:59.361 - 00:13:02.898

474 B   haha
        00:13:00.632 - 00:13:01.655

475 W   oui non merci c'est gentil
        00:13:02.135 - 00:13:03.927
        (0.10)

476 R   t'en veux pas ?
        00:13:04.030 - 00:13:04.838
        (0.27)

477 W   (xxx)
        00:13:05.104 - 00:13:05.651
        (0.35)

478 O   [discussion en anglais]
        00:13:06.006 - 00:13:16.638

479 R   non ?
        00:13:09.421 - 00:13:09.768

480 Y   non
        00:13:09.912 - 00:13:10.287

481 Y   j'ai que 2 euh (0.5s) 2 cartes (xxx)
        00:13:11.115 - 00:13:13.778

482 W   j'ai pile poil 7 cartes moi tout va bien (xxx)
        00:13:13.410 - 00:13:15.852

483 R   quelqu'un a de l'argile ou de la pierre ou du bois ?
        00:13:16.259 - 00:13:18.788
        (0.16)

484 W   hum
        00:13:18.947 - 00:13:19.577
        (0.22)

485 B   j'ai de l'argile
        00:13:19.801 - 00:13:20.954
        (0.73)

486 Y   ça fait longtemps que c'est pas tombé hein
        00:13:21.684 - 00:13:22.936

487 R   1 mouton contre 1 d'argile ?
        00:13:22.948 - 00:13:24.159

488 B   que veux-tu ?
        00:13:22.980 - 00:13:23.906

489 B   oh
        00:13:24.148 - 00:13:24.664

490 W   ts [rire]
        00:13:24.234 - 00:13:24.859

491 B   ah quoique
        00:13:24.738 - 00:13:25.921

492 O   [discussion en anglais]
        00:13:25.564 - 00:13:38.694

493 Y   (xxx) reçu 4 moutons récemment
        00:13:27.308 - 00:13:29.803

494 B   mais ça peut m'intéresser (xxx)
        00:13:30.207 - 00:13:32.907

495 R   mouais parce que 3 (interrup-)
        00:13:32.353 - 00:13:34.050

496 B   ouais ouais ouais
        00:13:33.424 - 00:13:34.535

497 R   hop
        00:13:35.163 - 00:13:35.729

498 B   merci
        00:13:36.686 - 00:13:37.464

499 R   alors ça et 4 moutons pour faire 1 bois ça me fait une route
        00:13:37.373 - 00:13:43.098
        (2.18)

500 R   va falloir lui prendre 2 points comme ça [rire]
        00:13:45.275 - 00:13:48.536

501 Y   bref
        00:13:48.376 - 00:13:48.874
        (1.01)

502 R   hop
        00:13:49.881 - 00:13:50.524

503 O   [discussions]
        00:13:50.178 - 00:13:52.297
        (0.05)

504 O   [dés]
        00:13:52.347 - 00:13:53.895
        (0.19)

505 R   combien ?
        00:13:54.086 - 00:13:54.470

506 W   6
        00:13:54.470 - 00:13:55.105

507 Y   6
        00:13:54.527 - 00:13:55.080

508 R   6 alors 1 bois ici et 1 d'argile pour tout le monde
        00:13:55.040 - 00:14:00.030

509 Y   (xxx)
        00:13:55.972 - 00:13:56.709
        (0.56)

510 Y   (xxx)
        00:14:00.593 - 00:14:01.507
        (0.07)

511 R   oui
        00:14:01.578 - 00:14:02.109
        (0.84)

512 W   c'est ça (xxx) quand on aura plus les cartes
        00:14:02.953 - 00:14:05.609
        (0.05)

513 R   le problème c'est que si (xxx)
        00:14:05.655 - 00:14:08.767

514 W   attends ça euh ça ruine mes trucs
        00:14:05.859 - 00:14:08.421
        (1.09)

515 B   est-ce que quelqu'un peut faire un 11 ?
        00:14:09.852 - 00:14:11.895
        (0.33)

516 R   [rire]
        00:14:12.227 - 00:14:13.515

517 B   ça commence à bien faire
        00:14:13.008 - 00:14:14.624
        (1.12)

518 R   je crois qu'il y en a eu 1
        00:14:15.742 - 00:14:17.373

519 Y   (xxx) 11
        00:14:16.687 - 00:14:17.828
        (2.16)

520 R   je crois qu'y en a eu 1 en début de partie ouais
        00:14:19.984 - 00:14:22.687

521 B   ouais je crois qu'il y en a eu 1 au final hein ouais
        00:14:20.609 - 00:14:22.578

522 Y   non y en a eu plusieurs
        00:14:22.427 - 00:14:23.783

523 W   je réfléchis pardon
        00:14:22.515 - 00:14:23.921
        (0.55)

524 B   euh
        00:14:24.468 - 00:14:25.218

525 R   je suis pas sûr que t'as eu 3 pierres toi t'as pas eu les 3 pierres
        00:14:24.821 - 00:14:28.454

526 Y   ah non non j'ai pas eu je si j'ai eu 1 fois 3 pierres je crois
        00:14:25.206 - 00:14:29.168
        (0.43)

527 R   ah j'aurais dit 2 c'est pas quand il y avait la ville encore mais
        00:14:29.602 - 00:14:32.823
        (0.25)

528 Y   ah peut-être ouais
        00:14:33.078 - 00:14:33.968
        (0.09)

529 R   hum
        00:14:34.058 - 00:14:34.493
        (0.56)

530 Y   ou alors j'ai eu euh plusieurs pierres d'un coup
        00:14:35.051 - 00:14:37.918
        (1.73)

531 W   eh pou pou pou
        00:14:39.652 - 00:14:42.786
        (0.59)

532 W   je suis désolée
        00:14:43.377 - 00:14:44.323
        (2.05)

533 W   je réfléchis
        00:14:46.368 - 00:14:47.351
        (3.83)

534 W   je vais construire une carte développement
        00:14:51.183 - 00:14:52.786
        (0.05)

535 R   mouais
        00:14:52.840 - 00:14:53.538
        (0.17)

536 O   [discussions]
        00:14:53.713 - 00:15:15.519

537 W   là
        00:14:59.250 - 00:14:59.812
        (0.42)

538 W   euh je construis un village
        00:15:15.937 - 00:15:17.140
        (1.42)

539 R   (xxx)
        00:15:18.562 - 00:15:19.373

540 W   vous noterez la (0.6s) que ce village n'est pas basé uniquement sur les moutons
        00:15:19.374 - 00:15:22.969

541 R   [rire]
        00:15:22.969 - 00:15:24.437

542 B   [rire]
        00:15:23.005 - 00:15:24.170
        (2.00)

543 R   tu feras gaffe tu ne peux plus construire de ville
        00:15:26.437 - 00:15:28.140
        (0.25)

544 W   oui
        00:15:28.390 - 00:15:28.906
        (1.98)

545 Y   tu veux échanger non ?
        00:15:30.890 - 00:15:31.906
        (0.08)

546 W   non pardon à toi
        00:15:31.984 - 00:15:33.078
        (0.34)

547 O   [dés]
        00:15:33.421 - 00:15:34.906
        (1.23)

548 Y   10
        00:15:36.140 - 00:15:36.593
        (0.29)

549 W   oh parfait
        00:15:36.885 - 00:15:38.223

550 R   10 alors
        00:15:37.000 - 00:15:38.187
        (0.65)

551 R   1 pierre ici 2 pierres à droite
        00:15:38.873 - 00:15:41.532
        (0.19)

552 B   merci
        00:15:41.718 - 00:15:42.203

553 Y   et 1 d'argile pour euh (0.8s) 2 argiles
        00:15:42.085 - 00:15:44.937

554 R   2 argiles pour moi oui
        00:15:43.281 - 00:15:45.562
        (0.56)

555 R   1 d'argile à gauche et 1 là-bas
        00:15:46.122 - 00:15:48.656
        (1.23)

556 Y   alors
        00:15:49.884 - 00:15:50.759
        (2.56)

557 R   faut pas qu'il construise une ville faut pas qu'il construise une ville
        00:15:53.317 - 00:15:56.221

558 Y   vais changer euh 2 argiles contre euh 1 pierre
        00:15:55.338 - 00:15:58.697
        (1.03)

559 R   hop
        00:15:59.730 - 00:16:00.230
        (0.19)

560 Y   et je vais miser le tout pour le tout
        00:16:00.423 - 00:16:02.615

561 B   ça sent la ville ça sent la ville
        00:16:00.931 - 00:16:03.974

562 W   ah
        00:16:03.543 - 00:16:03.966
        (0.53)

563 Y   1 point de victoire j'ai gagné
        00:16:04.508 - 00:16:06.029
        (0.08)

564 R   oh non
        00:16:06.112 - 00:16:06.827

565 B   oh purée
        00:16:06.328 - 00:16:07.811

566 W   j'avais fait des efforts hein je lui en avais volé 1 mais
        00:16:06.826 - 00:16:09.329

567 Y   j'ai tout misé
        00:16:08.708 - 00:16:09.772
        (0.14)

568 R   [rire] non
        00:16:09.909 - 00:16:12.478

569 Y   (xxx)
        00:16:10.268 - 00:16:11.949

570 W   joli
        00:16:11.846 - 00:16:12.329
        (0.44)

571 R   j'aurais pu récupérer la route au prochain tour quoi
        00:16:12.918 - 00:16:15.380

572 Y   (xxx) ça marche
        00:16:15.320 - 00:16:16.805
        (2.29)

573 W   c'est vrai c'est dommage hein
        00:16:19.097 - 00:16:21.031
        (0.32)

574 R   personne n'a voulu me donner de quoi faire une route
        00:16:21.352 - 00:16:23.784

575 O   [toc]
        00:16:21.818 - 00:16:22.308

576 Y   je le savais que
        00:16:23.171 - 00:16:23.880
        (0.14)

577 W   mais t'aurais pu dire eh c'est pour lui ôter la victoire tu vois
        00:16:24.018 - 00:16:27.669

578 R   mouais
        00:16:27.669 - 00:16:28.453

579 Y   ça ça rentre dans la négociation
        00:16:27.978 - 00:16:29.607

580 R   ouais
        00:16:29.607 - 00:16:30.215

581 W   oui c'est ça
        00:16:29.684 - 00:16:30.721
        (0.63)

582 R   ouais
        00:16:31.354 - 00:16:32.095

583 O   [discussion en anglais]
        00:16:31.823 - 00:16:33.582
        (0.14)

584 O   [micro]
        00:16:33.724 - 00:16:34.374
        (0.31)

585 R   (xxx)
        00:16:34.689 - 00:16:35.998

586 O   [discussion en anglais]
        00:16:35.414 - 00:16:37.348

587 W   eh oui
        00:16:36.223 - 00:16:36.805

588 R   une carte
        00:16:37.059 - 00:16:37.925

589 O   [jetons]
        00:16:37.377 - 00:16:38.974

590 W   mais il avait la plus grande rou(interrup-)
        00:16:38.004 - 00:16:38.974

