<?xml version="1.0" encoding="UTF-8" standalone="no"?>
<!-- Created with Inkscape (http://www.inkscape.org/) -->

<svg
   xmlns:dc="http://purl.org/dc/elements/1.1/"
   xmlns:cc="http://creativecommons.org/ns#"
   xmlns:rdf="http://www.w3.org/1999/02/22-rdf-syntax-ns#"
   xmlns:svg="http://www.w3.org/2000/svg"
   xmlns="http://www.w3.org/2000/svg"
   xmlns:xlink="http://www.w3.org/1999/xlink"
   xmlns:sodipodi="http://sodipodi.sourceforge.net/DTD/sodipodi-0.dtd"
   xmlns:inkscape="http://www.inkscape.org/namespaces/inkscape"
   version="1.1"
   width="171.87048mm"
   height="83.191101mm"
   id="svg2"
   inkscape:version="0.92.4 (5da689c313, 2019-01-14)"
   sodipodi:docname="block.svg"
   inkscape:export-filename="/home/locandrade/IRISA/Cours Parallèlisme/block.png"
   inkscape:export-xdpi="110"
   inkscape:export-ydpi="110">
  <sodipodi:namedview
     pagecolor="#ffffff"
     bordercolor="#666666"
     borderopacity="1"
     objecttolerance="10"
     gridtolerance="10"
     guidetolerance="10"
     inkscape:pageopacity="0"
     inkscape:pageshadow="2"
     inkscape:window-width="1920"
     inkscape:window-height="1016"
     id="namedview7243"
     showgrid="false"
     inkscape:zoom="0.7671156"
     inkscape:cx="812.87245"
     inkscape:cy="116.72836"
     inkscape:window-x="0"
     inkscape:window-y="27"
     inkscape:window-maximized="1"
     inkscape:current-layer="svg2"
     fit-margin-top="0"
     fit-margin-left="0"
     fit-margin-right="0"
     fit-margin-bottom="0" />
  <defs
     id="defs4">
    <inkscape:perspective
       sodipodi:type="inkscape:persp3d"
       inkscape:vp_x="0 : 561.25983 : 1"
       inkscape:vp_y="0 : 1066.6667 : 0"
       inkscape:vp_z="793.70078 : 561.25983 : 1"
       inkscape:persp3d-origin="396.85039 : 374.17322 : 1"
       id="perspective7245" />
    <linearGradient
       id="linearGradient6899">
      <stop
         id="stop6901"
         style="stop-color:#2ece2a;stop-opacity:1"
         offset="0" />
      <stop
         id="stop6903"
         style="stop-color:#2ece2a;stop-opacity:0"
         offset="1" />
    </linearGradient>
    <marker
       refX="0"
       refY="0"
       orient="auto"
       id="Arrow2Lend"
       style="overflow:visible">
      <path
         d="M 8.7185878,4.0337352 -2.2072895,0.01601326 8.7185884,-4.0017078 c -1.7454984,2.3720609 -1.7354408,5.6174519 -6e-7,8.035443 z"
         transform="matrix(-1.1,0,0,-1.1,-1.1,0)"
         id="path5894"
         style="fill-rule:evenodd;stroke-width:0.625;stroke-linejoin:round"
         inkscape:connector-curvature="0" />
    </marker>
    <marker
       refX="0"
       refY="0"
       orient="auto"
       id="Arrow1Lend"
       style="overflow:visible">
      <path
         d="M 0,0 5,-5 -12.5,0 5,5 Z"
         transform="matrix(-0.8,0,0,-0.8,-10,0)"
         id="path5876"
         style="fill-rule:evenodd;stroke:#000000;stroke-width:1.00000003pt"
         inkscape:connector-curvature="0" />
    </marker>
    <marker
       refX="0"
       refY="0"
       orient="auto"
       id="Arrow1Mend"
       style="overflow:visible">
      <path
         d="M 0,0 5,-5 -12.5,0 5,5 Z"
         transform="matrix(-0.4,0,0,-0.4,-4,0)"
         id="path5882"
         style="fill-rule:evenodd;stroke:#000000;stroke-width:1.00000003pt"
         inkscape:connector-curvature="0" />
    </marker>
    <linearGradient
       id="linearGradient5426">
      <stop
         id="stop5428"
         style="stop-color:#008000;stop-opacity:1"
         offset="0" />
      <stop
         id="stop5430"
         style="stop-color:#008000;stop-opacity:0"
         offset="1" />
    </linearGradient>
    <linearGradient
       id="linearGradient5412">
      <stop
         id="stop5414"
         style="stop-color:#000000;stop-opacity:1"
         offset="0" />
    </linearGradient>
    <linearGradient
       id="linearGradient3966">
      <stop
         id="stop3968"
         style="stop-color:#000000;stop-opacity:1"
         offset="0" />
      <stop
         id="stop3970"
         style="stop-color:#000000;stop-opacity:0"
         offset="1" />
    </linearGradient>
    <linearGradient
       x1="171.16568"
       y1="408.01724"
       x2="210.55321"
       y2="408.01724"
       id="linearGradient5436"
       xlink:href="#linearGradient5426"
       gradientUnits="userSpaceOnUse" />
    <linearGradient
       x1="670.21674"
       y1="532.21942"
       x2="678.60437"
       y2="532.21942"
       id="linearGradient6907"
       xlink:href="#linearGradient6899"
       gradientUnits="userSpaceOnUse" />
    <linearGradient
       inkscape:collect="always"
       xlink:href="#linearGradient5426"
       id="linearGradient2269"
       gradientUnits="userSpaceOnUse"
       x1="171.16568"
       y1="408.01724"
       x2="210.55321"
       y2="408.01724" />
    <linearGradient
       inkscape:collect="always"
       xlink:href="#linearGradient5426"
       id="linearGradient2271"
       gradientUnits="userSpaceOnUse"
       x1="171.16568"
       y1="408.01724"
       x2="210.55321"
       y2="408.01724" />
    <linearGradient
       inkscape:collect="always"
       xlink:href="#linearGradient5426"
       id="linearGradient2273"
       gradientUnits="userSpaceOnUse"
       x1="171.16568"
       y1="408.01724"
       x2="210.55321"
       y2="408.01724" />
    <linearGradient
       inkscape:collect="always"
       xlink:href="#linearGradient5426"
       id="linearGradient2275"
       gradientUnits="userSpaceOnUse"
       x1="171.16568"
       y1="408.01724"
       x2="210.55321"
       y2="408.01724" />
    <linearGradient
       inkscape:collect="always"
       xlink:href="#linearGradient5426"
       id="linearGradient2277"
       gradientUnits="userSpaceOnUse"
       x1="171.16568"
       y1="408.01724"
       x2="210.55321"
       y2="408.01724" />
    <linearGradient
       inkscape:collect="always"
       xlink:href="#linearGradient5426"
       id="linearGradient2279"
       gradientUnits="userSpaceOnUse"
       x1="171.16568"
       y1="408.01724"
       x2="210.55321"
       y2="408.01724" />
    <linearGradient
       inkscape:collect="always"
       xlink:href="#linearGradient6899"
       id="linearGradient2281"
       gradientUnits="userSpaceOnUse"
       x1="670.21674"
       y1="532.21942"
       x2="678.60437"
       y2="532.21942" />
    <linearGradient
       inkscape:collect="always"
       xlink:href="#linearGradient6899"
       id="linearGradient2283"
       gradientUnits="userSpaceOnUse"
       x1="670.21674"
       y1="532.21942"
       x2="678.60437"
       y2="532.21942" />
    <linearGradient
       inkscape:collect="always"
       xlink:href="#linearGradient6899"
       id="linearGradient2285"
       gradientUnits="userSpaceOnUse"
       x1="670.21674"
       y1="532.21942"
       x2="678.60437"
       y2="532.21942" />
    <linearGradient
       inkscape:collect="always"
       xlink:href="#linearGradient6899"
       id="linearGradient2287"
       gradientUnits="userSpaceOnUse"
       x1="670.21674"
       y1="532.21942"
       x2="678.60437"
       y2="532.21942" />
    <linearGradient
       inkscape:collect="always"
       xlink:href="#linearGradient6899"
       id="linearGradient2289"
       gradientUnits="userSpaceOnUse"
       x1="670.21674"
       y1="532.21942"
       x2="678.60437"
       y2="532.21942" />
    <linearGradient
       inkscape:collect="always"
       xlink:href="#linearGradient6899"
       id="linearGradient2291"
       gradientUnits="userSpaceOnUse"
       x1="670.21674"
       y1="532.21942"
       x2="678.60437"
       y2="532.21942" />
  </defs>
  <metadata
     id="metadata7">
    <rdf:RDF>
      <cc:Work
         rdf:about="">
        <dc:format>image/svg+xml</dc:format>
        <dc:type
           rdf:resource="http://purl.org/dc/dcmitype/StillImage" />
        <dc:title></dc:title>
      </cc:Work>
    </rdf:RDF>
  </metadata>
  <g
     id="layer1"
     transform="translate(-36.018402,-346.7778)">
    <g
       id="g5648"
       style="fill:none;stroke:none">
      <path
         d="m 677.53583,516.13969 8.07179,-0.11963 v -5.9348 l -8.07179,0.1895 z"
         id="path5660"
         style="fill:#e9e9ff;fill-rule:evenodd;stroke:none"
         inkscape:connector-curvature="0" />
      <path
         d="m 518.74267,492.18328 v -19.85726 l 158.79316,37.94874 v 5.86493 z"
         id="path5650"
         style="fill:#353564;fill-rule:evenodd;stroke:none"
         inkscape:connector-curvature="0" />
      <path
         d="m 518.74267,472.32602 21.53621,-2.23586 145.32874,39.9951 -8.07179,0.1895 z"
         id="path5658"
         style="fill:#afafde;fill-rule:evenodd;stroke:none"
         inkscape:connector-curvature="0" />
      <path
         d="m 518.74267,492.18328 21.53621,-1.41146 145.32874,25.24824 -8.07179,0.11963 z"
         id="path5652"
         style="fill:#4d4d9f;fill-rule:evenodd;stroke:none"
         inkscape:connector-curvature="0" />
      <path
         d="m 540.27888,490.77182 v -20.68166 l 145.32874,39.9951 v 5.9348 z"
         id="path5656"
         style="fill:#d7d7ff;fill-rule:evenodd;stroke:none"
         inkscape:connector-curvature="0" />
      <path
         d="m 518.74267,492.18328 21.53621,-1.41146 v -20.68166 l -21.53621,2.23586 z"
         id="path5654"
         style="fill:#8686bf;fill-rule:evenodd;stroke:none"
         inkscape:connector-curvature="0" />
    </g>
    <g
       id="g3896"
       style="fill:none;stroke:none">
      <path
         d="m 515.91577,491.67032 22.60139,-1.51186 v -20.68508 l -22.60139,2.38 z"
         id="path3908"
         style="fill:#e9e9ff;fill-rule:evenodd;stroke:none"
         inkscape:connector-curvature="0" />
      <path
         d="m 447.32849,481.29687 v -25.77363 l 68.58728,16.33014 v 19.81694 z"
         id="path3898"
         style="fill:#353564;fill-rule:evenodd;stroke:none"
         inkscape:connector-curvature="0" />
      <path
         d="m 447.32849,455.52324 25.82728,-4.07955 65.36139,18.02969 -22.60139,2.38 z"
         id="path3906"
         style="fill:#afafde;fill-rule:evenodd;stroke:none"
         inkscape:connector-curvature="0" />
      <path
         d="m 447.32849,481.29687 25.82728,-2.59146 65.36139,11.45305 -22.60139,1.51186 z"
         id="path3900"
         style="fill:#4d4d9f;fill-rule:evenodd;stroke:none"
         inkscape:connector-curvature="0" />
      <path
         d="m 473.15577,478.70541 v -27.26172 l 65.36139,18.02969 v 20.68508 z"
         id="path3904"
         style="fill:#d7d7ff;fill-rule:evenodd;stroke:none"
         inkscape:connector-curvature="0" />
      <path
         d="m 447.32849,481.29687 25.82728,-2.59146 v -27.26172 l -25.82728,4.07955 z"
         id="path3902"
         style="fill:#8686bf;fill-rule:evenodd;stroke:none"
         inkscape:connector-curvature="0" />
    </g>
    <g
       id="g3074"
       style="fill:none;stroke:none">
      <path
         d="m 442.83564,480.76699 28.37207,-2.90964 v -27.47977 l -28.37207,4.56423 z"
         id="path3086"
         style="fill:#e9e9ff;fill-rule:evenodd;stroke:none"
         inkscape:connector-curvature="0" />
      <path
         d="m 368.28295,469.52834 v -32.21615 l 74.55269,17.62962 v 25.82518 z"
         id="path3076"
         style="fill:#353564;fill-rule:evenodd;stroke:none"
         inkscape:connector-curvature="0" />
      <path
         d="m 368.28295,437.31219 29.90896,-7.21721 73.0158,20.2826 -28.37207,4.56423 z"
         id="path3084"
         style="fill:#afafde;fill-rule:evenodd;stroke:none"
         inkscape:connector-curvature="0" />
      <path
         d="m 368.28295,469.52834 29.90896,-4.60088 73.0158,12.92989 -28.37207,2.90964 z"
         id="path3078"
         style="fill:#4d4d9f;fill-rule:evenodd;stroke:none"
         inkscape:connector-curvature="0" />
      <path
         d="m 398.19191,464.92746 v -34.83248 l 73.0158,20.2826 v 27.47977 z"
         id="path3082"
         style="fill:#d7d7ff;fill-rule:evenodd;stroke:none"
         inkscape:connector-curvature="0" />
      <path
         d="m 368.28295,469.52834 29.90896,-4.60088 v -34.83248 l -29.90896,7.21721 z"
         id="path3080"
         style="fill:#8686bf;fill-rule:evenodd;stroke:none"
         inkscape:connector-curvature="0" />
    </g>
    <g
       id="g3001"
       style="fill:none;stroke:none">
      <path
         d="m 363.57267,469.04356 32.97154,-5.18167 v -33.96938 l -32.97154,8.00613 z"
         id="path3013"
         style="fill:#e9e9ff;fill-rule:evenodd;stroke:none"
         inkscape:connector-curvature="0" />
      <path
         d="m 265.16007,454.26635 v -39.1998 l 98.4126,22.83209 v 31.14492 z"
         id="path3003"
         style="fill:#353564;fill-rule:evenodd;stroke:none"
         inkscape:connector-curvature="0" />
      <path
         d="m 265.16007,415.06655 30.99274,-12.98741 100.3914,27.81337 -32.97154,8.00613 z"
         id="path3011"
         style="fill:#afafde;fill-rule:evenodd;stroke:none"
         inkscape:connector-curvature="0" />
      <path
         d="m 265.16007,454.26635 30.99274,-8.40562 100.3914,18.00116 -32.97154,5.18167 z"
         id="path3005"
         style="fill:#4d4d9f;fill-rule:evenodd;stroke:none"
         inkscape:connector-curvature="0" />
      <path
         d="m 296.15281,445.86073 v -43.78159 l 100.3914,27.81337 v 33.96938 z"
         id="path3009"
         style="fill:#d7d7ff;fill-rule:evenodd;stroke:none"
         inkscape:connector-curvature="0" />
      <path
         d="m 265.16007,454.26635 30.99274,-8.40562 v -43.78159 l -30.99274,12.98741 z"
         id="path3007"
         style="fill:#8686bf;fill-rule:evenodd;stroke:none"
         inkscape:connector-curvature="0" />
    </g>
    <g
       id="g3938"
       style="fill:url(#linearGradient5436);fill-opacity:1;fill-rule:nonzero;stroke:#000000;stroke-opacity:1">
      <path
         d="m 184.78425,395.65165 25.26895,-17.84969 v 52.91536 l -25.26895,11.48409 z"
         id="path3950"
         style="fill:url(#linearGradient2269);fill-opacity:1;fill-rule:nonzero;stroke:#000000;stroke-opacity:1"
         inkscape:connector-curvature="0" />
      <path
         d="m 171.66568,392.59009 v 47.64159 l 13.11857,1.96973 v -46.54976 z"
         id="path3940"
         style="fill:url(#linearGradient2271);fill-opacity:1;fill-rule:nonzero;stroke:#000000;stroke-opacity:1"
         inkscape:connector-curvature="0" />
      <path
         d="m 171.66568,392.59009 24.10292,-18.757 14.2846,3.96887 -25.26895,17.84969 z"
         id="path3942"
         style="fill:url(#linearGradient2273);fill-opacity:1;fill-rule:nonzero;stroke:#000000;stroke-opacity:1"
         inkscape:connector-curvature="0" />
      <path
         d="m 171.66568,440.23168 24.10292,-12.06783 14.2846,2.55347 -25.26895,11.48409 z"
         id="path3948"
         style="fill:url(#linearGradient2275);fill-opacity:1;fill-rule:nonzero;stroke:#000000;stroke-opacity:1"
         inkscape:connector-curvature="0" />
      <path
         d="m 195.7686,373.83309 v 54.33076 l 14.2846,2.55347 v -52.91536 z"
         id="path3946"
         style="fill:url(#linearGradient2277);fill-opacity:1;fill-rule:nonzero;stroke:#000000;stroke-opacity:1"
         inkscape:connector-curvature="0" />
      <path
         d="m 171.66568,392.59009 24.10292,-18.757 v 54.33076 l -24.10292,12.06783 z"
         id="path3944"
         style="fill:url(#linearGradient2279);fill-opacity:1;fill-rule:nonzero;stroke:#000000;stroke-opacity:1"
         inkscape:connector-curvature="0" />
    </g>
    <g
       id="g2987"
       style="opacity:0.4587814;fill:none;stroke:none">
      <path
         d="m 262.39594,454.11493 31.40583,-8.62551 v -44.205 l -31.40583,13.35079 z"
         id="path2999"
         style="fill:#e9e9ff;fill-rule:evenodd;stroke:none"
         inkscape:connector-curvature="0" />
      <path
         d="m 143.25531,436.29049 v -49.24442 l 119.14063,27.58914 v 39.47972 z"
         id="path2989"
         style="fill:#353564;fill-rule:evenodd;stroke:none"
         inkscape:connector-curvature="0" />
      <path
         d="m 143.25531,387.04607 22.03929,-21.40539 128.50717,35.64374 -31.40583,13.35079 z"
         id="path2997"
         style="fill:#afafde;fill-rule:evenodd;stroke:none"
         inkscape:connector-curvature="0" />
      <path
         d="m 143.25531,436.29049 22.03929,-13.82933 128.50717,23.02826 -31.40583,8.62551 z"
         id="path2991"
         style="fill:#4d4d9f;fill-rule:evenodd;stroke:none"
         inkscape:connector-curvature="0" />
      <path
         d="m 165.2946,422.46116 v -56.82048 l 128.50717,35.64374 v 44.205 z"
         id="path2995"
         style="fill:#d7d7ff;fill-rule:evenodd;stroke:none"
         inkscape:connector-curvature="0" />
      <path
         d="m 143.25531,436.29049 22.03929,-13.82933 v -56.82048 l -22.03929,21.40539 z"
         id="path2993"
         style="fill:#8686bf;fill-rule:evenodd;stroke:none"
         inkscape:connector-curvature="0" />
    </g>
    <text
       x="187.33388"
       y="365.01218"
       id="text5613"
       xml:space="preserve"
       style="font-style:normal;font-weight:normal;font-size:24px;line-height:0%;font-family:'Bitstream Vera Sans';letter-spacing:0px;word-spacing:0px;fill:#000000;fill-opacity:1;stroke:none"><tspan
         x="187.33388"
         y="365.01218"
         id="tspan5615">Block 0</tspan></text>
    <text
       x="305.79501"
       y="399.44855"
       id="text5617"
       xml:space="preserve"
       style="font-style:normal;font-weight:normal;font-size:24px;line-height:0%;font-family:'Bitstream Vera Sans';letter-spacing:0px;word-spacing:0px;fill:#000000;fill-opacity:1;stroke:none"><tspan
         x="305.79501"
         y="399.44855"
         id="tspan5619">Block 1</tspan></text>
    <text
       x="411.17029"
       y="428.37509"
       id="text5621"
       xml:space="preserve"
       style="font-style:normal;font-weight:normal;font-size:24px;line-height:0%;font-family:'Bitstream Vera Sans';letter-spacing:0px;word-spacing:0px;fill:#000000;fill-opacity:1;stroke:none"><tspan
         x="411.17029"
         y="428.37509"
         id="tspan5623">Block 2</tspan></text>
    <text
       x="497.26123"
       y="451.79184"
       id="text5625"
       xml:space="preserve"
       style="font-style:normal;font-weight:normal;font-size:24px;line-height:0%;font-family:'Bitstream Vera Sans';letter-spacing:0px;word-spacing:0px;fill:#000000;fill-opacity:1;stroke:none"><tspan
         x="497.26123"
         y="451.79184"
         id="tspan5627">Block ...</tspan></text>
    <text
       x="34.436371"
       y="389.80634"
       id="text5697"
       xml:space="preserve"
       style="font-style:normal;font-weight:normal;font-size:24px;line-height:0%;font-family:'Bitstream Vera Sans';letter-spacing:0px;word-spacing:0px;fill:#000000;fill-opacity:1;stroke:none"><tspan
         x="34.436371"
         y="389.80634"
         id="tspan5699">Source </tspan><tspan
         x="34.436371"
         y="419.80634"
         id="tspan5701">Data</tspan></text>
    <g
       id="g5745"
       style="opacity:0.40501793;fill:none;stroke:none">
      <path
         d="m 634.446,539.58525 7.33876,0.15505 43.69094,-5.7904 -4.51307,-0.0512 z"
         id="path5755"
         style="fill:#afafde;fill-rule:evenodd;stroke:none"
         inkscape:connector-curvature="0" />
      <path
         d="m 634.446,531.10399 v 8.48126 l 46.51663,-5.6865 v -4.88322 z"
         id="path5747"
         style="fill:#353564;fill-rule:evenodd;stroke:none"
         inkscape:connector-curvature="0" />
      <path
         d="m 680.96263,529.01553 4.51307,0.0188 v 4.91559 l -4.51307,-0.0512 z"
         id="path5757"
         style="fill:#e9e9ff;fill-rule:evenodd;stroke:none"
         inkscape:connector-curvature="0" />
      <path
         d="m 634.446,531.10399 7.33876,0.0569 43.69094,-2.12662 -4.51307,-0.0188 z"
         id="path5749"
         style="fill:#4d4d9f;fill-rule:evenodd;stroke:none"
         inkscape:connector-curvature="0" />
      <path
         d="m 641.78476,531.16093 v 8.57937 l 43.69094,-5.7904 v -4.91559 z"
         id="path5753"
         style="fill:#d7d7ff;fill-rule:evenodd;stroke:none"
         inkscape:connector-curvature="0" />
      <path
         d="m 634.446,531.10399 7.33876,0.0569 v 8.57937 l -7.33876,-0.15505 z"
         id="path5751"
         style="fill:#8686bf;fill-rule:evenodd;stroke:none"
         inkscape:connector-curvature="0" />
    </g>
    <g
       id="g5759"
       style="fill:none;stroke:none">
      <path
         d="m 591.93693,544.82292 9.15819,0.28842 39.64735,-5.24851 -7.08555,-0.1513 z"
         id="path5769"
         style="fill:#afafde;fill-rule:evenodd;stroke:none"
         inkscape:connector-curvature="0" />
      <path
         d="m 591.93693,533.06748 v 11.75544 l 41.71999,-5.11139 v -8.53222 z"
         id="path5761"
         style="fill:#353564;fill-rule:evenodd;stroke:none"
         inkscape:connector-curvature="0" />
      <path
         d="m 633.65692,531.17931 7.08555,0.0559 v 8.62763 l -7.08555,-0.1513 z"
         id="path5771"
         style="fill:#e9e9ff;fill-rule:evenodd;stroke:none"
         inkscape:connector-curvature="0" />
      <path
         d="m 591.93693,533.06748 9.15819,0.10655 39.64735,-1.93883 -7.08555,-0.0559 z"
         id="path5763"
         style="fill:#4d4d9f;fill-rule:evenodd;stroke:none"
         inkscape:connector-curvature="0" />
      <path
         d="m 601.09512,533.17403 v 11.93731 l 39.64735,-5.24851 v -8.62763 z"
         id="path5767"
         style="fill:#d7d7ff;fill-rule:evenodd;stroke:none"
         inkscape:connector-curvature="0" />
      <path
         d="m 591.93693,533.06748 9.15819,0.10655 v 11.93731 l -9.15819,-0.28842 z"
         id="path5765"
         style="fill:#8686bf;fill-rule:evenodd;stroke:none"
         inkscape:connector-curvature="0" />
    </g>
    <g
       id="g5703"
       style="fill:none;stroke:none">
      <path
         d="m 509.46767,553.36451 18.0126,0.96109 71.91896,-9.34437 -13.82948,-0.43376 z"
         id="path5707"
         style="fill:#4d4d9f;fill-rule:evenodd;stroke:none"
         inkscape:connector-curvature="0" />
      <path
         d="m 509.46767,553.36451 v -16.9087 l 76.10208,-3.33264 v 11.4243 z"
         id="path5705"
         style="fill:#353564;fill-rule:evenodd;stroke:none"
         inkscape:connector-curvature="0" />
      <path
         d="m 585.56975,544.54747 13.82948,0.43376 v -11.69411 l -13.82948,-0.16395 z"
         id="path5715"
         style="fill:#e9e9ff;fill-rule:evenodd;stroke:none"
         inkscape:connector-curvature="0" />
      <path
         d="m 509.46767,536.45581 18.0126,0.36327 71.91896,-3.53196 -13.82948,-0.16395 z"
         id="path5713"
         style="fill:#afafde;fill-rule:evenodd;stroke:none"
         inkscape:connector-curvature="0" />
      <path
         d="m 527.48027,554.3256 v -17.50652 l 71.91896,-3.53196 v 11.69411 z"
         id="path5711"
         style="fill:#d7d7ff;fill-rule:evenodd;stroke:none"
         inkscape:connector-curvature="0" />
      <path
         d="m 509.46767,553.36451 18.0126,0.96109 v -17.50652 l -18.0126,-0.36327 z"
         id="path5709"
         style="fill:#8686bf;fill-rule:evenodd;stroke:none"
         inkscape:connector-curvature="0" />
    </g>
    <g
       id="g5829"
       style="fill:none;stroke:none">
      <path
         d="m 144.15314,591.659 23.37619,10.61804 358.70222,-47.34206 -30.38319,-1.66018 z"
         id="path5833"
         style="fill:#4d4d9f;fill-rule:evenodd;stroke:none"
         inkscape:connector-curvature="0" />
      <path
         d="M 144.15314,591.659 V 550.68041 L 495.84836,536.31852 V 553.2748 Z"
         id="path5831"
         style="fill:#353564;fill-rule:evenodd;stroke:none"
         inkscape:connector-curvature="0" />
      <path
         d="m 495.84836,553.2748 30.38319,1.66018 v -17.99529 l -30.38319,-0.62117 z"
         id="path5841"
         style="fill:#e9e9ff;fill-rule:evenodd;stroke:none"
         inkscape:connector-curvature="0" />
      <path
         d="m 144.15314,550.68041 23.37619,3.97286 358.70222,-17.71358 -30.38319,-0.62117 z"
         id="path5839"
         style="fill:#afafde;fill-rule:evenodd;stroke:none"
         inkscape:connector-curvature="0" />
      <path
         d="m 167.52933,602.27704 v -47.62377 l 358.70222,-17.71358 v 17.99529 z"
         id="path5837"
         style="fill:#d7d7ff;fill-rule:evenodd;stroke:none"
         inkscape:connector-curvature="0" />
      <path
         d="m 144.15314,591.659 23.37619,10.61804 v -47.62377 l -23.37619,-3.97286 z"
         id="path5835"
         style="fill:#8686bf;fill-rule:evenodd;stroke:none"
         inkscape:connector-curvature="0" />
    </g>
    <path
       d="m 187.33387,442.14965 c 9.64219,52.34329 453.53381,75.04384 462.2973,75.27301 8.7635,0.22917 23.12306,8.75174 23.12306,8.75174"
       id="path5867"
       style="fill:none;stroke:#000000;stroke-width:1.10000002;stroke-linecap:butt;stroke-linejoin:miter;stroke-miterlimit:4;stroke-dasharray:none;stroke-opacity:1;marker-start:none;marker-end:url(#Arrow1Lend)"
       inkscape:connector-curvature="0" />
    <text
       x="217.67842"
       y="511.2587"
       id="text6499"
       xml:space="preserve"
       style="font-style:normal;font-weight:normal;font-size:24px;line-height:0%;font-family:'Bitstream Vera Sans';letter-spacing:0px;word-spacing:0px;fill:#000000;fill-opacity:1;stroke:none"><tspan
         x="217.67842"
         y="511.2587"
         id="tspan6501">One thread</tspan></text>
    <g
       id="g6877"
       style="fill:url(#linearGradient6907);fill-opacity:1;stroke:#000000;stroke-width:0.40000001;stroke-miterlimit:4;stroke-dasharray:none;stroke-opacity:1">
      <path
         d="m 670.41672,534.86893 6.1617,0.0799 1.82592,-0.23711 -6.01273,-0.0756 z"
         id="path6887"
         style="fill:url(#linearGradient2281);fill-opacity:1;fill-rule:evenodd;stroke:#000000;stroke-width:0.40000001;stroke-miterlimit:4;stroke-dasharray:none;stroke-opacity:1"
         inkscape:connector-curvature="0" />
      <path
         d="m 670.41672,529.58122 v 5.28771 l 1.97489,-0.23287 v -5.14598 z"
         id="path6879"
         style="fill:url(#linearGradient2283);fill-opacity:1;fill-rule:evenodd;stroke:#000000;stroke-width:0.40000001;stroke-miterlimit:4;stroke-dasharray:none;stroke-opacity:1"
         inkscape:connector-curvature="0" />
      <path
         d="m 672.39161,529.49008 6.01273,0.0296 v 5.192 l -6.01273,-0.0756 z"
         id="path6889"
         style="fill:url(#linearGradient2285);fill-opacity:1;fill-rule:evenodd;stroke:#000000;stroke-width:0.40000001;stroke-miterlimit:4;stroke-dasharray:none;stroke-opacity:1"
         inkscape:connector-curvature="0" />
      <path
         d="m 670.41672,529.58122 6.1617,0.0312 1.82592,-0.0928 -6.01273,-0.0296 z"
         id="path6881"
         style="fill:url(#linearGradient2287);fill-opacity:1;fill-rule:evenodd;stroke:#000000;stroke-width:0.40000001;stroke-miterlimit:4;stroke-dasharray:none;stroke-opacity:1"
         inkscape:connector-curvature="0" />
      <path
         d="m 676.57842,529.61247 v 5.33631 l 1.82592,-0.23711 v -5.192 z"
         id="path6885"
         style="fill:url(#linearGradient2289);fill-opacity:1;fill-rule:evenodd;stroke:#000000;stroke-width:0.40000001;stroke-miterlimit:4;stroke-dasharray:none;stroke-opacity:1"
         inkscape:connector-curvature="0" />
      <path
         d="m 670.41672,529.58122 6.1617,0.0312 v 5.33631 l -6.1617,-0.0799 z"
         id="path6883"
         style="fill:url(#linearGradient2291);fill-opacity:1;fill-rule:evenodd;stroke:#000000;stroke-width:0.40000001;stroke-miterlimit:4;stroke-dasharray:none;stroke-opacity:1"
         inkscape:connector-curvature="0" />
    </g>
    <text
       x="85.402206"
       y="630.86102"
       id="text6909"
       xml:space="preserve"
       style="font-style:normal;font-weight:normal;font-size:24px;line-height:0%;font-family:'Bitstream Vera Sans';letter-spacing:0px;word-spacing:0px;fill:#000000;fill-opacity:1;stroke:none"><tspan
         x="85.402206"
         y="630.86102"
         id="tspan6911">Destination</tspan><tspan
         x="85.402206"
         y="660.86102"
         id="tspan6913">Data</tspan></text>
  </g>
</svg>
