%YAML 1.1
%TAG !u! tag:unity3d.com,2011:
--- !u!114 &11400000
MonoBehaviour:
  m_ObjectHideFlags: 0
  m_CorrespondingSourceObject: {fileID: 0}
  m_PrefabInstance: {fileID: 0}
  m_PrefabAsset: {fileID: 0}
  m_GameObject: {fileID: 0}
  m_Enabled: 1
  m_EditorHideFlags: 0
  m_Script: {fileID: 11500000, guid: bbb281ee3bf0b054c82ac2347e9e782c, type: 3}
  m_Name: Localization-String-Tables-French (fr)
  m_EditorClassIdentifier: 
  m_GroupName: Localization-String-Tables-French (fr)
  m_Data:
    m_SerializedData: []
  m_GUID: e71c185fb19cd1b4bbc717738144530f
  m_SerializeEntries:
  - m_GUID: 9a0360c9bc422fb4cae252c43b1a1e03
    m_Address: Labels Table_fr
    m_ReadOnly: 1
    m_SerializedLabels:
    - Locale-fr
  m_ReadOnly: 1
  m_Settings: {fileID: 11400000, guid: c11a89853883f4c42b8cc4063619cb23, type: 2}
  m_SchemaSet:
    m_Schemas:
    - {fileID: 11400000, guid: 38b6322de17e71644a81b2c3fe36172c, type: 2}
    - {fileID: 11400000, guid: 58819473958c02f4592c124f6010fc08, type: 2}
