{
	"metadata": [
		{
			"src": [
				{
					"src": "..",
					"files": [
						"**.csproj"
					]
				}
			],
			"globalNamespaceId": "Global",
			"filter": "filterConfig.yml",
			"dest": "api"
		}
	],
	"build": {
		"globalMetadata": {
			"_appTitle": "Brain Hero Unity Game documentation",
			"_appFooter": "Brain Hero Unity Game documentation",
			"_enableSearch": true
		},
		"content": [
			{
				"files": [
					"toc.yml",
					"index.md"
				]
			},
			{
				"src": "api",
				"files": [
					"*.yml"
				],
				"dest": "api"
			}
		],
		"resource": [
			{
				"files": [
					"resources/**/*"
				]
			}
		],
		"sitemap": {
			"baseUrl": "https://gitlab.inria.fr/openvibe/unity-games/brain-hero",
			"changefreq": "weekly",
			"fileOptions": {
				"api/*": {
					"changefreq": "daily"
				}
			}
		},
		"xref": [ 
			"https://normanderwan.github.io/UnityXrefMaps/xrefmap.yml",
			"https://openvibe.gitlabpages.inria.fr/unity-games/LSL4Unity/xrefmap.yml" ],
		"xrefService": [ "https://xref.docs.microsoft.com/query?uid={uid}" ],
		"dest": "../_site"
	}
}