%YAML 1.1
%TAG !u! tag:unity3d.com,2011:
--- !u!1045 &1
EditorBuildSettings:
  m_ObjectHideFlags: 0
  serializedVersion: 2
  m_Scenes:
  - enabled: 1
    path: Assets/Scenes/Start Menu.unity
    guid: fa1405535540d674cbed0898f31679cb
  - enabled: 1
    path: Assets/Scenes/Game.unity
    guid: 89e1ebbe349935644b4b5bd84d2a2db8
  m_configObjects: {}
