\relax 
\catcode`:\active
\catcode`;\active
\catcode`!\active
\catcode`?\active
\bibstyle{apalike}
\select@language{french}
\@writefile{toc}{\select@language{french}}
\@writefile{lof}{\select@language{french}}
\@writefile{lot}{\select@language{french}}
\@writefile{toc}{\contentsline {section}{\numberline {1}Traitement de l'image}{1}}
\@writefile{toc}{\contentsline {subsection}{\numberline {1.1}But}{1}}
\@writefile{toc}{\contentsline {subsection}{\numberline {1.2}Perception}{1}}
\@writefile{lol}{\contentsline {lstlisting}{\numberline {1}Percept logique du robot}{1}}
\@writefile{toc}{\contentsline {subsection}{\numberline {1.3}Etat}{1}}
\@writefile{lol}{\contentsline {lstlisting}{\numberline {2}D\IeC {\'e}finition d'un \IeC {\'e}tat}{1}}
\@writefile{toc}{\contentsline {section}{\numberline {2}KdTree}{1}}
\citation{Smart02}
\@writefile{lof}{\contentsline {figure}{\numberline {1}{\ignorespaces Repr\IeC {\'e}sentation UML des composants d'un KdTree}}{2}}
\newlabel{fig:kdtree}{{1}{2}}
\@writefile{toc}{\contentsline {subsection}{\numberline {2.1}Impl\IeC {\'e}mentation}{2}}
\@writefile{toc}{\contentsline {section}{\numberline {3}Apprentissage}{2}}
\@writefile{toc}{\contentsline {subsection}{\numberline {3.1}Apprentissage selon \cite  {Smart02}}{2}}
\@writefile{toc}{\contentsline {subsection}{\numberline {3.2}Pr\IeC {\'e}diction de la valeur d'un point}{2}}
\@writefile{toc}{\contentsline {subsection}{\numberline {3.3}R\IeC {\'e}gression lin\IeC {\'e}aire locale }{3}}
\@writefile{toc}{\contentsline {section}{\numberline {4}Mise en oeuvre}{3}}
\@writefile{toc}{\contentsline {subsection}{\numberline {4.1}Sur le robot}{3}}
\@writefile{toc}{\contentsline {subsection}{\numberline {4.2}En simulation avec python}{3}}
\@writefile{lol}{\contentsline {lstlisting}{\numberline {3}Actions possibles de l'agent}{3}}
\@writefile{lol}{\contentsline {lstlisting}{\numberline {4}Lancement de ipython dans un xterm avec un thread graphique pour gtk}{4}}
\@writefile{lol}{\contentsline {lstlisting}{\numberline {5}ipyhton}{4}}
