{
  "Version": "3.3.0", 
  "Began": "Sat Oct 15 13:35:13 2022", 
  "Command line": "ior -f /etc/ior_script", 
  "Machine": "Linux node1", 
  "tests": [
    {
    "TestID": 0, 
    "StartTime": "Sat Oct 15 13:35:13 2022"    , "Path": "/data","Capacity": "31.0 GiB", "Used Capacity": "8.1%","Inodes": "2.0 Mi", "Used Inodes" : "6.6%"
, 
    "Parameters": {
      "testID": 0, 
      "refnum": 0, 
      "api": "POSIX", 
      "platform": "node(Linux)", 
      "testFileName": "testFile", 
      "hintsFileName": "hintsFile", 
      "deadlineForStonewall": 0, 
      "stoneWallingWearOut": 0, 
      "maxTimeDuration": 60, 
      "outlierThreshold": 0, 
      "options": "(null)", 
      "dryRun": 0, 
      "nodes": 5, 
      "memoryPerTask": 0, 
      "memoryPerNode": 0, 
      "tasksPerNode": 6, 
      "repetitions": 10, 
      "multiFile": 0, 
      "interTestDelay": 5, 
      "fsync": 0, 
      "fsyncperwrite": 0, 
      "useExistingTestFile": 0, 
      "showHints": 0, 
      "uniqueDir": 0, 
      "individualDataSets": 0, 
      "singleXferAttempt": 0, 
      "readFile": 1, 
      "writeFile": 1, 
      "filePerProc": 0, 
      "reorderTasks": 0, 
      "reorderTasksRandom": 0, 
      "reorderTasksRandomSeed": 0, 
      "randomOffset": 0, 
      "checkWrite": 0, 
      "checkRead": 0, 
      "preallocate": 0, 
      "useFileView": 0, 
      "setAlignment": 1, 
      "storeFileOffset": 0, 
      "useSharedFilePointer": 0, 
      "useStridedDatatype": 0, 
      "keepFile": 1, 
      "keepFileWithError": 0, 
      "quitOnError": 0, 
      "verbose": 0, 
      "data packet type": "g", 
      "setTimeStampSignature/incompressibleSeed": 0, 
      "collective": 0, 
      "segmentCount": 4, 
      "transferSize": 4194304, 
      "blockSize": 134217728
    }
, 
    "Options": {
      "api": "POSIX", 
      "apiVersion": "", 
      "test filename": "testFile", 
      "access": "single-shared-file", 
      "type": "independent", 
      "segments": 4, 
      "ordering in a file": "sequential", 
      "ordering inter file": "no tasks offsets", 
      "nodes": 5, 
      "tasks": 28, 
      "clients per node": 6, 
      "repetitions": 10, 
      "xfersize": "4 MiB", 
      "blocksize": "128 MiB", 
      "aggregate filesize": "14 GiB"
    }
, 
    "Results": [
      [             {
        "access": "write", 
        "bwMiB": 355.8868, 
        "blockKiB": 131072.0000, 
        "xferKiB": 4096.0000, 
        "iops": 2384.8329, 
        "latency": 0.0429, 
        "openTime": 0.1094, 
        "wrRdTime": 1.5028, 
        "closeTime": 39.2335, 
        "totalTime": 40.2825
      }
, 
            {
        "access": "read", 
        "bwMiB": 1101.3730, 
        "blockKiB": 131072.0000, 
        "xferKiB": 4096.0000, 
        "iops": 275.3548, 
        "latency": 0.3984, 
        "openTime": 0.0015, 
        "wrRdTime": 13.0159, 
        "closeTime": 4.6354, 
        "totalTime": 13.0165
      }
]
, 
    [         {
      "access": "write", 
      "bwMiB": 345.1740, 
      "blockKiB": 131072.0000, 
      "xferKiB": 4096.0000, 
      "iops": 2423.8950, 
      "latency": 0.0386, 
      "openTime": 0.1098, 
      "wrRdTime": 1.4786, 
      "closeTime": 40.5351, 
      "totalTime": 41.5327
    }
, 
        {
      "access": "read", 
      "bwMiB": 1393.1887, 
      "blockKiB": 131072.0000, 
      "xferKiB": 4096.0000, 
      "iops": 348.3170, 
      "latency": 0.3066, 
      "openTime": 0.1074, 
      "wrRdTime": 10.2895, 
      "closeTime": 10.2139, 
      "totalTime": 10.2901
    }
]
, 
  [     {
    "access": "write", 
    "bwMiB": 351.0887, 
    "blockKiB": 131072.0000, 
    "xferKiB": 4096.0000, 
    "iops": 2253.9591, 
    "latency": 0.0493, 
    "openTime": 0.1069, 
    "wrRdTime": 1.5901, 
    "closeTime": 39.8096, 
    "totalTime": 40.8330
  }
, 
    {
    "access": "read", 
    "bwMiB": 1396.5723, 
    "blockKiB": 131072.0000, 
    "xferKiB": 4096.0000, 
    "iops": 349.1570, 
    "latency": 0.3202, 
    "openTime": 0.1048, 
    "wrRdTime": 10.2647, 
    "closeTime": 10.1891, 
    "totalTime": 10.2651
  }
]
, 
[ {
  "access": "write", 
  "bwMiB": 342.2835, 
  "blockKiB": 131072.0000, 
  "xferKiB": 4096.0000, 
  "iops": 2020.1508, 
  "latency": 0.0549, 
  "openTime": 0.1040, 
  "wrRdTime": 1.7741, 
  "closeTime": 40.8588, 
  "totalTime": 41.8834
}
, 
{
  "access": "read", 
  "bwMiB": 1097.1126, 
  "blockKiB": 131072.0000, 
  "xferKiB": 4096.0000, 
  "iops": 274.2900, 
  "latency": 0.3130, 
  "openTime": 0.0036, 
  "wrRdTime": 13.0665, 
  "closeTime": 4.1394, 
  "totalTime": 13.0670
}
]
, 
[ {
"access": "write", 
"bwMiB": 344.1928, 
"blockKiB": 131072.0000, 
"xferKiB": 4096.0000, 
"iops": 2043.8827, 
"latency": 0.0407, 
"openTime": 0.1122, 
"wrRdTime": 1.7535, 
"closeTime": 40.5174, 
"totalTime": 41.6511
}
, 
{
"access": "read", 
"bwMiB": 1093.6258, 
"blockKiB": 131072.0000, 
"xferKiB": 4096.0000, 
"iops": 273.4206, 
"latency": 0.3339, 
"openTime": 0.1016, 
"wrRdTime": 13.1080, 
"closeTime": 3.8552, 
"totalTime": 13.1087
}
]
, 
[ {
"access": "write", 
"bwMiB": 342.3113, 
"blockKiB": 131072.0000, 
"xferKiB": 4096.0000, 
"iops": 2037.5472, 
"latency": 0.0426, 
"openTime": 0.1080, 
"wrRdTime": 1.7590, 
"closeTime": 40.8505, 
"totalTime": 41.8800
}
, 
{
"access": "read", 
"bwMiB": 1101.1717, 
"blockKiB": 131072.0000, 
"xferKiB": 4096.0000, 
"iops": 275.3762, 
"latency": 0.4029, 
"openTime": 0.1120, 
"wrRdTime": 13.0149, 
"closeTime": 5.2357, 
"totalTime": 13.0189
}
]
, 
[ {
"access": "write", 
"bwMiB": 343.1150, 
"blockKiB": 131072.0000, 
"xferKiB": 4096.0000, 
"iops": 2222.5412, 
"latency": 0.0474, 
"openTime": 0.1174, 
"wrRdTime": 1.6126, 
"closeTime": 40.6133, 
"totalTime": 41.7819
}
, 
{
"access": "read", 
"bwMiB": 1101.8843, 
"blockKiB": 131072.0000, 
"xferKiB": 4096.0000, 
"iops": 275.4844, 
"latency": 0.3496, 
"openTime": 0.0071, 
"wrRdTime": 13.0098, 
"closeTime": 1.8930, 
"totalTime": 13.0104
}
]
, 
[ {
"access": "write", 
"bwMiB": 344.3614, 
"blockKiB": 131072.0000, 
"xferKiB": 4096.0000, 
"iops": 2613.0343, 
"latency": 0.0388, 
"openTime": 0.1094, 
"wrRdTime": 1.3716, 
"closeTime": 40.5732, 
"totalTime": 41.6307
}
, 
{
"access": "read", 
"bwMiB": 1100.5651, 
"blockKiB": 131072.0000, 
"xferKiB": 4096.0000, 
"iops": 275.1532, 
"latency": 0.3898, 
"openTime": 0.0069, 
"wrRdTime": 13.0255, 
"closeTime": 1.8187, 
"totalTime": 13.0260
}
]
, 
[ {
"access": "write", 
"bwMiB": 343.8316, 
"blockKiB": 131072.0000, 
"xferKiB": 4096.0000, 
"iops": 2185.2208, 
"latency": 0.0497, 
"openTime": 0.1099, 
"wrRdTime": 1.6401, 
"closeTime": 40.5316, 
"totalTime": 41.6948
}
, 
{
"access": "read", 
"bwMiB": 1102.7686, 
"blockKiB": 131072.0000, 
"xferKiB": 4096.0000, 
"iops": 275.7034, 
"latency": 0.3506, 
"openTime": 0.0053, 
"wrRdTime": 12.9995, 
"closeTime": 1.8678, 
"totalTime": 13.0000
}
]
, 
[ {
"access": "write", 
"bwMiB": 390.9689, 
"blockKiB": 131072.0000, 
"xferKiB": 4096.0000, 
"iops": 1939.9396, 
"latency": 0.0449, 
"openTime": 0.1132, 
"wrRdTime": 1.8475, 
"closeTime": 35.4649, 
"totalTime": 36.6679
}
, 
{
"access": "read", 
"bwMiB": 1091.9498, 
"blockKiB": 131072.0000, 
"xferKiB": 4096.0000, 
"iops": 273.0884, 
"latency": 0.3211, 
"openTime": 0.1091, 
"wrRdTime": 13.1240, 
"closeTime": 3.7971, 
"totalTime": 13.1288
}
]
]
, 
"max": {
"writeMiB": 390.9689, 
"writeMB": 409.9606, 
"readMiB": 1396.5723, 
"readMB": 1464.4122
}

}
]
, 
"summary": [
{
"operation": "write", 
"API": "POSIX", 
"TestID": 0, 
"ReferenceNumber": 0, 
"segmentCount": 4, 
"blockSize": 134217728, 
"transferSize": 4194304, 
"numTasks": 28, 
"tasksPerNode": 6, 
"repetitions": 10, 
"filePerProc": 0, 
"reorderTasks": 0, 
"taskPerNodeOffset": 1, 
"reorderTasksRandom": 0, 
"reorderTasksRandomSeed": 0, 
"segmentCount": 4, 
"blockSize": 134217728, 
"transferSize": 4194304, 
"bwMaxMIB": 390.9689, 
"bwMinMIB": 342.2835, 
"bwMeanMIB": 350.3214, 
"bwStdMIB": 14.1640, 
"OPsMax": 97.7422, 
"OPsMin": 85.5709, 
"OPsMean": 87.5804, 
"OPsSD": 3.5410, 
"MeanTime": 40.9838, 
"xsizeMiB": 14336.0000
}
, 
{
"operation": "read", 
"API": "POSIX", 
"TestID": 0, 
"ReferenceNumber": 0, 
"segmentCount": 4, 
"blockSize": 134217728, 
"transferSize": 4194304, 
"numTasks": 28, 
"tasksPerNode": 6, 
"repetitions": 10, 
"filePerProc": 0, 
"reorderTasks": 0, 
"taskPerNodeOffset": 1, 
"reorderTasksRandom": 0, 
"reorderTasksRandomSeed": 0, 
"segmentCount": 4, 
"blockSize": 134217728, 
"transferSize": 4194304, 
"bwMaxMIB": 1396.5723, 
"bwMinMIB": 1091.9498, 
"bwMeanMIB": 1158.0212, 
"bwStdMIB": 118.4815, 
"OPsMax": 349.1431, 
"OPsMin": 272.9874, 
"OPsMean": 289.5053, 
"OPsSD": 29.6204, 
"MeanTime": 12.4932, 
"xsizeMiB": 14336.0000
}
]
, 
"Finished": "Sat Oct 15 13:46:08 2022"
}
