{
  "nodes": [
    "mgrr1",
    "monn1",
    "osdd1"
  ],
  "deployment": {
    "mgrr1": {
      "role": "mgrr"
    },
    "monn1": {
      "role": "monn"
    },
    "osdd1": {
      "role": "osdd"
    }
  },
  "docker-compose-file": "/home/alex/dev/ceph-test/nxc/deploy/docker_compose/docker-compose.json",
  "test_script": "/nix/store/9bc29aqwlb9lqx5djspqmgywh5b6hd7s-test-script"
}