empty_nfs/empty_nfs.md5, 150
empty_nfs/empty_nfs.dsc, 573
empty_nfs/ssh_config, 311
empty_nfs/insecure_ssh_key, 3414
empty_nfs/.build_recipe, 96342
empty_nfs/insecure_ssh_key.pub, 766
empty_nfs/empty_nfs.tar.zst, 359096053
empty_nfs/empty_nfs.qcow2, 535166976
empty_nfs/http_dir/preseed.cfg, 20292
empty_nfs/.guestfs-13414/qemu-14380928-1632910492.help, 29539
empty_nfs/.guestfs-13414/qemu-14380928-1632910492.qmp-schema, 149299
empty_nfs/.guestfs-13414/qemu-14380928-1632910492.stat, 50
empty_nfs/.guestfs-13414/qemu-14380928-1632910492.query-kvm, 48
empty_nfs/.guestfs-13414/lock, 0
empty_nfs/.guestfs-13414/qemu-14380928-1632910492.devices, 15219
empty_nfs/.guestfs-13414/appliance.d/initrd, 5282816
empty_nfs/.guestfs-13414/appliance.d/root, 4294967296
empty_nfs/.guestfs-13414/appliance.d/kernel, 6837280
empty_nfs/kameleon_scripts/local/00023_test_z.sh, 455
empty_nfs/kameleon_scripts/local/00079_echo_e_y_n_ssh_keygen_q_t_rsa_.sh, 729
empty_nfs/kameleon_scripts/local/00097_test_e_a_s_wrapper.sh, 715
empty_nfs/kameleon_scripts/local/00003_rm_f_home_qguilloteau_nix_comp_wrapper.sh, 731
empty_nfs/kameleon_scripts/local/00047_sed_i_e_s_d_i_apt_setup_securi_wrapper.sh, 735
empty_nfs/kameleon_scripts/local/bash_history, 25249
empty_nfs/kameleon_scripts/local/00021_test_n_o_n_home_qguilloteau_ni.sh, 686
empty_nfs/kameleon_scripts/local/00065_echo_sending_keyboard_commands.sh, 1689
empty_nfs/kameleon_scripts/local/00223_test_false_false_a_setup_setup.sh, 540
empty_nfs/kameleon_scripts/local/00081_cat_home_qguilloteau_nix_compa.sh, 608
empty_nfs/kameleon_scripts/local/00241_if_qcow2_tar.zst_qcow2_then_ec_wrapper.sh, 739
empty_nfs/kameleon_scripts/local/00013_command_v_virt_customize_2_dev.sh, 512
empty_nfs/kameleon_scripts/local/00083_virt_customize_a_home_qguillot.sh, 1828
empty_nfs/kameleon_scripts/local/00067_test_true_true_wrapper.sh, 711
empty_nfs/kameleon_scripts/local/bash_rc, 14698
empty_nfs/kameleon_scripts/local/00079_echo_e_y_n_ssh_keygen_q_t_rsa__wrapper.sh, 735
empty_nfs/kameleon_scripts/local/00095_test_vm_available_eq_1.sh, 483
empty_nfs/kameleon_scripts/local/00093_vm_available_0_if_ssh_ssh_then.sh, 1991
empty_nfs/kameleon_scripts/local/00257_test_true_false_a_bootstrap_ex.sh, 548
empty_nfs/kameleon_scripts/local/00107_test_true_false_a_bootstrap_bo.sh, 554
empty_nfs/kameleon_scripts/local/00061_test_vm_available_eq_1_wrapper.sh, 723
empty_nfs/kameleon_scripts/local/00051_home_qguilloteau_nix_compas22__wrapper.sh, 735
empty_nfs/kameleon_scripts/local/00041_sed_i_e_s_d_i_mirror_http_host_wrapper.sh, 735
empty_nfs/kameleon_scripts/local/00229_test_true_false_a_bootstrap_se.sh, 546
empty_nfs/kameleon_scripts/local/00081_cat_home_qguilloteau_nix_compa_wrapper.sh, 735
empty_nfs/kameleon_scripts/local/00097_test_e_a_s.sh, 478
empty_nfs/kameleon_scripts/local/00033_mkdir_p_home_qguilloteau_nix_c.sh, 603
empty_nfs/kameleon_scripts/local/00103_test_false_true.sh, 484
empty_nfs/kameleon_scripts/local/00239_home_qguilloteau_nix_compas22__wrapper.sh, 735
empty_nfs/kameleon_scripts/local/00035_cp_home_qguilloteau_nix_compas_wrapper.sh, 735
empty_nfs/kameleon_scripts/local/00075_find_empty_ssh_forwarding_port.sh, 692
empty_nfs/kameleon_scripts/local/00091_echo_starting_qemu..._if_true__wrapper.sh, 731
empty_nfs/kameleon_scripts/local/00095_test_vm_available_eq_1_wrapper.sh, 727
empty_nfs/kameleon_scripts/local/00033_mkdir_p_home_qguilloteau_nix_c_wrapper.sh, 735
empty_nfs/kameleon_scripts/local/00025_echo_looking_for_the_netinstal.sh, 856
empty_nfs/kameleon_scripts/local/00029_unset_download_src_url.sh, 476
empty_nfs/kameleon_scripts/local/00071_test_true_true_wrapper.sh, 711
empty_nfs/kameleon_scripts/local/00261_rm_f_home_qguilloteau_nix_comp_wrapper.sh, 735
empty_nfs/kameleon_scripts/local/00093_vm_available_0_if_ssh_ssh_then_wrapper.sh, 735
empty_nfs/kameleon_scripts/local/00265_rm_f_home_qguilloteau_nix_comp_wrapper.sh, 735
empty_nfs/kameleon_scripts/local/00073_if_f_home_qguilloteau_nix_comp.sh, 1938
empty_nfs/kameleon_scripts/local/00169_rsync_e_ssh_f_home_qguilloteau.sh, 870
empty_nfs/kameleon_scripts/local/00265_rm_f_home_qguilloteau_nix_comp.sh, 603
empty_nfs/kameleon_scripts/local/00179_git_rev_parse_head_2_dev_null_.sh, 705
empty_nfs/kameleon_scripts/local/00069_if_f_home_qguilloteau_nix_comp.sh, 2929
empty_nfs/kameleon_scripts/local/00045_sed_i_e_s_d_i_apt_setup_securi.sh, 785
empty_nfs/kameleon_scripts/local/00071_test_true_true.sh, 482
empty_nfs/kameleon_scripts/local/00085_cat_eof_home_qguilloteau_nix_c.sh, 829
empty_nfs/kameleon_scripts/local/00011_command_v_ssh_keygen_2_dev_nul.sh, 504
empty_nfs/kameleon_scripts/local/00015_command_v_qemu_system_x86_64_2_wrapper.sh, 735
empty_nfs/kameleon_scripts/local/00005_command_v_qemu_img_2_dev_null_wrapper.sh, 726
empty_nfs/kameleon_scripts/local/00173_rsync_e_ssh_f_home_qguilloteau_wrapper.sh, 739
empty_nfs/kameleon_scripts/local/00063_test_e_home_qguilloteau_nix_co.sh, 894
empty_nfs/kameleon_scripts/local/00031_rm_f_home_qguilloteau_nix_comp_wrapper.sh, 735
empty_nfs/kameleon_scripts/local/00233_virt_customize_a_home_qguillot.sh, 730
empty_nfs/kameleon_scripts/local/00061_test_vm_available_eq_1.sh, 483
empty_nfs/kameleon_scripts/local/00089_if_r_home_qguilloteau_nix_comp_wrapper.sh, 731
empty_nfs/kameleon_scripts/local/00013_command_v_virt_customize_2_dev_wrapper.sh, 735
empty_nfs/kameleon_scripts/local/00063_test_e_home_qguilloteau_nix_co_wrapper.sh, 727
empty_nfs/kameleon_scripts/local/00237_if_false_true_then_export_opts.sh, 625
empty_nfs/kameleon_scripts/local/00105_test_false_false_a_setup_boots_wrapper.sh, 735
empty_nfs/kameleon_scripts/local/00023_test_z_wrapper.sh, 711
empty_nfs/kameleon_scripts/local/00223_test_false_false_a_setup_setup_wrapper.sh, 739
empty_nfs/kameleon_scripts/local/00235_rm_f_home_qguilloteau_nix_comp.sh, 617
empty_nfs/kameleon_scripts/local/00073_if_f_home_qguilloteau_nix_comp_wrapper.sh, 735
empty_nfs/kameleon_scripts/local/00229_test_true_false_a_bootstrap_se_wrapper.sh, 739
empty_nfs/kameleon_scripts/local/00069_if_f_home_qguilloteau_nix_comp_wrapper.sh, 735
empty_nfs/kameleon_scripts/local/00247_if_qcow2_tar.zst_qcow2_then_ec.sh, 1524
empty_nfs/kameleon_scripts/local/00259_rm_f_home_qguilloteau_nix_comp.sh, 621
empty_nfs/kameleon_scripts/local/00011_command_v_ssh_keygen_2_dev_nul_wrapper.sh, 731
empty_nfs/kameleon_scripts/local/00055_if_r_home_qguilloteau_nix_comp.sh, 1592
empty_nfs/kameleon_scripts/local/00085_cat_eof_home_qguilloteau_nix_c_wrapper.sh, 727
empty_nfs/kameleon_scripts/local/00009_command_v_socat_2_dev_null_wrapper.sh, 727
empty_nfs/kameleon_scripts/local/00043_sed_i_e_s_d_i_mirror_http_dire.sh, 757
empty_nfs/kameleon_scripts/local/00225_if_f_home_qguilloteau_nix_comp_wrapper.sh, 735
empty_nfs/kameleon_scripts/local/00001_echo_the_local_context_has_bee_wrapper.sh, 727
empty_nfs/kameleon_scripts/local/00231_virt_customize_a_home_qguillot_wrapper.sh, 739
empty_nfs/kameleon_scripts/local/00227_if_f_home_qguilloteau_nix_comp_wrapper.sh, 735
empty_nfs/kameleon_scripts/local/00101_test_false_true.sh, 484
empty_nfs/kameleon_scripts/local/00055_if_r_home_qguilloteau_nix_comp_wrapper.sh, 731
empty_nfs/kameleon_scripts/local/00043_sed_i_e_s_d_i_mirror_http_dire_wrapper.sh, 735
empty_nfs/kameleon_scripts/local/00243_if_qcow2_tar.zst_qcow2_and_and_wrapper.sh, 739
empty_nfs/kameleon_scripts/local/00077_mkdir_p_dirname_home_qguillote_wrapper.sh, 735
empty_nfs/kameleon_scripts/local/00049_http_port_find_free_port_8000_.sh, 618
empty_nfs/kameleon_scripts/local/00107_test_true_false_a_bootstrap_bo_wrapper.sh, 739
empty_nfs/kameleon_scripts/local/00037_sed_i_e_s_d_i_passwd_root_pass.sh, 761
empty_nfs/kameleon_scripts/local/00057_echo_starting_qemu..._if_true_.sh, 8186
empty_nfs/kameleon_scripts/local/00263_rm_f_home_qguilloteau_nix_comp_wrapper.sh, 739
empty_nfs/kameleon_scripts/local/00263_rm_f_home_qguilloteau_nix_comp.sh, 603
empty_nfs/kameleon_scripts/local/00047_sed_i_e_s_d_i_apt_setup_securi.sh, 761
empty_nfs/kameleon_scripts/local/00045_sed_i_e_s_d_i_apt_setup_securi_wrapper.sh, 731
empty_nfs/kameleon_scripts/local/00255_test_false_false_a_setup_expor_wrapper.sh, 731
empty_nfs/kameleon_scripts/local/00099_echo_no_keyboard_commands_to_s_wrapper.sh, 735
empty_nfs/kameleon_scripts/local/00235_rm_f_home_qguilloteau_nix_comp_wrapper.sh, 739
empty_nfs/kameleon_scripts/local/00075_find_empty_ssh_forwarding_port_wrapper.sh, 735
empty_nfs/kameleon_scripts/local/bash_env, 4662
empty_nfs/kameleon_scripts/local/00027_download_home_qguilloteau_nix_.sh, 625
empty_nfs/kameleon_scripts/local/00261_rm_f_home_qguilloteau_nix_comp.sh, 601
empty_nfs/kameleon_scripts/local/bash_status, 2
empty_nfs/kameleon_scripts/local/00105_test_false_false_a_setup_boots.sh, 548
empty_nfs/kameleon_scripts/local/00019_touch_home_qguilloteau_nix_com_wrapper.sh, 735
empty_nfs/kameleon_scripts/local/00233_virt_customize_a_home_qguillot_wrapper.sh, 735
empty_nfs/kameleon_scripts/local/00037_sed_i_e_s_d_i_passwd_root_pass_wrapper.sh, 735
empty_nfs/kameleon_scripts/local/00029_unset_download_src_url_wrapper.sh, 727
empty_nfs/kameleon_scripts/local/00049_http_port_find_free_port_8000__wrapper.sh, 735
empty_nfs/kameleon_scripts/local/00025_echo_looking_for_the_netinstal_wrapper.sh, 735
empty_nfs/kameleon_scripts/local/00065_echo_sending_keyboard_commands_wrapper.sh, 735
empty_nfs/kameleon_scripts/local/00089_if_r_home_qguilloteau_nix_comp.sh, 1592
empty_nfs/kameleon_scripts/local/00179_git_rev_parse_head_2_dev_null__wrapper.sh, 739
empty_nfs/kameleon_scripts/local/00245_if_false_true_and_and_x86_64_a_wrapper.sh, 739
empty_nfs/kameleon_scripts/local/00247_if_qcow2_tar.zst_qcow2_then_ec_wrapper.sh, 739
empty_nfs/kameleon_scripts/local/00005_command_v_qemu_img_2_dev_null.sh, 500
empty_nfs/kameleon_scripts/local/00239_home_qguilloteau_nix_compas22_.sh, 1562
empty_nfs/kameleon_scripts/local/00051_home_qguilloteau_nix_compas22_.sh, 1061
empty_nfs/kameleon_scripts/local/00009_command_v_socat_2_dev_null.sh, 494
empty_nfs/kameleon_scripts/local/00027_download_home_qguilloteau_nix__wrapper.sh, 735
empty_nfs/kameleon_scripts/local/00039_sed_i_e_s_d_i_passwd_root_pass_wrapper.sh, 735
empty_nfs/kameleon_scripts/local/00001_echo_the_local_context_has_bee.sh, 528
empty_nfs/kameleon_scripts/local/00059_vm_available_0_if_ssh_then_tim_wrapper.sh, 735
empty_nfs/kameleon_scripts/local/00251_if_xnfs_xxen_then_cat_eof_home_wrapper.sh, 739
empty_nfs/kameleon_scripts/local/00067_test_true_true.sh, 482
empty_nfs/kameleon_scripts/local/00243_if_qcow2_tar.zst_qcow2_and_and.sh, 1013
empty_nfs/kameleon_scripts/local/00173_rsync_e_ssh_f_home_qguilloteau.sh, 850
empty_nfs/kameleon_scripts/local/00039_sed_i_e_s_d_i_passwd_root_pass.sh, 773
empty_nfs/kameleon_scripts/local/00015_command_v_qemu_system_x86_64_2.sh, 520
empty_nfs/kameleon_scripts/local/00007_command_v_qemu_system_x86_64_2_wrapper.sh, 727
empty_nfs/kameleon_scripts/local/00231_virt_customize_a_home_qguillot.sh, 938
empty_nfs/kameleon_scripts/local/00017_command_v_socat_2_dev_null_wrapper.sh, 731
empty_nfs/kameleon_scripts/local/00169_rsync_e_ssh_f_home_qguilloteau_wrapper.sh, 739
empty_nfs/kameleon_scripts/local/00031_rm_f_home_qguilloteau_nix_comp.sh, 864
empty_nfs/kameleon_scripts/local/00251_if_xnfs_xxen_then_cat_eof_home.sh, 3608
empty_nfs/kameleon_scripts/local/00083_virt_customize_a_home_qguillot_wrapper.sh, 735
empty_nfs/kameleon_scripts/local/00249_echo_creating_description_file.sh, 694
empty_nfs/kameleon_scripts/local/00057_echo_starting_qemu..._if_true__wrapper.sh, 731
empty_nfs/kameleon_scripts/local/00249_echo_creating_description_file_wrapper.sh, 739
empty_nfs/kameleon_scripts/local/00021_test_n_o_n_home_qguilloteau_ni_wrapper.sh, 735
empty_nfs/kameleon_scripts/local/00241_if_qcow2_tar.zst_qcow2_then_ec.sh, 3003
empty_nfs/kameleon_scripts/local/00017_command_v_socat_2_dev_null.sh, 494
empty_nfs/kameleon_scripts/local/00225_if_f_home_qguilloteau_nix_comp.sh, 2927
empty_nfs/kameleon_scripts/local/00053_if_true_true_then_echo_qemu_vm.sh, 739
empty_nfs/kameleon_scripts/local/00077_mkdir_p_dirname_home_qguillote.sh, 1390
empty_nfs/kameleon_scripts/local/00059_vm_available_0_if_ssh_then_tim.sh, 1985
empty_nfs/kameleon_scripts/local/00053_if_true_true_then_echo_qemu_vm_wrapper.sh, 731
empty_nfs/kameleon_scripts/local/00099_echo_no_keyboard_commands_to_s.sh, 508
empty_nfs/kameleon_scripts/local/00087_if_false_true_then_echo_qemu_v_wrapper.sh, 731
empty_nfs/kameleon_scripts/local/00227_if_f_home_qguilloteau_nix_comp.sh, 1938
empty_nfs/kameleon_scripts/local/00253_md5sum_empty_nfs._empty_nfs.md.sh, 504
empty_nfs/kameleon_scripts/local/00259_rm_f_home_qguilloteau_nix_comp_wrapper.sh, 739
empty_nfs/kameleon_scripts/local/00007_command_v_qemu_system_x86_64_2.sh, 520
empty_nfs/kameleon_scripts/local/00035_cp_home_qguilloteau_nix_compas.sh, 831
empty_nfs/kameleon_scripts/local/00101_test_false_true_wrapper.sh, 724
empty_nfs/kameleon_scripts/local/00019_touch_home_qguilloteau_nix_com.sh, 616
empty_nfs/kameleon_scripts/local/00237_if_false_true_then_export_opts_wrapper.sh, 739
empty_nfs/kameleon_scripts/local/00041_sed_i_e_s_d_i_mirror_http_host.sh, 769
empty_nfs/kameleon_scripts/local/00109_if_f_home_qguilloteau_nix_comp.sh, 1488
empty_nfs/kameleon_scripts/local/00245_if_false_true_and_and_x86_64_a.sh, 1492
empty_nfs/kameleon_scripts/local/00253_md5sum_empty_nfs._empty_nfs.md_wrapper.sh, 739
empty_nfs/kameleon_scripts/local/00003_rm_f_home_qguilloteau_nix_comp.sh, 617
empty_nfs/kameleon_scripts/local/00091_echo_starting_qemu..._if_true_.sh, 7568
empty_nfs/kameleon_scripts/local/00109_if_f_home_qguilloteau_nix_comp_wrapper.sh, 739
empty_nfs/kameleon_scripts/local/00257_test_true_false_a_bootstrap_ex_wrapper.sh, 739
empty_nfs/kameleon_scripts/local/00255_test_false_false_a_setup_expor.sh, 542
empty_nfs/kameleon_scripts/local/00103_test_false_true_wrapper.sh, 724
empty_nfs/kameleon_scripts/local/00087_if_false_true_then_echo_qemu_v.sh, 733
