image, time, size
empty, 522.7712504863739, 2798237589
hello, 118.73570895195007, 2799346322
empty, 481.4806504249573, 2798237589
hello, 121.82029819488525, 2799346322
empty, 472.8900992870331, 2798237589
hello, 120.53563022613525, 2799346322
empty, 473.0418426990509, 2798237589
hello, 126.86720991134644, 2799346322
empty, 476.93298530578613, 2798237589
hello, 115.63114142417908, 2799346322
