image, size, time
empty_image, 4945643612, 667.9727673530579
hello_image, 4945974241, 689.4167664051056
empty_image, 4945734579, 671.4381432533264
hello_image, 4946190362, 683.2255160808563
empty_image, 4944881732, 689.4681806564331
hello_image, 4943974954, 681.0161492824554
empty_image, 4943505236, 672.7198557853699
hello_image, 4944625570, 693.239627122879
empty_image, 5201731057, 740.1118068695068
hello_image, 5200739225, 770.9796664714813
empty_image, 5201721186, 732.1943590641022
hello_image, 5202111392, 774.9785902500153
empty_image, 5201865172, 731.4352877140045
hello_image, 5202516106, 755.4115059375763
empty_image, 5201547573, 738.3466022014618
hello_image, 5202906526, 779.2877638339996
empty_image, 5201656325, 735.1657590866089
hello_image, 5202513922, 770.4823422431946
