<?xml version="1.0" encoding="UTF-8" standalone="no"?>
<!-- Created with Inkscape (http://www.inkscape.org/) -->

<svg
   version="1.1"
   id="svg2"
   xml:space="preserve"
   width="1329.5612"
   height="1376.9276"
   viewBox="0 0 1329.5612 1376.9276"
   sodipodi:docname="http_serverV2.svg"
   inkscape:version="1.1.2 (0a00cf5339, 2022-02-04)"
   xmlns:inkscape="http://www.inkscape.org/namespaces/inkscape"
   xmlns:sodipodi="http://sodipodi.sourceforge.net/DTD/sodipodi-0.dtd"
   xmlns="http://www.w3.org/2000/svg"
   xmlns:svg="http://www.w3.org/2000/svg"><defs
     id="defs6"><marker
       style="overflow:visible"
       id="Arrow1Lstart"
       refX="0"
       refY="0"
       orient="auto"
       inkscape:stockid="Arrow1Lstart"
       inkscape:isstock="true"><path
         transform="matrix(0.8,0,0,0.8,10,0)"
         style="fill:context-stroke;fill-rule:evenodd;stroke:context-stroke;stroke-width:1pt"
         d="M 0,0 5,-5 -12.5,0 5,5 Z"
         id="path119438" /></marker><marker
       style="overflow:visible"
       id="Arrow1Lend"
       refX="0"
       refY="0"
       orient="auto"
       inkscape:stockid="Arrow1Lend"
       inkscape:isstock="true"><path
         transform="matrix(-0.8,0,0,-0.8,-10,0)"
         style="fill:context-stroke;fill-rule:evenodd;stroke:context-stroke;stroke-width:1pt"
         d="M 0,0 5,-5 -12.5,0 5,5 Z"
         id="path119441" /></marker><inkscape:perspective
       sodipodi:type="inkscape:persp3d"
       inkscape:vp_x="0 : 1732.8456 : 1"
       inkscape:vp_y="0 : 1000 : 0"
       inkscape:vp_z="1122.5196 : 1732.8456 : 1"
       inkscape:persp3d-origin="561.25983 : 1600.5616 : 1"
       id="perspective7102" /><marker
       style="overflow:visible"
       id="Arrow1Lend-0"
       refX="0"
       refY="0"
       orient="auto"
       inkscape:stockid="Arrow1Lend"
       inkscape:isstock="true"><path
         transform="matrix(-0.8,0,0,-0.8,-10,0)"
         style="fill:context-stroke;fill-rule:evenodd;stroke:context-stroke;stroke-width:1pt"
         d="M 0,0 5,-5 -12.5,0 5,5 Z"
         id="path119441-2" /></marker><marker
       style="overflow:visible"
       id="Arrow1Lstart-9"
       refX="0"
       refY="0"
       orient="auto"
       inkscape:stockid="Arrow1Lstart"
       inkscape:isstock="true"><path
         transform="matrix(0.8,0,0,0.8,10,0)"
         style="fill:context-stroke;fill-rule:evenodd;stroke:context-stroke;stroke-width:1pt"
         d="M 0,0 5,-5 -12.5,0 5,5 Z"
         id="path119438-4" /></marker></defs><sodipodi:namedview
     id="namedview4"
     pagecolor="#ffffff"
     bordercolor="#666666"
     borderopacity="1.0"
     inkscape:pageshadow="2"
     inkscape:pageopacity="0.0"
     inkscape:pagecheckerboard="0"
     showgrid="false"
     showborder="true"
     fit-margin-top="0"
     fit-margin-left="0"
     fit-margin-right="0"
     fit-margin-bottom="0"
     inkscape:zoom="0.675"
     inkscape:cx="522.96516"
     inkscape:cy="1222.1245"
     inkscape:window-width="1920"
     inkscape:window-height="1131"
     inkscape:window-x="0"
     inkscape:window-y="0"
     inkscape:window-maximized="1"
     inkscape:current-layer="g10"
     showguides="false" /><g
     id="g8"
     inkscape:groupmode="layer"
     inkscape:label="http_server"
     transform="matrix(1.3333333,0,0,1.3333333,2789.257,672.12692)"><g
       id="g10"><g
         sodipodi:type="inkscape:box3d"
         id="g7104"
         style="fill:#000000;fill-opacity:0;stroke:#000000;stroke-width:10;stroke-linejoin:round;stroke-miterlimit:4;stroke-dasharray:none;paint-order:normal"
         inkscape:perspectiveID="#perspective7102"
         inkscape:corner0="-1.4686051 : -0.87790202 : 0 : 1"
         inkscape:corner7="-1.754089 : -1.0437536 : 0.25 : 1"><path
           sodipodi:type="inkscape:box3dside"
           id="path7110"
           style="fill:#8686bf;fill-rule:evenodd;stroke:none;stroke-linejoin:round"
           inkscape:box3dsidetype="3"
           d="m -2990.2362,-2387.8312 340.077,612.0891 v -164.9523 l -340.077,-712.5814 z"
           points="-2650.1592,-1775.7421 -2650.1592,-1940.6944 -2990.2362,-2653.2758 -2990.2362,-2387.8312 " /><path
           sodipodi:type="inkscape:box3dside"
           id="path7106"
           style="fill:#353564;fill-rule:evenodd;stroke:none;stroke-linejoin:round"
           inkscape:box3dsidetype="6"
           d="m -2990.2362,-2387.8312 v -265.4446 l -1990.0989,-2152.5596 v 569.0109 z"
           points="-2990.2362,-2653.2758 -4980.3351,-4805.8354 -4980.3351,-4236.8245 -2990.2362,-2387.8312 " /><path
           sodipodi:type="inkscape:box3dside"
           id="path7108"
           style="fill:#4d4d9f;fill-rule:evenodd;stroke:none;stroke-linejoin:round"
           inkscape:box3dsidetype="5"
           d="m -2990.2362,-2387.8312 340.077,612.0891 -694.3745,-498.2793 -1635.8014,-1962.8031 z"
           points="-2650.1592,-1775.7421 -3344.5337,-2274.0214 -4980.3351,-4236.8245 -2990.2362,-2387.8312 " /><path
           sodipodi:type="inkscape:box3dside"
           id="path7116"
           style="fill:#e9e9ff;fill-rule:evenodd;stroke:none;stroke-linejoin:round"
           inkscape:box3dsidetype="11"
           d="m -4980.3351,-4236.8245 1635.8014,1962.8031 v -246.7593 l -1635.8014,-2285.0547 z"
           points="-3344.5337,-2274.0214 -3344.5337,-2520.7807 -4980.3351,-4805.8354 -4980.3351,-4236.8245 " /><path
           sodipodi:type="inkscape:box3dside"
           id="path7112"
           style="fill:#d7d7ff;fill-rule:evenodd;stroke:none;stroke-linejoin:round"
           inkscape:box3dsidetype="14"
           d="m -2650.1592,-1775.7421 v -164.9523 l -694.3745,-580.0863 v 246.7593 z"
           points="-2650.1592,-1940.6944 -3344.5337,-2520.7807 -3344.5337,-2274.0214 -2650.1592,-1775.7421 " /><path
           sodipodi:type="inkscape:box3dside"
           id="path7114"
           style="fill:#afafde;fill-rule:evenodd;stroke:none;stroke-linejoin:round"
           inkscape:box3dsidetype="13"
           d="m -2990.2362,-2653.2758 340.077,712.5814 -694.3745,-580.0863 -1635.8014,-2285.0547 z"
           points="-2650.1592,-1940.6944 -3344.5337,-2520.7807 -4980.3351,-4805.8354 -2990.2362,-2653.2758 " /></g><g
         id="g386747-4"
         transform="translate(-113.46742,-407.96048)"
         style="fill:#e60000;fill-opacity:0.241114"><g
           id="g452256-9"
           transform="translate(-178.69265,18.08537)" /></g><path
         style="color:#000000;fill:#000000;stroke-width:1.09021;-inkscape-stroke:none"
         d="m -1681.875,-481.70312 v 0.67769 384.276903 h 584.0369 V -481.70312 Z m 1.7829,1.35539 h 580.4711 v 382.243816 h -580.4711 z"
         id="rect388239" /><text
         xml:space="preserve"
         style="font-size:24px;line-height:1.25;font-family:sans-serif;stroke-width:0.75"
         x="-2079.0327"
         y="-408.07181"
         id="text264807"><tspan
           sodipodi:role="line"
           id="tspan264805"
           style="font-size:24px;stroke-width:0.75"
           x="-2079.0327"
           y="-408.07181">Frontend</tspan></text><rect
         style="fill:#000000;fill-opacity:0;stroke:#110000;stroke-width:3;stroke-linecap:butt;stroke-linejoin:round;stroke-miterlimit:4;stroke-dasharray:none;stroke-dashoffset:0;stroke-opacity:1;paint-order:normal"
         id="rect277522"
         width="128.90976"
         height="56.716995"
         x="-2090.4426"
         y="-445.37756"
         ry="10.565775" /><text
         xml:space="preserve"
         style="font-size:22px;line-height:1.25;font-family:sans-serif;stroke-width:0.75"
         x="-1941.3179"
         y="-432.1701"
         id="text282167"><tspan
           sodipodi:role="line"
           id="tspan282165"
           style="stroke-width:0.75"
           x="-1941.3179"
           y="-432.1701">kexec via ssh</tspan></text><text
         xml:space="preserve"
         style="font-size:22px;line-height:1.25;font-family:sans-serif;stroke-width:0.75"
         x="-1922.6982"
         y="-398.38232"
         id="text286989"><tspan
           sodipodi:role="line"
           style="font-style:oblique;font-variant:normal;font-weight:bold;font-stretch:normal;font-family:FreeMono;-inkscape-font-specification:'FreeMono Bold Oblique';stroke-width:0.75"
           x="-1922.6982"
           y="-398.38232"
           id="tspan4134">deployment-infos</tspan></text><g
         id="g18476"
         transform="translate(-6)"><rect
           style="fill:#dedede;fill-opacity:1;stroke:#110000;stroke-width:3.46298;stroke-linecap:butt;stroke-linejoin:miter;stroke-miterlimit:4;stroke-dasharray:0, 38.0929;stroke-dashoffset:0;stroke-opacity:0;paint-order:normal"
           id="rect383911-9"
           width="542.13928"
           height="91.037903"
           x="-1650.399"
           y="-455.42722"
           ry="0" /><text
           xml:space="preserve"
           style="font-size:24px;line-height:1.25;font-family:sans-serif;stroke-width:0.75"
           x="-1645.1426"
           y="-431.49649"
           id="text286989-0"><tspan
             sodipodi:role="line"
             id="tspan286987-6"
             style="font-style:normal;font-variant:normal;font-weight:bold;font-stretch:normal;font-size:24px;font-family:'Liberation Mono';-inkscape-font-specification:'Liberation Mono Bold';stroke-width:0.75"
             x="-1645.1426"
             y="-431.49649">$&gt; INITRD={path_on_NFS}/initrd \</tspan><tspan
             sodipodi:role="line"
             style="font-style:normal;font-variant:normal;font-weight:bold;font-stretch:normal;font-size:24px;font-family:'Liberation Mono';-inkscape-font-specification:'Liberation Mono Bold';stroke-width:0.75"
             x="-1645.1426"
             y="-401.30734"
             id="tspan505329">KERNEL={path_on_NFS}/kernel \</tspan><tspan
             sodipodi:role="line"
             style="font-style:normal;font-variant:normal;font-weight:bold;font-stretch:normal;font-size:24px;font-family:'Liberation Mono';-inkscape-font-specification:'Liberation Mono Bold';stroke-width:0.75"
             x="-1645.1426"
             y="-371.11816"
             id="tspan511439">kexec -l $KERNEL --initrd=$INITRD ...</tspan></text></g><g
         id="g386628"
         transform="translate(-149.28967,67.76285)"><g
           id="g79523"><rect
             style="fill:#000000;fill-opacity:0.042268;stroke:#110000;stroke-width:0.75;stroke-linecap:butt;stroke-linejoin:miter;stroke-miterlimit:4;stroke-dasharray:none;stroke-dashoffset:0;stroke-opacity:1;paint-order:normal"
             id="rect385711"
             width="98.431747"
             height="48.067299"
             x="-1471.3999"
             y="-422.90414" /><text
             xml:space="preserve"
             style="font-style:normal;font-variant:normal;font-weight:normal;font-stretch:normal;font-size:24px;line-height:1.25;font-family:sans-serif;-inkscape-font-specification:sans-serif;stroke-width:0.75"
             x="-1450.6958"
             y="-390.29236"
             id="text319461"><tspan
               sodipodi:role="line"
               id="tspan319459"
               style="font-style:normal;font-variant:normal;font-weight:normal;font-stretch:normal;font-size:24px;font-family:sans-serif;-inkscape-font-specification:sans-serif;stroke-width:0.75"
               x="-1450.6958"
               y="-390.29236">Boot</tspan></text></g></g><g
         id="g79540"
         transform="translate(0,-2.1021651)"><g
           id="g90357-8-1"
           transform="matrix(0,0.32160575,-0.32160575,0,-1594.5925,-447.89112)"><rect
             style="fill:#000000;fill-opacity:1;stroke:#000000;stroke-width:2.25;stroke-linejoin:round;stroke-miterlimit:4;stroke-dasharray:none;paint-order:normal"
             id="rect90152-5-9"
             width="7.3845248"
             height="54.205101"
             x="627.2478"
             y="-354.45728"
             ry="3.3993824" /><rect
             style="fill:#000000;fill-opacity:1;stroke:#000000;stroke-width:2.25;stroke-linejoin:round;stroke-miterlimit:4;stroke-dasharray:none;paint-order:normal"
             id="rect90152-8-3-9"
             width="7.3845248"
             height="54.205101"
             x="-331.047"
             y="-658.0426"
             ry="3.3993824"
             transform="rotate(90)" /></g><text
           xml:space="preserve"
           style="font-size:22px;line-height:1.25;font-family:sans-serif;stroke-width:0.75"
           x="-1464.5627"
           y="-239.6019"
           id="text286989-5"><tspan
             sodipodi:role="line"
             style="font-style:oblique;font-variant:normal;font-weight:bold;font-stretch:normal;font-family:FreeMono;-inkscape-font-specification:'FreeMono Bold Oblique';stroke-width:0.75"
             x="-1464.5627"
             y="-239.6019"
             id="tspan444150">deployment-infos</tspan></text><g
           id="g386633"
           transform="translate(-151.55334,86.77434)"><g
             id="g79518"><rect
               style="fill:#000000;fill-opacity:0.042268;stroke:#110000;stroke-width:0.75;stroke-linecap:butt;stroke-linejoin:miter;stroke-miterlimit:4;stroke-dasharray:none;stroke-dashoffset:0;stroke-opacity:1;paint-order:normal"
               id="rect385711-0"
               width="107.43176"
               height="48.067291"
               x="-1469.1362"
               y="-354.82227" /><text
               xml:space="preserve"
               style="font-size:24px;line-height:1.25;font-family:sans-serif;-inkscape-font-specification:sans-serif;stroke-width:0.75"
               x="-1457.4146"
               y="-324.37848"
               id="text328815"><tspan
                 sodipodi:role="line"
                 id="tspan328813"
                 style="font-size:24px;stroke-width:0.75"
                 x="-1457.4146"
                 y="-324.37848">Stage1</tspan></text></g></g></g><path
         id="path386771"
         style="fill:#000000;fill-opacity:1;stroke:#110000;stroke-width:0.0951146;stroke-linecap:butt;stroke-linejoin:miter;stroke-miterlimit:4;stroke-dasharray:none;stroke-dashoffset:0;stroke-opacity:1;paint-order:normal"
         inkscape:transform-center-x="4.5644496e-05"
         inkscape:transform-center-y="2.3693882"
         d="m -1573.5392,-301.38124 v 14.82874 h -4.0903 l 3.0779,5.33105 3.0781,5.33105 3.0778,-5.33105 3.0778,-5.33105 h -4.2532 v -14.82874 z" /><g
         id="g79560"
         transform="translate(0,-6)"><g
           id="g386740"
           transform="translate(-148.97741,72.43252)"><g
             id="g79528"><rect
               style="fill:#000000;fill-opacity:0.042268;stroke:#110000;stroke-width:0.75;stroke-linecap:butt;stroke-linejoin:miter;stroke-miterlimit:4;stroke-dasharray:none;stroke-dashoffset:0;stroke-opacity:1;paint-order:normal"
               id="rect385711-3"
               width="179.43176"
               height="48.067291"
               x="-1471.7122"
               y="-253.38655" /><text
               xml:space="preserve"
               style="font-size:24px;line-height:1.25;font-family:sans-serif;-inkscape-font-specification:sans-serif;stroke-width:0.75"
               x="-1466.4006"
               y="-222.94275"
               id="text338575"><tspan
                 sodipodi:role="line"
                 id="tspan338573"
                 style="font-size:24px;stroke-width:0.75"
                 x="-1466.4006"
                 y="-222.94275">Context setup</tspan></text></g></g><g
           id="g452256"
           transform="translate(-100.22633,68.490459)"
           style="fill:#e60000;fill-opacity:0.241114"><rect
             style="fill:#dddede;fill-opacity:1;stroke:#110000;stroke-width:3;stroke-linecap:butt;stroke-linejoin:miter;stroke-miterlimit:4;stroke-dasharray:0, 33;stroke-dashoffset:0;stroke-opacity:0;paint-order:normal"
             id="rect383911"
             width="177.60718"
             height="104.86924"
             x="-1244.3218"
             y="-276.05029"
             ry="0" /><text
             xml:space="preserve"
             style="font-size:22px;line-height:1.25;font-family:sans-serif;-inkscape-font-specification:sans-serif;fill:#000000;fill-opacity:1;stroke-width:0.75"
             x="-1226.0554"
             y="-244.5071"
             id="text353753"><tspan
               sodipodi:role="line"
               id="tspan353751"
               style="font-style:normal;font-variant:normal;font-weight:bold;font-stretch:normal;font-family:FreeMono;-inkscape-font-specification:'FreeMono Bold';fill:#000000;fill-opacity:1;stroke-width:0.75"
               x="-1226.0554"
               y="-244.5071">/etc/host</tspan><tspan
               sodipodi:role="line"
               style="font-style:normal;font-variant:normal;font-weight:bold;font-stretch:normal;font-family:FreeMono;-inkscape-font-specification:'FreeMono Bold';fill:#000000;fill-opacity:1;stroke-width:0.75"
               x="-1226.0554"
               y="-216.12193"
               id="tspan355933">/root/.ssh/</tspan><tspan
               sodipodi:role="line"
               style="font-style:normal;font-variant:normal;font-weight:bold;font-stretch:normal;font-family:FreeMono;-inkscape-font-specification:'FreeMono Bold';fill:#000000;fill-opacity:1;stroke-width:0.75"
               x="-1226.0554"
               y="-187.73679"
               id="tspan355935">...</tspan></text></g><path
           id="path386771-3-7"
           style="fill:#000000;fill-opacity:0;stroke:#000000;stroke-width:0.75;stroke-linecap:butt;stroke-linejoin:miter;stroke-miterlimit:4;stroke-dasharray:none;stroke-dashoffset:0;stroke-opacity:1;paint-order:normal"
           inkscape:transform-center-x="-3.2958794"
           inkscape:transform-center-y="4.9992907e-05"
           d="m -1436.7398,-152.84649 h 59.6266 v 4.89721 l 7.4154,-3.68509 7.4155,-3.68532 -7.4155,-3.68497 -7.4154,-3.68497 v 5.09224 h -59.6266 z"
           sodipodi:nodetypes="cccccccccc" /></g><path
         id="path386771-8"
         style="fill:#000000;fill-opacity:1;stroke:#110000;stroke-width:0.0951146;stroke-linecap:butt;stroke-linejoin:miter;stroke-miterlimit:4;stroke-dasharray:none;stroke-dashoffset:0;stroke-opacity:1;paint-order:normal"
         inkscape:transform-center-x="4.5644496e-05"
         inkscape:transform-center-y="2.3693882"
         d="m -1573.5392,-216.39001 v 14.82874 h -4.0903 l 3.0779,5.33105 3.0781,5.33105 3.0778,-5.33105 3.0778,-5.33105 h -4.2532 v -14.82874 z" /><path
         id="path386771-8-2"
         style="fill:#ffffff;fill-opacity:1;stroke:#000000;stroke-width:1.5;stroke-linecap:butt;stroke-linejoin:miter;stroke-miterlimit:4;stroke-dasharray:none;stroke-dashoffset:0;stroke-opacity:1;paint-order:normal"
         inkscape:transform-center-x="4.6337848e-05"
         inkscape:transform-center-y="4.5778258"
         d="m -1576.0436,-132.93756 v 28.65015 h -9.0497 l 6.8098,10.299949 6.8102,10.299959 6.8096,-10.299959 6.8096,-10.299949 h -9.4101 v -28.65015 z" /><g
         id="g387788"
         transform="matrix(0.86376512,0,0,0.86376512,-407.26727,-331.03614)"><path
           style="fill:none;stroke:#000000;stroke-width:1.5;stroke-linecap:butt;stroke-linejoin:miter;stroke-miterlimit:4;stroke-dasharray:none;stroke-opacity:1"
           d="m -1797.6711,-102.45243 h 331.6739"
           id="path277557"
           sodipodi:nodetypes="cc" /><path
           id="path387490"
           style="stroke:#110000;stroke-width:0.75"
           inkscape:transform-center-x="-2.9683623"
           inkscape:transform-center-y="6.5035023e-05"
           d="m -1447.3448,-102.44404 -22.4634,7.399354 0.01,-14.815284 z"
           sodipodi:nodetypes="cccc" /></g><g
         id="g97290"
         transform="translate(-113.71295,-0.77361385)"><path
           id="rect387932"
           style="fill:#fbf8fa;fill-opacity:1;stroke:#000000;stroke-width:1.5;stroke-miterlimit:4;stroke-dasharray:none;stroke-opacity:1"
           d="m -1574.2196,-502.57159 h 269.6856 v 43.62505 h -269.6856 z" /><text
           xml:space="preserve"
           style="font-size:24px;line-height:1.25;font-family:sans-serif;-inkscape-font-specification:sans-serif;stroke-width:0.75"
           x="-1557.9354"
           y="-474.13797"
           id="text91394"><tspan
             sodipodi:role="line"
             id="tspan91392"
             style="font-size:24px;stroke-width:0.75"
             x="-1557.9354"
             y="-474.13797">Node's boot phases</tspan></text></g><g
         id="g97290-6"
         transform="translate(-109.09497,424.52382)"><path
           id="rect387932-2"
           style="fill:#fbf8fa;fill-opacity:1;stroke:#000000;stroke-width:1.5;stroke-miterlimit:4;stroke-dasharray:none;stroke-opacity:1"
           d="m -1511.2196,-502.57159 h 153.8377 v 43.62505 h -153.8377 z" /><text
           xml:space="preserve"
           style="font-size:24px;line-height:1.25;font-family:sans-serif;-inkscape-font-specification:sans-serif;stroke-width:0.75"
           x="-1494.9354"
           y="-474.13797"
           id="text91394-9"><tspan
             sodipodi:role="line"
             id="tspan91392-1"
             style="font-size:24px;stroke-width:0.75"
             x="-1494.9354"
             y="-474.13797">Init Phase</tspan></text></g><g
         id="g164347"
         transform="translate(1400.5079,-143.77305)"><text
           xml:space="preserve"
           style="font-size:24px;line-height:1.25;font-family:sans-serif;stroke-width:0.75"
           x="-3481.8677"
           y="474.03381"
           id="text264807-35-2"><tspan
             sodipodi:role="line"
             id="tspan264805-62-3"
             style="font-size:24px;stroke-width:0.75"
             x="-3481.8677"
             y="474.03381">HTTP server</tspan></text><rect
           style="fill:#000000;fill-opacity:0;stroke:#110000;stroke-width:3;stroke-linecap:butt;stroke-linejoin:round;stroke-miterlimit:4;stroke-dasharray:none;stroke-dashoffset:0;stroke-opacity:1;paint-order:normal"
           id="rect277522-9-7"
           width="165.54082"
           height="56.71701"
           x="-3490.9507"
           y="437.09717"
           ry="10.565775" /><text
           xml:space="preserve"
           style="font-size:22px;line-height:1.25;font-family:sans-serif;stroke-width:0.75"
           x="-3207.4458"
           y="446.56119"
           id="text282167-9-3-5"><tspan
             sodipodi:role="line"
             id="tspan282165-7-7-9"
             style="stroke-width:0.75"
             x="-3207.4458"
             y="446.56119">GET <tspan
   style="font-style:oblique;font-variant:normal;font-weight:bold;font-stretch:normal;font-family:FreeMono;-inkscape-font-specification:'FreeMono Bold Oblique'"
   id="tspan574440-2">/URL</tspan></tspan></text><text
           xml:space="preserve"
           style="font-size:22px;line-height:1.25;font-family:sans-serif;stroke-width:0.75"
           x="-3320.436"
           y="496.45615"
           id="text282167-9-3-0-2"><tspan
             sodipodi:role="line"
             style="font-style:oblique;font-variant:normal;font-weight:bold;font-stretch:normal;font-family:FreeMono;-inkscape-font-specification:'FreeMono Bold Oblique';stroke-width:0.75"
             x="-3320.436"
             y="496.45615"
             id="tspan7756-8">deployment-infos</tspan><tspan
             sodipodi:role="line"
             style="font-style:oblique;font-variant:normal;font-weight:bold;font-stretch:normal;font-family:FreeMono;-inkscape-font-specification:'FreeMono Bold Oblique';stroke-width:0.75"
             x="-3320.436"
             y="523.95618"
             id="tspan7754-9" /></text><path
           style="fill:none;stroke:#000000;stroke-width:1.29565;stroke-linecap:butt;stroke-linejoin:miter;stroke-miterlimit:4;stroke-dasharray:none;stroke-opacity:1"
           d="m -3022.4886,452.87865 h -282.2409"
           id="path277557-3-1-7"
           sodipodi:nodetypes="cc" /><path
           id="path387490-8-9-3"
           style="stroke:#110000;stroke-width:0.647824"
           inkscape:transform-center-x="2.968416"
           inkscape:transform-center-y="-7.1110839e-05"
           d="m -3324.4568,452.8714 19.4031,-6.3913 -0.01,12.79692 z"
           sodipodi:nodetypes="cccc" /><path
           style="fill:none;stroke:#000000;stroke-width:1.29565;stroke-linecap:butt;stroke-linejoin:miter;stroke-miterlimit:4;stroke-dasharray:none;stroke-opacity:1"
           d="m -3323.9098,474.95422 h 301.169"
           id="path277557-3-1-8-6"
           sodipodi:nodetypes="cc" /><path
           id="path387490-8-9-0-1"
           style="stroke:#110000;stroke-width:0.647824"
           inkscape:transform-center-x="-2.9683802"
           inkscape:transform-center-y="6.5362005e-05"
           d="m -3022.6066,474.96146 -19.4031,6.3913 0.01,-12.79692 z"
           sodipodi:nodetypes="cccc" /><g
           id="g90357-8-1-7-2"
           transform="matrix(0,0.58007607,-0.58007607,0,-3616.3864,-4.32485)"><rect
             style="fill:#000000;fill-opacity:1;stroke:#000000;stroke-width:2.25;stroke-linejoin:round;stroke-miterlimit:4;stroke-dasharray:none;paint-order:normal"
             id="rect90152-5-9-76-9"
             width="7.3845248"
             height="54.205101"
             x="627.2478"
             y="-354.45728"
             ry="3.3993824" /><rect
             style="fill:#000000;fill-opacity:1;stroke:#000000;stroke-width:2.25;stroke-linejoin:round;stroke-miterlimit:4;stroke-dasharray:none;paint-order:normal"
             id="rect90152-8-3-9-9-3"
             width="7.3845248"
             height="54.205101"
             x="-331.047"
             y="-658.0426"
             ry="3.3993824"
             transform="rotate(90)" /></g></g><path
         style="fill:none;stroke:#000000;stroke-width:9;stroke-linecap:butt;stroke-linejoin:miter;stroke-miterlimit:4;stroke-dasharray:none;stroke-opacity:1"
         d="m -2091.9427,14.177273 h 997.1708"
         id="path656039"
         sodipodi:nodetypes="cc" /><text
         xml:space="preserve"
         style="font-size:24px;line-height:1.25;font-family:sans-serif;-inkscape-font-specification:sans-serif;stroke-width:0.75"
         x="-2094.2981"
         y="-47.825844"
         id="text105054"><tspan
           sodipodi:role="line"
           id="tspan105052"
           style="font-style:normal;font-variant:normal;font-weight:bold;font-stretch:normal;font-size:24px;font-family:sans-serif;-inkscape-font-specification:'sans-serif Bold';stroke-width:0.75"
           x="-2094.2981"
           y="-47.825844">Kernel parameters ≤4096 bytes</tspan></text><g
         id="g153926"
         transform="translate(2.2001953,-73.5)"><path
           style="color:#000000;fill:#000000;stroke-width:1.09021;-inkscape-stroke:none"
           d="m -1684.0753,154.07015 v 0.67769 384.2769 h 584.0369 V 154.07015 Z m 1.7829,1.35539 h 580.4711 v 382.24382 h -580.4711 z"
           id="rect388239-1" /><text
           xml:space="preserve"
           style="font-size:24px;line-height:1.25;font-family:sans-serif;stroke-width:0.75"
           x="-2081.2329"
           y="227.70146"
           id="text264807-9"><tspan
             sodipodi:role="line"
             id="tspan264805-4"
             style="font-size:24px;stroke-width:0.75"
             x="-2081.2329"
             y="227.70146">Frontend</tspan></text><rect
           style="fill:#000000;fill-opacity:0;stroke:#110000;stroke-width:3;stroke-linecap:butt;stroke-linejoin:round;stroke-miterlimit:4;stroke-dasharray:none;stroke-dashoffset:0;stroke-opacity:1;paint-order:normal"
           id="rect277522-7"
           width="128.90976"
           height="56.716995"
           x="-2092.6428"
           y="190.39571"
           ry="10.565775" /><text
           xml:space="preserve"
           style="font-size:22px;line-height:1.25;font-family:sans-serif;stroke-width:0.75"
           x="-1943.5181"
           y="203.60316"
           id="text282167-8"><tspan
             sodipodi:role="line"
             id="tspan282165-4"
             style="stroke-width:0.75"
             x="-1943.5181"
             y="203.60316">kexec via ssh</tspan></text><text
           xml:space="preserve"
           style="font-size:22px;line-height:1.25;font-family:sans-serif;stroke-width:0.75"
           x="-1924.8984"
           y="237.39095"
           id="text286989-50"><tspan
             sodipodi:role="line"
             style="font-style:oblique;font-variant:normal;font-weight:bold;font-stretch:normal;font-family:FreeMono;-inkscape-font-specification:'FreeMono Bold Oblique';stroke-width:0.75"
             x="-1924.8984"
             y="237.39095"
             id="tspan4134-3">deployment-infos</tspan></text><g
           id="g18476-6"
           transform="translate(-8.2002524,635.77327)"><rect
             style="fill:#dedede;fill-opacity:1;stroke:#110000;stroke-width:3.46298;stroke-linecap:butt;stroke-linejoin:miter;stroke-miterlimit:4;stroke-dasharray:0, 38.0929;stroke-dashoffset:0;stroke-opacity:0;paint-order:normal"
             id="rect383911-9-1"
             width="542.13928"
             height="91.037903"
             x="-1650.399"
             y="-455.42722"
             ry="0" /><text
             xml:space="preserve"
             style="font-size:24px;line-height:1.25;font-family:sans-serif;stroke-width:0.75"
             x="-1645.1426"
             y="-431.49649"
             id="text286989-0-0"><tspan
               sodipodi:role="line"
               id="tspan286987-6-6"
               style="font-style:normal;font-variant:normal;font-weight:bold;font-stretch:normal;font-size:24px;font-family:'Liberation Mono';-inkscape-font-specification:'Liberation Mono Bold';stroke-width:0.75"
               x="-1645.1426"
               y="-431.49649">$&gt; INITRD={path_on_NFS}/initrd \</tspan><tspan
               sodipodi:role="line"
               style="font-style:normal;font-variant:normal;font-weight:bold;font-stretch:normal;font-size:24px;font-family:'Liberation Mono';-inkscape-font-specification:'Liberation Mono Bold';stroke-width:0.75"
               x="-1645.1426"
               y="-401.30734"
               id="tspan505329-3">KERNEL={path_on_NFS}/kernel \</tspan><tspan
               sodipodi:role="line"
               style="font-style:normal;font-variant:normal;font-weight:bold;font-stretch:normal;font-size:24px;font-family:'Liberation Mono';-inkscape-font-specification:'Liberation Mono Bold';stroke-width:0.75"
               x="-1645.1426"
               y="-371.11816"
               id="tspan511439-2">kexec -l $KERNEL --initrd=$INITRD ...</tspan></text></g><g
           id="g386628-0"
           transform="translate(-151.48992,703.53612)"><g
             id="g79523-6"><rect
               style="fill:#000000;fill-opacity:0.042268;stroke:#110000;stroke-width:0.75;stroke-linecap:butt;stroke-linejoin:miter;stroke-miterlimit:4;stroke-dasharray:none;stroke-dashoffset:0;stroke-opacity:1;paint-order:normal"
               id="rect385711-1"
               width="98.431747"
               height="48.067299"
               x="-1471.3999"
               y="-422.90414" /><text
               xml:space="preserve"
               style="font-style:normal;font-variant:normal;font-weight:normal;font-stretch:normal;font-size:24px;line-height:1.25;font-family:sans-serif;-inkscape-font-specification:sans-serif;stroke-width:0.75"
               x="-1450.6958"
               y="-390.29236"
               id="text319461-5"><tspan
                 sodipodi:role="line"
                 id="tspan319459-5"
                 style="font-style:normal;font-variant:normal;font-weight:normal;font-stretch:normal;font-size:24px;font-family:sans-serif;-inkscape-font-specification:sans-serif;stroke-width:0.75"
                 x="-1450.6958"
                 y="-390.29236">Boot</tspan></text></g></g><g
           id="g79540-4"
           transform="translate(-2.2002524,633.6711)"><g
             id="g90357-8-1-7"
             transform="matrix(0,0.32160575,-0.32160575,0,-1594.5925,-447.89112)"><rect
               style="fill:#000000;fill-opacity:1;stroke:#000000;stroke-width:2.25;stroke-linejoin:round;stroke-miterlimit:4;stroke-dasharray:none;paint-order:normal"
               id="rect90152-5-9-6"
               width="7.3845248"
               height="54.205101"
               x="627.2478"
               y="-354.45728"
               ry="3.3993824" /><rect
               style="fill:#000000;fill-opacity:1;stroke:#000000;stroke-width:2.25;stroke-linejoin:round;stroke-miterlimit:4;stroke-dasharray:none;paint-order:normal"
               id="rect90152-8-3-9-5"
               width="7.3845248"
               height="54.205101"
               x="-331.047"
               y="-658.0426"
               ry="3.3993824"
               transform="rotate(90)" /></g><text
             xml:space="preserve"
             style="font-size:22px;line-height:1.25;font-family:sans-serif;stroke-width:0.75"
             x="-1464.5627"
             y="-239.6019"
             id="text286989-5-6"><tspan
               sodipodi:role="line"
               style="font-style:oblique;font-variant:normal;font-weight:bold;font-stretch:normal;font-family:FreeMono;-inkscape-font-specification:'FreeMono Bold Oblique';stroke-width:0.75"
               x="-1464.5627"
               y="-239.6019"
               id="tspan444150-9">deployment-infos</tspan></text><g
             id="g386633-3"
             transform="translate(-151.55334,86.77434)"><g
               id="g79518-7"><rect
                 style="fill:#000000;fill-opacity:0.042268;stroke:#110000;stroke-width:0.75;stroke-linecap:butt;stroke-linejoin:miter;stroke-miterlimit:4;stroke-dasharray:none;stroke-dashoffset:0;stroke-opacity:1;paint-order:normal"
                 id="rect385711-0-4"
                 width="107.43176"
                 height="48.067291"
                 x="-1469.1362"
                 y="-354.82227" /><text
                 xml:space="preserve"
                 style="font-size:24px;line-height:1.25;font-family:sans-serif;-inkscape-font-specification:sans-serif;stroke-width:0.75"
                 x="-1457.4146"
                 y="-324.37848"
                 id="text328815-5"><tspan
                   sodipodi:role="line"
                   id="tspan328813-2"
                   style="font-size:24px;stroke-width:0.75"
                   x="-1457.4146"
                   y="-324.37848">Stage1</tspan></text></g></g></g><path
           id="path386771-5"
           style="fill:#000000;fill-opacity:1;stroke:#110000;stroke-width:0.0951146;stroke-linecap:butt;stroke-linejoin:miter;stroke-miterlimit:4;stroke-dasharray:none;stroke-dashoffset:0;stroke-opacity:1;paint-order:normal"
           inkscape:transform-center-x="4.5644496e-05"
           inkscape:transform-center-y="2.3693882"
           d="m -1575.7395,334.39203 v 14.82874 h -4.0903 l 3.0779,5.33105 3.0781,5.33105 3.0778,-5.33105 3.0778,-5.33105 h -4.2532 v -14.82874 z" /><g
           id="g79560-4"
           transform="translate(-2.2002524,629.77327)"><g
             id="g386740-7"
             transform="translate(-148.97741,72.43252)"><g
               id="g79528-4"><rect
                 style="fill:#000000;fill-opacity:0.042268;stroke:#110000;stroke-width:0.75;stroke-linecap:butt;stroke-linejoin:miter;stroke-miterlimit:4;stroke-dasharray:none;stroke-dashoffset:0;stroke-opacity:1;paint-order:normal"
                 id="rect385711-3-4"
                 width="179.43176"
                 height="48.067291"
                 x="-1471.7122"
                 y="-253.38655" /><text
                 xml:space="preserve"
                 style="font-size:24px;line-height:1.25;font-family:sans-serif;-inkscape-font-specification:sans-serif;stroke-width:0.75"
                 x="-1466.4006"
                 y="-222.94275"
                 id="text338575-3"><tspan
                   sodipodi:role="line"
                   id="tspan338573-0"
                   style="font-size:24px;stroke-width:0.75"
                   x="-1466.4006"
                   y="-222.94275">Context setup</tspan></text></g></g><g
             id="g452256-7"
             transform="translate(-100.22633,68.490459)"
             style="fill:#e60000;fill-opacity:0.241114"><rect
               style="fill:#dddede;fill-opacity:1;stroke:#110000;stroke-width:3;stroke-linecap:butt;stroke-linejoin:miter;stroke-miterlimit:4;stroke-dasharray:0, 33;stroke-dashoffset:0;stroke-opacity:0;paint-order:normal"
               id="rect383911-8"
               width="177.60718"
               height="104.86924"
               x="-1244.3218"
               y="-276.05029"
               ry="0" /><text
               xml:space="preserve"
               style="font-size:22px;line-height:1.25;font-family:sans-serif;-inkscape-font-specification:sans-serif;fill:#000000;fill-opacity:1;stroke-width:0.75"
               x="-1226.0554"
               y="-244.5071"
               id="text353753-6"><tspan
                 sodipodi:role="line"
                 id="tspan353751-8"
                 style="font-style:normal;font-variant:normal;font-weight:bold;font-stretch:normal;font-family:FreeMono;-inkscape-font-specification:'FreeMono Bold';fill:#000000;fill-opacity:1;stroke-width:0.75"
                 x="-1226.0554"
                 y="-244.5071">/etc/host</tspan><tspan
                 sodipodi:role="line"
                 style="font-style:normal;font-variant:normal;font-weight:bold;font-stretch:normal;font-family:FreeMono;-inkscape-font-specification:'FreeMono Bold';fill:#000000;fill-opacity:1;stroke-width:0.75"
                 x="-1226.0554"
                 y="-216.12193"
                 id="tspan355933-8">/root/.ssh/</tspan><tspan
                 sodipodi:role="line"
                 style="font-style:normal;font-variant:normal;font-weight:bold;font-stretch:normal;font-family:FreeMono;-inkscape-font-specification:'FreeMono Bold';fill:#000000;fill-opacity:1;stroke-width:0.75"
                 x="-1226.0554"
                 y="-187.73679"
                 id="tspan355935-4">...</tspan></text></g><path
             id="path386771-3-7-3"
             style="fill:#000000;fill-opacity:0;stroke:#000000;stroke-width:0.75;stroke-linecap:butt;stroke-linejoin:miter;stroke-miterlimit:4;stroke-dasharray:none;stroke-dashoffset:0;stroke-opacity:1;paint-order:normal"
             inkscape:transform-center-x="-3.2958794"
             inkscape:transform-center-y="4.9992907e-05"
             d="m -1436.7398,-152.84649 h 59.6266 v 4.89721 l 7.4154,-3.68509 7.4155,-3.68532 -7.4155,-3.68497 -7.4154,-3.68497 v 5.09224 h -59.6266 z"
             sodipodi:nodetypes="cccccccccc" /></g><path
           id="path386771-8-1"
           style="fill:#000000;fill-opacity:1;stroke:#110000;stroke-width:0.0951146;stroke-linecap:butt;stroke-linejoin:miter;stroke-miterlimit:4;stroke-dasharray:none;stroke-dashoffset:0;stroke-opacity:1;paint-order:normal"
           inkscape:transform-center-x="4.5644496e-05"
           inkscape:transform-center-y="2.3693882"
           d="M -1575.7395,419.38326 V 434.212 h -4.0903 l 3.0779,5.33105 3.0781,5.33105 3.0778,-5.33105 3.0778,-5.33105 h -4.2532 v -14.82874 z" /><path
           id="path386771-8-2-4"
           style="fill:#ffffff;fill-opacity:1;stroke:#000000;stroke-width:1.5;stroke-linecap:butt;stroke-linejoin:miter;stroke-miterlimit:4;stroke-dasharray:none;stroke-dashoffset:0;stroke-opacity:1;paint-order:normal"
           inkscape:transform-center-x="4.6337848e-05"
           inkscape:transform-center-y="4.5778258"
           d="m -1578.2439,502.83571 v 28.65015 h -9.0497 l 6.8098,10.29995 6.8102,10.29996 6.8096,-10.29996 6.8096,-10.29995 h -9.4101 v -28.65015 z" /><g
           id="g387788-9"
           transform="matrix(0.86376512,0,0,0.86376512,-409.46752,304.73713)"><path
             style="fill:none;stroke:#000000;stroke-width:1.5;stroke-linecap:butt;stroke-linejoin:miter;stroke-miterlimit:4;stroke-dasharray:none;stroke-opacity:1"
             d="m -1797.6711,-102.45243 h 331.6739"
             id="path277557-2"
             sodipodi:nodetypes="cc" /><path
             id="path387490-0"
             style="stroke:#110000;stroke-width:0.75"
             inkscape:transform-center-x="-2.9683623"
             inkscape:transform-center-y="6.5035023e-05"
             d="m -1447.3448,-102.44404 -22.4634,7.399354 0.01,-14.815284 z"
             sodipodi:nodetypes="cccc" /></g><g
           id="g97290-68"
           transform="translate(-115.9132,634.99966)"><path
             id="rect387932-9"
             style="fill:#fbf8fa;fill-opacity:1;stroke:#000000;stroke-width:1.5;stroke-miterlimit:4;stroke-dasharray:none;stroke-opacity:1"
             d="m -1574.2196,-502.57159 h 269.6856 v 43.62505 h -269.6856 z" /><text
             xml:space="preserve"
             style="font-size:24px;line-height:1.25;font-family:sans-serif;-inkscape-font-specification:sans-serif;stroke-width:0.75"
             x="-1557.9354"
             y="-474.13797"
             id="text91394-2"><tspan
               sodipodi:role="line"
               id="tspan91392-6"
               style="font-size:24px;stroke-width:0.75"
               x="-1557.9354"
               y="-474.13797">Node's boot phases</tspan></text></g><g
           id="g97290-6-6"
           transform="translate(-111.29522,1060.2971)"><path
             id="rect387932-2-4"
             style="fill:#fbf8fa;fill-opacity:1;stroke:#000000;stroke-width:1.5;stroke-miterlimit:4;stroke-dasharray:none;stroke-opacity:1"
             d="m -1511.2196,-502.57159 h 153.8377 v 43.62505 h -153.8377 z" /><text
             xml:space="preserve"
             style="font-size:24px;line-height:1.25;font-family:sans-serif;-inkscape-font-specification:sans-serif;stroke-width:0.75"
             x="-1494.9354"
             y="-474.13797"
             id="text91394-9-9"><tspan
               sodipodi:role="line"
               id="tspan91392-1-5"
               style="font-size:24px;stroke-width:0.75"
               x="-1494.9354"
               y="-474.13797">Init Phase</tspan></text></g><text
           xml:space="preserve"
           style="font-size:24px;line-height:1.25;font-family:sans-serif;-inkscape-font-specification:sans-serif;stroke-width:0.75"
           x="-2096.4983"
           y="587.94745"
           id="text105054-0"><tspan
             sodipodi:role="line"
             id="tspan105052-4"
             style="font-style:normal;font-variant:normal;font-weight:bold;font-stretch:normal;font-size:24px;font-family:sans-serif;-inkscape-font-specification:'sans-serif Bold';stroke-width:0.75"
             x="-2096.4983"
             y="587.94745">Kernel parameters &gt;4096 bytes</tspan></text></g></g></g></svg>
