enoslib, k3s, g5k-image, 159.05219721794128, 2.86102294921875e-06, 2.1457672119140625e-06, 38.22630596160889, 0.8931877613067627
enoslib, k3s, g5k-image, 160.09604167938232, 6.4373016357421875e-06, 2.6226043701171875e-06, 37.45945477485657, 0.9860184192657471
enoslib, k3s, g5k-image, 215.1354739665985, 3.0994415283203125e-06, 2.384185791015625e-06, 42.12519884109497, 0.9759647846221924
enoslib, k3s, g5k-image, 156.23265314102173, 3.337860107421875e-06, 2.1457672119140625e-06, 43.560662031173706, 0.9342236518859863
enoslib, k3s, g5k-image, 138.76378750801086, 2.86102294921875e-06, 2.384185791015625e-06, 42.039318799972534, 1.0154497623443604

enoslib, flent, g5k-image, 189.43262219429016, 3.0994415283203125e-06, 2.6226043701171875e-06, 36.159366607666016, 77.19699144363403 
enoslib, flent, g5k-image, 164.07807755470276, 6.9141387939453125e-06, 2.1457672119140625e-06, 36.31303262710571, 77.23854517936707
enoslib, flent, g5k-image, 214.5532877445221, 3.0994415283203125e-06, 5.9604644775390625e-06, 36.07599329948425, 77.18036794662476
enoslib, flent, g5k-image, 164.10163402557373, 3.337860107421875e-06, 2.384185791015625e-06, 36.03605318069458, 77.11506223678589
enoslib, flent, g5k-image, 219.480295419693, 6.9141387939453125e-06, 2.86102294921875e-06, 36.15306854248047, 77.15907073020935

nxc, flent, g5k-ramdisk, 0.8437860012054443, 237.98702955245972, 51.109971046447754, 0.0, 79.6884400844574
nxc, flent, g5k-ramdisk, 0.7859809398651123, 239.54796266555786, 51.50036835670471, 1.4066696166992188e-05, 79.5923068523407
nxc, flent, g5k-ramdisk, 0.8385303020477295, 234.74629426002502, 52.15589785575867, 6.198883056640625e-06, 79.39184546470642
nxc, flent, g5k-ramdisk, 0.8075003623962402, 239.44274735450745, 51.809804916381836, 7.152557373046875e-07, 79.53586101531982
nxc, flent, g5k-ramdisk, 0.9472875595092773, 237.2404079437256, 53.38275074958801, 2.765655517578125e-05, 79.36072325706482

nxc, flent, g5k-image, 0.8180463314056396, 265.11344051361084, 156.39085459709167, 9.059906005859375e-06, 78.59090423583984
nxc, flent, g5k-image, 0.8002758026123047, 264.74875259399414, 156.5904335975647, 8.821487426757812e-06, 77.6998975276947
nxc, flent, g5k-image, 0.8759665489196777, 255.1726565361023, 155.7584946155548, 1.5020370483398438e-05, 78.32502508163452
nxc, flent, g5k-image, 0.7894766330718994, 260.4588146209717, 154.7910771369934, 5.7220458984375e-06, 78.11420345306396
nxc, flent, g5k-image, 0.7787477970123291, 262.4530577659607, 156.9980137348175, 9.298324584960938e-06, 77.99349808692932

nxc, k3s, g5k-ramdisk, 43.21228742599487, 285.78663969039917, 53.98703384399414, 28.11892867088318, 0.5127596855163574
nxc, k3s, g5k-ramdisk, 43.23126745223999, 281.535685300827, 53.98921298980713, 27.11592411994934, 0.4827914237976074
nxc, k3s, g5k-ramdisk, 63.72386455535889, 292.60293793678284, 54.781307220458984, 30.050410270690918, 0.5215156078338623
nxc, k3s, g5k-ramdisk, 63.843754529953, 298.6358163356781, 53.88711857795715, 29.527655363082886, 0.539963960647583
nxc, k3s, g5k-ramdisk, 43.30114030838013, 280.43411564826965, 54.137099742889404, 27.034841299057007, 0.5189449787139893

nxc, k3s, g5k-image, 0.9382963180541992, 329.69726753234863, 166.91744780540466, 27.779847860336304, 0.8043286800384521
nxc, k3s, g5k-image, 0.8328003883361816, 328.68674969673157, 168.40027809143066, 19.55485439300537, 0.5694468021392822
nxc, k3s, g5k-image, 0.8176760673522949, 326.8504343032837, 163.10115337371826, 25.075227737426758, 0.5565154552459717
nxc, k3s, g5k-image, 0.8972859382629395, 331.0407226085663, 161.75261187553406, 26.091739892959595, 0.559467077255249
nxc, k3s, g5k-image, 0.8388814926147461, 330.31062269210815, 162.18143224716187, 25.220582485198975, 0.5465817451477051
