<?xml version="1.0" encoding="UTF-8" standalone="no"?>
<svg
   xmlns:dc="http://purl.org/dc/elements/1.1/"
   xmlns:cc="http://creativecommons.org/ns#"
   xmlns:rdf="http://www.w3.org/1999/02/22-rdf-syntax-ns#"
   xmlns:svg="http://www.w3.org/2000/svg"
   xmlns="http://www.w3.org/2000/svg"
   xmlns:sodipodi="http://sodipodi.sourceforge.net/DTD/sodipodi-0.dtd"
   xmlns:inkscape="http://www.inkscape.org/namespaces/inkscape"
   width="533.43579mm"
   height="243.5367mm"
   viewBox="0 0 533.43579 243.5367"
   version="1.1"
   id="svg5"
   inkscape:version="1.0.2 (e86c870879, 2021-01-15)"
   sodipodi:docname="workflow.svg">
  <metadata
     id="metadata108">
    <rdf:RDF>
      <cc:Work
         rdf:about="">
        <dc:format>image/svg+xml</dc:format>
        <dc:type
           rdf:resource="http://purl.org/dc/dcmitype/StillImage" />
      </cc:Work>
    </rdf:RDF>
  </metadata>
  <sodipodi:namedview
     id="namedview7"
     pagecolor="#ffffff"
     bordercolor="#666666"
     borderopacity="1.0"
     inkscape:pageshadow="2"
     inkscape:pageopacity="0.0"
     inkscape:pagecheckerboard="0"
     inkscape:document-units="mm"
     showgrid="false"
     showborder="true"
     borderlayer="false"
     inkscape:showpageshadow="false"
     inkscape:zoom="0.72632522"
     inkscape:cx="830.23713"
     inkscape:cy="533.52683"
     inkscape:window-width="1916"
     inkscape:window-height="1032"
     inkscape:window-x="0"
     inkscape:window-y="22"
     inkscape:window-maximized="0"
     inkscape:current-layer="layer1"
     inkscape:document-rotation="0"
     fit-margin-top="0"
     fit-margin-left="0"
     fit-margin-right="0"
     fit-margin-bottom="0" />
  <defs
     id="defs2">
    <marker
       style="overflow:visible"
       id="Arrow2Lstart"
       refX="0"
       refY="0"
       orient="auto"
       inkscape:stockid="Arrow2Lstart"
       inkscape:isstock="true">
      <path
         transform="matrix(1.1,0,0,1.1,1.1,0)"
         d="M 8.7185878,4.0337352 -2.2072895,0.01601326 8.7185884,-4.0017078 c -1.7454984,2.3720609 -1.7354408,5.6174519 -6e-7,8.035443 z"
         style="fill:context-stroke;fill-rule:evenodd;stroke:context-stroke;stroke-width:0.625;stroke-linejoin:round"
         id="path113534" />
    </marker>
  </defs>
  <g
     inkscape:label="Calque 1"
     inkscape:groupmode="layer"
     id="layer1"
     transform="translate(178.55703,-21.190527)">
    <rect
       style="fill:none;fill-rule:evenodd;stroke:#000000;stroke-width:1.72193;stroke-linejoin:round;stroke-miterlimit:4;stroke-dasharray:none;stroke-opacity:1;image-rendering:auto"
       id="rect31"
       width="148.89627"
       height="228.75102"
       x="-139.7628"
       y="35.115238" />
    <path
       style="fill:none;stroke:#000000;stroke-width:1.63939;stroke-linecap:butt;stroke-linejoin:miter;stroke-miterlimit:4;stroke-dasharray:none;stroke-opacity:1"
       d="M -140.45086,83.916224 H 8.9288376"
       id="path1331" />
    <path
       style="fill:none;stroke:#000000;stroke-width:1.64015;stroke-linecap:butt;stroke-linejoin:miter;stroke-miterlimit:4;stroke-dasharray:none;stroke-opacity:1"
       d="M -140.1668,222.38146 H 9.3513876"
       id="path1331-6" />
    <path
       style="fill:none;stroke:#000000;stroke-width:1.59137;stroke-linecap:butt;stroke-linejoin:miter;stroke-miterlimit:4;stroke-dasharray:none;stroke-opacity:1"
       d="m -139.90965,246.13542 h -25.55184 V 65.245842 h 23.44233"
       id="path1475"
       sodipodi:nodetypes="cccc" />
    <rect
       style="fill:none;stroke:#000000;stroke-width:1.82697;stroke-linejoin:round;stroke-miterlimit:4;stroke-dasharray:none;stroke-opacity:1"
       id="rect1993"
       width="157.1039"
       height="137.09076"
       x="196.8614"
       y="85.701279" />
    <g
       id="g57342"
       transform="translate(-121.4452,73.483904)">
      <rect
         style="fill:#87cdde;fill-opacity:0.2878;stroke:none;stroke-width:1.99476;stroke-linejoin:round;stroke-miterlimit:4;stroke-dasharray:none;stroke-opacity:1"
         id="rect2221"
         width="135.39548"
         height="70.127609"
         x="158.73222"
         y="4.6049786" />
      <g
         id="g4089"
         transform="translate(61.496976,19.564817)">
        <rect
           style="fill:#ff6600;fill-opacity:1;stroke:none;stroke-width:1.5;stroke-linejoin:round;stroke-miterlimit:4;stroke-dasharray:none;stroke-opacity:1"
           id="rect3081"
           width="20.169512"
           height="20.169512"
           x="53.459213"
           y="-90.26635"
           transform="rotate(45)" />
        <path
           style="fill:#ffffff;fill-opacity:1;stroke:#ffffff;stroke-width:1.5;stroke-linecap:butt;stroke-linejoin:miter;stroke-miterlimit:4;stroke-dasharray:none;stroke-opacity:1"
           d="m 93.988717,-27.493499 c 15.175493,15.175498 15.557133,16.080425 15.557133,16.080425"
           id="path3564" />
        <path
           style="fill:none;stroke:#ffffff;stroke-width:1.5;stroke-linecap:butt;stroke-linejoin:miter;stroke-miterlimit:4;stroke-dasharray:none;stroke-opacity:1"
           d="m 103.34985,-17.386676 c 0,11.9976828 0,11.9976828 0,11.9976828"
           id="path3811" />
        <circle
           style="fill:#ffffff;fill-opacity:1;stroke:#ffffff;stroke-width:1.5;stroke-linejoin:round;stroke-miterlimit:4;stroke-dasharray:none;stroke-opacity:1"
           id="path3868"
           cx="103.51582"
           cy="-17.687172"
           r="1.378798" />
        <circle
           style="fill:#ffffff;fill-opacity:1;stroke:#ffffff;stroke-width:1.5;stroke-linejoin:round;stroke-miterlimit:4;stroke-dasharray:none;stroke-opacity:1"
           id="path3868-5"
           cx="109.68288"
           cy="-11.554073"
           r="1.378798" />
        <circle
           style="fill:#ffffff;fill-opacity:1;stroke:#ffffff;stroke-width:1.5;stroke-linejoin:round;stroke-miterlimit:4;stroke-dasharray:none;stroke-opacity:1"
           id="path3868-56"
           cx="103.18929"
           cy="-5.3308496"
           r="1.378798" />
      </g>
      <g
         id="g44358">
        <rect
           style="fill:#e9c6af;fill-opacity:1;stroke:#1a1a1a;stroke-width:1.04591;stroke-linejoin:round;stroke-miterlimit:4;stroke-dasharray:none;stroke-opacity:1"
           id="rect4115"
           width="69.757591"
           height="27.881456"
           x="183.74774"
           y="7.5438857" />
        <text
           xml:space="preserve"
           style="font-style:normal;font-variant:normal;font-weight:normal;font-stretch:normal;font-size:9.87778px;line-height:1.25;font-family:FreeMono;-inkscape-font-specification:FreeMono;fill:#000000;fill-opacity:1;stroke:none;stroke-width:0.264583"
           x="184.36948"
           y="16.01605"
           id="text11639"><tspan
             sodipodi:role="line"
             id="tspan11637"
             style="font-style:normal;font-variant:normal;font-weight:normal;font-stretch:normal;font-size:9.87778px;font-family:FreeMono;-inkscape-font-specification:FreeMono;stroke-width:0.264583"
             x="184.36948"
             y="16.01605">#g98f53</tspan></text>
      </g>
      <g
         id="g44358-0"
         transform="translate(7.8293216,11.628736)">
        <rect
           style="fill:#e9c6af;fill-opacity:1;stroke:#1a1a1a;stroke-width:1.04591;stroke-linejoin:round;stroke-miterlimit:4;stroke-dasharray:none;stroke-opacity:1"
           id="rect4115-3"
           width="69.757591"
           height="27.881456"
           x="183.74774"
           y="7.5438857" />
        <text
           xml:space="preserve"
           style="font-style:normal;font-variant:normal;font-weight:normal;font-stretch:normal;font-size:9.87778px;line-height:1.25;font-family:FreeMono;-inkscape-font-specification:FreeMono;fill:#000000;fill-opacity:1;stroke:none;stroke-width:0.264583"
           x="184.36948"
           y="16.01605"
           id="text11639-6"><tspan
             sodipodi:role="line"
             id="tspan11637-1"
             style="font-style:normal;font-variant:normal;font-weight:normal;font-stretch:normal;font-size:9.87778px;font-family:FreeMono;-inkscape-font-specification:FreeMono;stroke-width:0.264583"
             x="184.36948"
             y="16.01605">#5gt46f</tspan></text>
      </g>
      <g
         id="g44358-06"
         transform="translate(15.839406,23.477359)">
        <rect
           style="fill:#e9c6af;fill-opacity:1;stroke:#1a1a1a;stroke-width:1.04591;stroke-linejoin:round;stroke-miterlimit:4;stroke-dasharray:none;stroke-opacity:1"
           id="rect4115-32"
           width="69.757591"
           height="27.881456"
           x="183.74774"
           y="7.5438857" />
        <text
           xml:space="preserve"
           style="font-style:normal;font-variant:normal;font-weight:normal;font-stretch:normal;font-size:9.87778px;line-height:1.25;font-family:FreeMono;-inkscape-font-specification:FreeMono;fill:#000000;fill-opacity:1;stroke:none;stroke-width:0.264583"
           x="184.36948"
           y="16.01605"
           id="text11639-0"><tspan
             sodipodi:role="line"
             id="tspan11637-6"
             style="font-style:normal;font-variant:normal;font-weight:normal;font-stretch:normal;font-size:9.87778px;font-family:FreeMono;-inkscape-font-specification:FreeMono;stroke-width:0.264583"
             x="184.36948"
             y="16.01605">#12xd98</tspan></text>
      </g>
      <g
         id="g57133">
        <g
           id="g44358-1"
           transform="translate(24.673015,35.369326)">
          <rect
             style="fill:#e9c6af;fill-opacity:1;stroke:#1a1a1a;stroke-width:1.04591;stroke-linejoin:round;stroke-miterlimit:4;stroke-dasharray:none;stroke-opacity:1"
             id="rect4115-5"
             width="69.757591"
             height="27.881456"
             x="183.74774"
             y="7.5438857" />
          <text
             xml:space="preserve"
             style="font-style:normal;font-variant:normal;font-weight:normal;font-stretch:normal;font-size:9.87778px;line-height:1.25;font-family:FreeMono;-inkscape-font-specification:FreeMono;fill:#000000;fill-opacity:1;stroke:none;stroke-width:0.264583"
             x="184.36948"
             y="16.01605"
             id="text11639-5"><tspan
               sodipodi:role="line"
               id="tspan11637-4"
               style="font-style:normal;font-variant:normal;font-weight:normal;font-stretch:normal;font-size:9.87778px;font-family:FreeMono;-inkscape-font-specification:FreeMono;stroke-width:0.264583"
               x="184.36948"
               y="16.01605">#g75cd3</tspan></text>
        </g>
        <text
           xml:space="preserve"
           style="font-style:normal;font-weight:normal;font-size:10.5833px;line-height:1.25;font-family:sans-serif;fill:#000000;fill-opacity:1;stroke:none;stroke-width:0.264583"
           x="210.55409"
           y="64.79425"
           id="text46657"><tspan
             sodipodi:role="line"
             id="tspan46655"
             style="stroke-width:0.264583"
             x="210.55409"
             y="64.79425">composition</tspan></text>
      </g>
    </g>
    <g
       id="g57133-7"
       transform="translate(-4.3451399,69.909778)">
      <g
         id="g44358-1-6"
         transform="translate(24.673015,35.369326)">
        <rect
           style="fill:#e9c6af;fill-opacity:1;stroke:#1a1a1a;stroke-width:1.04591;stroke-linejoin:round;stroke-miterlimit:4;stroke-dasharray:none;stroke-opacity:1"
           id="rect4115-5-5"
           width="69.757591"
           height="27.881456"
           x="183.74774"
           y="7.5438857" />
        <text
           xml:space="preserve"
           style="font-style:normal;font-variant:normal;font-weight:normal;font-stretch:normal;font-size:9.87778px;line-height:1.25;font-family:FreeMono;-inkscape-font-specification:FreeMono;fill:#000000;fill-opacity:1;stroke:none;stroke-width:0.264583"
           x="184.36948"
           y="16.01605"
           id="text11639-5-6"><tspan
             sodipodi:role="line"
             id="tspan11637-4-9"
             style="font-style:normal;font-variant:normal;font-weight:normal;font-stretch:normal;font-size:9.87778px;font-family:FreeMono;-inkscape-font-specification:FreeMono;stroke-width:0.264583"
             x="184.36948"
             y="16.01605">#g75cd3</tspan></text>
      </g>
      <text
         xml:space="preserve"
         style="font-style:normal;font-weight:normal;font-size:10.5833px;line-height:1.25;font-family:sans-serif;fill:#000000;fill-opacity:1;stroke:none;stroke-width:0.264583"
         x="210.55409"
         y="64.79425"
         id="text46657-3"><tspan
           sodipodi:role="line"
           id="tspan46655-7"
           style="stroke-width:0.264583"
           x="210.55409"
           y="64.79425">composition</tspan></text>
    </g>
    <g
       id="g57133-4"
       transform="translate(-308.61422,69.869352)">
      <g
         id="g44358-1-5"
         transform="translate(24.673015,35.369326)">
        <rect
           style="fill:#e9c6af;fill-opacity:1;stroke:#1a1a1a;stroke-width:1.04591;stroke-linejoin:round;stroke-miterlimit:4;stroke-dasharray:none;stroke-opacity:1"
           id="rect4115-5-2"
           width="69.757591"
           height="27.881456"
           x="183.74774"
           y="7.5438857" />
        <text
           xml:space="preserve"
           style="font-style:normal;font-variant:normal;font-weight:normal;font-stretch:normal;font-size:9.87778px;line-height:1.25;font-family:FreeMono;-inkscape-font-specification:FreeMono;fill:#000000;fill-opacity:1;stroke:none;stroke-width:0.264583"
           x="184.36948"
           y="16.01605"
           id="text11639-5-5"><tspan
             sodipodi:role="line"
             id="tspan11637-4-4"
             style="font-style:normal;font-variant:normal;font-weight:normal;font-stretch:normal;font-size:9.87778px;font-family:FreeMono;-inkscape-font-specification:FreeMono;stroke-width:0.264583"
             x="184.36948"
             y="16.01605">#g75cd3</tspan></text>
      </g>
      <text
         xml:space="preserve"
         style="font-style:normal;font-weight:normal;font-size:10.5833px;line-height:1.25;font-family:sans-serif;fill:#000000;fill-opacity:1;stroke:none;stroke-width:0.264583"
         x="210.55409"
         y="64.79425"
         id="text46657-7"><tspan
           sodipodi:role="line"
           id="tspan46655-4"
           style="stroke-width:0.264583"
           x="210.55409"
           y="64.79425">composition</tspan></text>
    </g>
    <g
       id="g57133-4-0"
       transform="translate(-309.72032,0.00238572)">
      <g
         id="g44358-1-5-7"
         transform="translate(24.673015,35.369326)">
        <rect
           style="fill:#e9c6af;fill-opacity:1;stroke:#1a1a1a;stroke-width:1.04591;stroke-linejoin:round;stroke-miterlimit:4;stroke-dasharray:none;stroke-opacity:1"
           id="rect4115-5-2-8"
           width="69.757591"
           height="27.881456"
           x="183.74774"
           y="7.5438857" />
        <text
           xml:space="preserve"
           style="font-style:normal;font-variant:normal;font-weight:normal;font-stretch:normal;font-size:9.87778px;line-height:1.25;font-family:FreeMono;-inkscape-font-specification:FreeMono;fill:#000000;fill-opacity:1;stroke:none;stroke-width:0.264583"
           x="184.36948"
           y="16.01605"
           id="text11639-5-5-6"><tspan
             sodipodi:role="line"
             id="tspan11637-4-4-8"
             style="font-style:normal;font-variant:normal;font-weight:normal;font-stretch:normal;font-size:9.87778px;font-family:FreeMono;-inkscape-font-specification:FreeMono;stroke-width:0.264583"
             x="184.36948"
             y="16.01605">#g75cd3</tspan></text>
      </g>
      <text
         xml:space="preserve"
         style="font-style:normal;font-weight:normal;font-size:10.5833px;line-height:1.25;font-family:sans-serif;fill:#000000;fill-opacity:1;stroke:none;stroke-width:0.264583"
         x="210.55409"
         y="64.79425"
         id="text46657-7-8"><tspan
           sodipodi:role="line"
           id="tspan46655-4-4"
           style="stroke-width:0.264583"
           x="210.55409"
           y="64.79425">composition</tspan></text>
    </g>
    <text
       xml:space="preserve"
       style="font-style:normal;font-weight:normal;font-size:10.5833px;line-height:1.25;font-family:sans-serif;fill:#000000;fill-opacity:1;stroke:none;stroke-width:0.264583"
       x="-227.91183"
       y="-170.5162"
       id="text58820"
       transform="rotate(-90)"><tspan
         sodipodi:role="line"
         id="tspan58818"
         style="stroke-width:0.264583"
         x="-227.91183"
         y="-170.5162">Quick development cycles</tspan></text>
    <rect
       style="fill:#f4d7d7;fill-opacity:1;stroke:none;stroke-width:0.78776;stroke-linejoin:round;stroke-miterlimit:4;stroke-dasharray:none;stroke-opacity:1"
       id="rect63724"
       width="106.02752"
       height="15.444014"
       x="-143.04779"
       y="21.190527" />
    <rect
       style="fill:#f4d7d7;fill-opacity:1;stroke:none;stroke-width:0.801066;stroke-linejoin:round;stroke-miterlimit:4;stroke-dasharray:none;stroke-opacity:1"
       id="rect63724-4"
       width="107.17609"
       height="16.540283"
       x="-142.9426"
       y="74.484436" />
    <rect
       style="fill:#f4d7d7;fill-opacity:1;stroke:none;stroke-width:0.983794;stroke-linejoin:round;stroke-miterlimit:4;stroke-dasharray:none;stroke-opacity:1"
       id="rect63724-4-3"
       width="132.10379"
       height="20.597656"
       x="190.20116"
       y="72.299011" />
    <text
       xml:space="preserve"
       style="font-style:normal;font-weight:normal;font-size:10.5833px;line-height:1.25;font-family:sans-serif;fill:#000000;fill-opacity:1;stroke:none;stroke-width:0.264583"
       x="-140.93875"
       y="32.517384"
       id="text67446"><tspan
         sodipodi:role="line"
         id="tspan67444"
         style="stroke-width:0.264583"
         x="-140.93875"
         y="32.517384">Experiment writing</tspan></text>
    <text
       xml:space="preserve"
       style="font-style:normal;font-weight:normal;font-size:10.5833px;line-height:1.25;font-family:sans-serif;fill:#000000;fill-opacity:1;stroke:none;stroke-width:0.264583"
       x="-139.91331"
       y="86.400711"
       id="text79683"><tspan
         sodipodi:role="line"
         id="tspan79681"
         style="stroke-width:0.264583"
         x="-139.91331"
         y="86.400711">Local development</tspan><tspan
         sodipodi:role="line"
         style="stroke-width:0.264583"
         x="-139.91331"
         y="99.629837"
         id="tspan128974" /></text>
    <text
       xml:space="preserve"
       style="font-style:normal;font-weight:normal;font-size:10.5833px;line-height:1.25;font-family:sans-serif;fill:#000000;fill-opacity:1;stroke:none;stroke-width:0.264583"
       x="192.91225"
       y="85.454285"
       id="text85987"><tspan
         sodipodi:role="line"
         style="stroke-width:0.264583"
         x="192.91225"
         y="85.454285"
         id="tspan131352">Distributed deployment</tspan></text>
    <path
       style="fill:none;stroke:#0000ff;stroke-width:1.74458;stroke-linecap:butt;stroke-linejoin:miter;stroke-miterlimit:4;stroke-dasharray:1.74458, 1.74458;stroke-dashoffset:0;stroke-opacity:1"
       d="m -22.592092,49.950269 c 0,0 42.51297,-27.761749 89.499779,27.644687"
       id="path90262"
       sodipodi:nodetypes="cc" />
    <path
       style="fill:none;stroke:#0000ff;stroke-width:2.2876;stroke-linecap:butt;stroke-linejoin:miter;stroke-miterlimit:4;stroke-dasharray:2.2876, 2.2876;stroke-dashoffset:0;stroke-opacity:1"
       d="m 213.24109,142.53037 c 0,0 -39.98664,48.66613 -80.36682,7.245"
       id="path90545"
       sodipodi:nodetypes="cc" />
    <g
       id="g3283"
       transform="translate(0,-2.1166667)">
      <rect
         style="fill:#ffccaa;fill-opacity:0.434993;stroke:#ff6600;stroke-width:1.60975;stroke-linejoin:round;stroke-miterlimit:4;stroke-dasharray:none;stroke-opacity:1"
         id="rect1684-9-3"
         width="139.30643"
         height="32.637295"
         x="-134.96788"
         y="156.39302" />
      <text
         xml:space="preserve"
         style="font-style:normal;font-weight:normal;font-size:10.5833px;line-height:1.25;font-family:sans-serif;fill:#000000;fill-opacity:1;stroke:none;stroke-width:0.264583"
         x="-128.44498"
         y="169.83582"
         id="text95370"><tspan
           sodipodi:role="line"
           id="tspan95368"
           style="stroke-width:0.264583"
           x="-128.44498"
           y="169.83582">NixOS Compose phases</tspan><tspan
           sodipodi:role="line"
           style="stroke-width:0.264583"
           x="-128.44498"
           y="183.49075"
           id="tspan4891">     <tspan
   style="font-style:italic;font-variant:normal;font-weight:normal;font-stretch:normal;font-family:FreeSerif;-inkscape-font-specification:'FreeSerif Italic'"
   id="tspan5877">build - start - connect</tspan></tspan></text>
    </g>
    <text
       xml:space="preserve"
       style="font-style:normal;font-weight:normal;font-size:10.5833px;line-height:1.25;font-family:sans-serif;fill:#000000;fill-opacity:1;stroke:none;stroke-width:0.264583"
       x="290.30667"
       y="134.67302"
       id="text111158"><tspan
         sodipodi:role="line"
         id="tspan111156"
         style="stroke-width:0.264583"
         x="290.30667"
         y="134.67302">resources</tspan><tspan
         sodipodi:role="line"
         style="stroke-width:0.264583"
         x="290.30667"
         y="147.90215"
         id="tspan111160" /></text>
    <path
       style="fill:#ff6600;stroke:#ff6600;stroke-width:0.9;stroke-linecap:butt;stroke-linejoin:miter;stroke-miterlimit:4;stroke-dasharray:none;stroke-opacity:1"
       d="m -65.314668,141.5428 c 0,11.52008 0,11.52008 0,11.52008"
       id="path113977" />
    <path
       style="fill:none;stroke:#ff6600;stroke-width:0.9;stroke-linecap:butt;stroke-linejoin:miter;stroke-miterlimit:4;stroke-dasharray:none;stroke-opacity:1"
       d="m -69.237433,148.16511 3.836289,4.89777 4.019434,-4.76845"
       id="path114045" />
    <path
       style="fill:#ff6600;stroke:#ff6600;stroke-width:0.9;stroke-linecap:butt;stroke-linejoin:miter;stroke-miterlimit:4;stroke-dasharray:none;stroke-opacity:1"
       d="m -65.314668,189.27553 c 0,11.52008 0,11.52008 0,11.52008"
       id="path113977-6" />
    <path
       style="fill:none;stroke:#ff6600;stroke-width:0.9;stroke-linecap:butt;stroke-linejoin:miter;stroke-miterlimit:4;stroke-dasharray:none;stroke-opacity:1"
       d="m -69.237433,195.89784 3.836289,4.89777 4.019434,-4.76845"
       id="path114045-8" />
    <g
       id="g950"
       transform="translate(-11.162417)">
      <path
         style="fill:#ff6600;stroke:#ff6600;stroke-width:0.9;stroke-linecap:butt;stroke-linejoin:miter;stroke-miterlimit:4;stroke-dasharray:none;stroke-opacity:1"
         d="m 250.03035,140.89306 c 0,11.52008 0,11.52008 0,11.52008"
         id="path113977-9" />
      <path
         style="fill:none;stroke:#ff6600;stroke-width:0.9;stroke-linecap:butt;stroke-linejoin:miter;stroke-miterlimit:4;stroke-dasharray:none;stroke-opacity:1"
         d="m 246.19406,147.8603 3.83629,4.89777 4.01944,-4.76845"
         id="path114045-2" />
    </g>
    <g
       id="g946"
       transform="translate(10.560268)">
      <path
         style="fill:#ff6600;stroke:#ff6600;stroke-width:0.9;stroke-linecap:butt;stroke-linejoin:miter;stroke-miterlimit:4;stroke-dasharray:none;stroke-opacity:1"
         d="m 305.52648,140.89306 c 0,11.52008 0,11.52008 0,11.52008"
         id="path113977-66" />
      <path
         style="fill:none;stroke:#ff6600;stroke-width:0.9;stroke-linecap:butt;stroke-linejoin:miter;stroke-miterlimit:4;stroke-dasharray:none;stroke-opacity:1"
         d="m 301.69019,147.8603 3.83629,4.89777 4.01944,-4.76845"
         id="path114045-4" />
    </g>
    <path
       style="fill:#ff6600;stroke:#ff6600;stroke-width:0.9;stroke-linecap:butt;stroke-linejoin:miter;stroke-miterlimit:4;stroke-dasharray:none;stroke-opacity:1"
       d="m 274.52519,188.04646 c 0,11.52008 0,11.52008 0,11.52008"
       id="path113977-95" />
    <path
       style="fill:none;stroke:#ff6600;stroke-width:0.9;stroke-linecap:butt;stroke-linejoin:miter;stroke-miterlimit:4;stroke-dasharray:none;stroke-opacity:1"
       d="m 270.6889,194.66877 3.83629,4.89777 4.01944,-4.76845"
       id="path114045-0" />
    <text
       xml:space="preserve"
       style="font-style:normal;font-weight:normal;font-size:10.5833px;line-height:1.25;font-family:sans-serif;fill:#000000;fill-opacity:1;stroke:none;stroke-width:0.264583"
       x="-83.26442"
       y="212.40129"
       id="text115060"><tspan
         sodipodi:role="line"
         id="tspan115058"
         style="stroke-width:0.264583"
         x="-83.26442"
         y="212.40129">results</tspan></text>
    <text
       xml:space="preserve"
       style="font-style:normal;font-weight:normal;font-size:10.5833px;line-height:1.25;font-family:sans-serif;text-align:center;text-anchor:middle;fill:#000000;fill-opacity:1;stroke:none;stroke-width:0.264583"
       x="274.38947"
       y="215.17349"
       id="text115060-1"><tspan
         sodipodi:role="line"
         id="tspan115058-7"
         style="text-align:center;text-anchor:middle;stroke-width:0.264583"
         x="274.38947"
         y="215.17349">results</tspan></text>
    <text
       xml:space="preserve"
       style="font-style:normal;font-weight:normal;font-size:10.5833px;line-height:1.25;font-family:sans-serif;text-align:center;text-anchor:middle;fill:#000000;fill-opacity:1;stroke:none;stroke-width:0.264583"
       x="-65.464523"
       y="246.3867"
       id="text118362"><tspan
         sodipodi:role="line"
         id="tspan118360"
         style="text-align:center;text-anchor:middle;stroke-width:0.264583"
         x="-65.464523"
         y="246.3867">Is outcome satisfactory?</tspan></text>
    <text
       xml:space="preserve"
       style="font-style:normal;font-weight:normal;font-size:8.46667px;line-height:1.25;font-family:sans-serif;fill:#000000;fill-opacity:1;stroke:none;stroke-width:0.264583"
       x="-137.69249"
       y="98.373322"
       id="text136266"><tspan
         sodipodi:role="line"
         id="tspan136264"
         style="font-size:8.46667px;stroke-width:0.264583"
         x="-137.69249"
         y="98.373322">( docker, VM )</tspan></text>
    <text
       xml:space="preserve"
       style="font-style:normal;font-weight:normal;font-size:8.46667px;line-height:1.25;font-family:sans-serif;fill:#000000;fill-opacity:1;stroke:none;stroke-width:0.264583"
       x="199.59401"
       y="100.90822"
       id="text136266-2"><tspan
         sodipodi:role="line"
         style="font-size:8.46667px;stroke-width:0.264583"
         x="199.59401"
         y="100.90822"
         id="tspan975">( g5k-ramdisk, g5k-image )</tspan></text>
    <text
       xml:space="preserve"
       style="font-style:normal;font-weight:normal;font-size:10.5833px;line-height:1.25;font-family:sans-serif;fill:#000000;fill-opacity:1;stroke:none;stroke-width:0.264583"
       x="141.78574"
       y="132.55533"
       id="text139894"><tspan
         sodipodi:role="line"
         id="tspan139892"
         style="stroke-width:0.264583"
         x="141.78574"
         y="132.55533" /></text>
    <path
       style="fill:none;stroke:#000000;stroke-width:1.5;stroke-linecap:butt;stroke-linejoin:miter;stroke-miterlimit:4;stroke-dasharray:none;stroke-opacity:1"
       d="m -148.58166,57.684133 6.5625,7.561707 -6.57148,6.720848"
       id="path161855" />
    <g
       id="g3283-6"
       transform="translate(340.72802,-2.1166667)">
      <rect
         style="fill:#ffccaa;fill-opacity:0.434993;stroke:#ff6600;stroke-width:1.60975;stroke-linejoin:round;stroke-miterlimit:4;stroke-dasharray:none;stroke-opacity:1"
         id="rect1684-9-3-2"
         width="139.30643"
         height="32.637295"
         x="-134.96788"
         y="156.39302" />
      <text
         xml:space="preserve"
         style="font-style:normal;font-weight:normal;font-size:10.5833px;line-height:1.25;font-family:sans-serif;fill:#000000;fill-opacity:1;stroke:none;stroke-width:0.264583"
         x="-128.44498"
         y="169.83582"
         id="text95370-9"><tspan
           sodipodi:role="line"
           id="tspan95368-1"
           style="stroke-width:0.264583"
           x="-128.44498"
           y="169.83582">NixOS Compose phases</tspan><tspan
           sodipodi:role="line"
           style="stroke-width:0.264583"
           x="-128.44498"
           y="183.49075"
           id="tspan4891-2">     <tspan
   style="font-style:italic;font-variant:normal;font-weight:normal;font-stretch:normal;font-family:FreeSerif;-inkscape-font-specification:'FreeSerif Italic'"
   id="tspan5877-7">build - start - connect</tspan></tspan></text>
    </g>
  </g>
</svg>
