{
  "_pkglts": {
    "auto_install": true,
    "install_front_end": "stdout",
    "use_prompts": false,
    "version": 13
  },
  "base": {
    "authors": [
      [
        "Guillaume Cerutti",
        "guillaume.cerutti@inria.fr"
      ]
    ],
    "namespace": null,
    "pkgname": "sam_spaghetti",
    "url": null
  },
  "conda": {},
  "coverage": {},
  "doc": {
    "description": "SAM Sequence Primordia Alignment, GrowtH Estimation, Tracking & Temporal Indexation",
    "fmt": "rst",
    "keywords": []
  },
  "git": {},
  "github": {
    "owner": "{{ base.authors[0][0] }}",
    "project": "{{ base.pkgname }}",
    "url": "https://github.com/{{ github.owner }}/{{ github.project }}"
  },
  "gitlab": {
    "owner": "{{ base.authors[0][0] }}",
    "project": "{{ base.pkgname }}",
    "server": "framagit.org",
    "url": "https://{{ gitlab.server }}/{{ gitlab.owner }}/{{ gitlab.project }}"
  },
  "license": {
    "name": "cecill-c",
    "organization": "Inria",
    "project": "{{ base.pkgname }}",
    "year": 2018
  },
  "pysetup": {
    "intended_versions": [
      "37"
    ]
  },
  "reqs": {
    "require": []
  },
  "sphinx": {
    "autodoc_dvlpt": true,
    "build_dir": "build/sphinx",
    "gallery": "",
    "theme": "default"
  },
  "src": {
    "namespace_method": "pkg_util"
  },
  "test": {
    "suite_name": "nose"
  },
  "version": {
    "major": 0,
    "minor": 9,
    "post": 1
  }
}