9: 5, 114
16: 8
99: 481
106: 70, 115
107: 95, 13
111: 491
112: 26, 126
115: 81, 123
116: 79
118: 470, 479
119: 28, 83
121: 89
123: 190, 76
125: 80, 112
126: 467
127: 85, 93
132: 84, 132
134: 86, 128
137: 97, 169, 189
138: 94
142: 104
146: 92
148: 122, 184
149: 91
153: 125, 150
154: 131
155: 492
156: 133, 178
157: 201
158: 130, 207
159: 111, 148
161: 144, 174
162: 134
164: 98
167: 120
168: 138, 183
170: 145
172: 99
173: 146, 242
174: 147
175: 136, 172
178: 141
179: 247, 475
184: 152, 223
185: 105
186: 107
189: 162
192: 117
195: 137
197: 155
198: 161
200: 158
202: 153, 186
203: 151
205: 166
206: 191, 229
207: 257, 487
209: 179
210: 185, 204
211: 173, 181
212: 157, 237
213: 176, 177
215: 135, 200
219: 193, 238
223: 195
224: 168
225: 243, 259
226: 187, 218
228: 221
229: 210, 225
230: 197, 489
232: 202
233: 165
234: 154
235: 194
236: 199
237: 477
239: 228
240: 180, 236
242: 211
243: 170
244: 227
245: 198
246: 233
248: 224
253: 203, 252
254: 254, 281
255: 468, 215
256: 244
257: 175, 249
258: 469
260: 230
263: 245
264: 239, 285
265: 471
266: 235
267: 212, 269
268: 251
270: 255, 272
273: 265
274: 246
276: 260, 300
277: 250
278: 220
279: 226
280: 241, 262
281: 258
282: 263
283: 213
284: 278
286: 264, 323
287: 268, 318
288: 294, 320
290: 288, 321
291: 277, 322
293: 305, 332, 347
294: 283
296: 271
297: 299, 339
298: 290
299: 287
300: 282
302: 291
303: 266, 273
305: 309
306: 270, 276
307: 248, 274
308: 302
309: 307
310: 253
311: 312
312: 275
313: 319
314: 279, 311
315: 289, 329
318: 293
320: 313
321: 297, 331
322: 317, 368
323: 314, 354
324: 292
325: 280, 298
326: 240
327: 303
328: 326, 343
329: 310
330: 304
331: 325
332: 324
333: 296
334: 284, 301
335: 337, 374
336: 333, 380
337: 219, 286
338: 351
341: 335, 346
342: 306
343: 330, 375
344: 342, 352
345: 353, 356
346: 327
347: 340
348: 328
349: 315
350: 217
351: 341
352: 308
353: 316, 334
354: 345, 350
355: 369, 376
356: 336
357: 363, 377
358: 344, 367
359: 365
360: 357
361: 338, 362
362: 372, 392
363: 384
364: 358
365: 361, 385
366: 349, 382
367: 371
368: 364
369: 366, 412
370: 391
371: 383, 396
372: 359
373: 355
374: 388, 405
375: 348
376: 373
377: 370, 381
378: 360, 379
379: 386
380: 390
381: 389
382: 378
383: 394
384: 403, 418
385: 387
386: 398
387: 336
388: 402, 417
389: 415, 436
390: 395, 408
391: 393, 423
392: 406
393: 410
394: 411, 426
395: 416
396: 422, 434
397: 404
398: 399
399: 409
400: 420, 437
401: 397
402: 414, 444
403: 400, 413
404: 421
405: 427
406: 419, 433
407: 401
408: 432
409: 425, 435
410: 407, 428
411: 438, 446
412: 429
413: 424, 439
414: 430, 431
415: 441
416: 443, 452, 455
417: 440
418: 442, 448
419: 450
420: 449
421: 447
422: 453, 460
423: 445, 456
424: 457, 458
425: 454
426: 451
427: 459, 461
428: 464, 465
429: 462, 463
430: 474, 476
227: 206, 483
