21: 13
27: 18
102: 170, 64
108: 114, 70
110: 106
112: 131, 27
113: 92, 116
115: 100, 157
119: 66
122: 107
125: 98
127: 108, 202
128: 96
129: 125
132: 127, 200
133: 430
136: 101
139: 132, 211
140: 115
147: 112
148: 118
149: 123
150: 158
151: 137
152: 153, 174, 197
155: 161, 228
156: 142, 205
157: 119
158: 185
159: 156, 256
160: 134
161: 130
162: 146
163: 28
164: 173
165: 148
166: 162
167: 159
168: 122, 186
169: 167, 232
170: 149
171: 168
172: 189
173: 182, 272
174: 164, 245
175: 257
178: 178
179: 175
180: 179
181: 180
183: 172
184: 198, 277
185: 214
187: 210
189: 221
193: 238
194: 236, 223
195: 203
196: 212
198: 206, 244
199: 218, 289
200: 219
201: 184
202: 229
203: 226
205: 246, 273
206: 242
207: 251, 291
208: 271, 276
209: 224
210: 255
212: 209
213: 239
214: 225, 254
215: 192
216: 337
217: 235
218: 213
219: 237, 306
220: 240
221: 268
222: 253, 324
223: 215
224: 241
225: 233
226: 287
227: 227
228: 264
229: 270
230: 288, 335
231: 263, 329
232: 260, 281
233: 274, 333
234: 258
235: 234
236: 286
237: 195
238: 266, 282
239: 267
240: 297
241: 243, 310
242: 290
243: 293
244: 265
245: 319
247: 284
248: 275, 285, 312
249: 313
251: 294, 302
254: 154, 248
256: 300
257: 309, 311
258: 280
260: 305
261: 321, 367
262: 308
263: 315, 368
264: 330
265: 318, 354
266: 322
268: 296
269: 331, 332
270: 298
271: 299
272: 314
273: 336
274: 327, 364
275: 283
276: 328
277: 307
278: 278, 279
279: 323
280: 303
281: 338
282: 325
283: 347, 385
284: 344
285: 348, 365
286: 363
287: 343
288: 355
289: 341
290: 320
291: 345
292: 350
293: 362
294: 359
295: 356, 387, 340
296: 349, 375
297: 357
298: 358
299: 342, 372
300: 346, 351
301: 370
302: 326
303: 353
304: 366
305: 376
306: 352
307: 374
308: 360
309: 361
310: 369
311: 334
312: 371
313: 384
314: 383
315: 389
316: 377
317: 386, 388
318: 379, 399
319: 378
320: 373
321: 381
322: 396
323: 395, 405
324: 393
325: 382
326: 404, 408
327: 380, 397
328: 400
329: 390
330: 392
331: 403
332: 394
333: 402
334: 391
335: 401, 407
336: 398
337: 411
338: 409
339: 410
340: 406, 419
341: 414
342: 416
343: 413
344: 412
345: 418
346: 415, 425
347: 424
348: 417
349: 420
350: 422
351: 421, 426
352: 423
353: 428
354: 427
355: 429
362: 207
204: 218, 289
80: 76, 103
