110: 113
115: 165
123: 39
124: 116
125: 111
126: 105, 135
130: 130
131: 206
132: 146
134: 109
136: 133
137: 203
138: 188
140: 118
141: 220
142: 132, 229
143: 134
149: 121
150: 144
153: 147
154: 139
155: 140
156: 143
161: 190
165: 158
166: 142
167: 151
168: 176
169: 156
170: 154
171: 163
173: 177
175: 181
176: 170
177: 172
179: 204
181: 178
185: 168
186: 186
187: 185, 271
188: 179
189: 169
191: 222
193: 174
194: 183
195: 189
196: 187
197: 193
198: 196, 284
200: 209
201: 197
202: 207
203: 205
204: 214
206: 251
207: 171
208: 241
210: 191
212: 231
213: 201
214: 238
215: 200
217: 194
218: 199
219: 215
220: 252
221: 198
222: 195
223: 211
224: 264
225: 210
226: 225
227: 223
228: 233
229: 208
230: 227
232: 212
233: 246
234: 234
235: 221
236: 242
237: 219
238: 226
239: 269
240: 244
241: 236
242: 230
243: 250
244: 262
245: 232
246: 239
247: 277, 301
248: 265
249: 235
251: 255
252: 257
253: 228
254: 261
256: 270
257: 258
258: 247
259: 245
260: 248
261: 243
262: 298
263: 291
264: 278
265: 292
266: 266
267: 273
268: 272
269: 274
270: 267
271: 287
272: 256
273: 280
274: 268
275: 259, 290
276: 253
277: 299
278: 307
279: 263, 286
280: 281
281: 279
282: 289
283: 376
284: 294
285: 288
286: 275
287: 311
288: 293
291: 304
292: 295
293: 282
294: 305
295: 332
297: 306
298: 328
299: 310
300: 317
301: 315
302: 300
303: 296
304: 303, 313, 335
305: 346
306: 308
307: 312
308: 297
309: 336
310: 378
311: 322
312: 318, 325
313: 314
314: 285, 337
315: 323
316: 348
317: 333
318: 309, 339
319: 316
320: 321
321: 319
322: 324
323: 331
324: 330
325: 344
326: 342
327: 340
328: 326
329: 353
330: 350
331: 355
332: 349, 443
333: 334
334: 338
335: 345
336: 357
337: 358, 362
339: 373
340: 354
341: 369
342: 351
343: 341
344: 343
345: 359
346: 367
347: 432
349: 372
350: 356
351: 364
352: 368
353: 365
355: 387
356: 375
357: 361
358: 363
359: 379
360: 370
361: 366
362: 386
363: 377
364: 381
365: 383
366: 390
367: 384
368: 392
369: 388
370: 394
371: 391
372: 380
373: 389
374: 414
375: 400
376: 382
378: 393
379: 411
380: 409
381: 410
382: 396
383: 423
384: 403
385: 399
386: 397
387: 415
388: 408
389: 402
390: 404
391: 406
392: 401
393: 419
394: 429
395: 430, 459
396: 412
397: 427
398: 417
400: 405
401: 418
402: 416
403: 426
404: 420
405: 424
406: 421
407: 434
408: 428
409: 422
410: 425
411: 433, 463
412: 437
413: 431
414: 444
415: 435
416: 438
417: 441
418: 439
419: 449
420: 440
421: 442
422: 445
423: 464
424: 446
425: 448
426: 447
427: 452
428: 453
429: 456
430: 460
431: 454
432: 457
433: 450
434: 471
435: 455
436: 458
437: 466
438: 398, 467
439: 462
440: 472
441: 465
442: 469
443: 470
444: 451, 476
445: 474
446: 473
447: 475
448: 477
449: 489
450: 482
451: 479
452: 481
453: 485
454: 488, 490
455: 487
456: 374
457: 320
