161: 157
162: 189
163: 215
164: 193
165: 232
167: 180
168: 251
173: 152
174: 211
176: 202
177: 200
178: 221
179: 220
180: 210
183: 216
184: 249
187: 242
188: 238
189: 240
190: 269
191: 236
194: 229
197: 254
198: 239
199: 250
201: 265
202: 233
203: 247
205: 274
207: 223
215: 243
216: 285, 293
217: 295
218: 280
219: 278
221: 244
222: 286
225: 281
227: 266
228: 283
230: 282
231: 271
232: 208
233: 292
234: 227
236: 279
237: 241
239: 294, 311
241: 298
242: 302
244: 322
245: 310
246: 252
247: 316
248: 273
250: 337
251: 296
252: 307
258: 317
259: 305
260: 309, 350
261: 237
263: 300
267: 288
269: 272
271: 268
272: 352
273: 323
276: 345
277: 304
278: 313
279: 321
280: 355
282: 325
284: 358
285: 349
286: 342
287: 257
288: 346
290: 277
291: 372, 391
292: 314
293: 356
294: 379
295: 368, 371
296: 333
298: 339
300: 384
301: 367
302: 385
304: 369
305: 303
306: 320
307: 408
308: 351
309: 362
314: 390
315: 409
316: 363
317: 401
318: 336
319: 405
320: 328
323: 386
324: 354
325: 411
326: 396, 417
327: 407
328: 398
329: 335
330: 383
331: 380
332: 399
333: 404
334: 365
335: 435
336: 410
337: 378
338: 424
341: 430
342: 413
343: 374, 434
344: 406
345: 388
346: 376
347: 381
348: 448
350: 419
352: 451
353: 402
354: 438
356: 427
357: 389
358: 426
359: 429
360: 431
361: 394
362: 433
363: 464
364: 420
365: 456
366: 455
367: 460
368: 465
369: 412
370: 395
371: 473
372: 375
374: 479
375: 422
376: 445
377: 476
378: 440
379: 463
381: 428
382: 459
383: 421
384: 466
385: 485
386: 439
387: 432
388: 449
389: 458
390: 472
391: 489
392: 477
393: 491
394: 487
395: 475
396: 471
397: 502
398: 470
399: 481
400: 504
401: 462
402: 467
403: 506
404: 505
405: 494
406: 509
407: 517
408: 515
409: 493
410: 520
412: 514
413: 484
414: 468
415: 519
416: 501, 523
417: 497
418: 516
419: 521
420: 492
422: 499
424: 500
425: 496
426: 508
427: 532
428: 533
429: 530
430: 511
431: 529
432: 536
433: 538
434: 522
435: 535
436: 541
437: 534
438: 545
439: 543
440: 547
441: 537
442: 544
443: 542
444: 549
446: 548
447: 550
