22: 23
44: 46
53: 55
130: 110
136: 12
144: 113
155: 132
160: 121
161: 122
163: 134
167: 16
168: 124
169: 123
176: 161
178: 125
180: 207
182: 126
183: 153
184: 141
185: 136
188: 115
189: 142
190: 112
193: 135
194: 130
198: 173
200: 149
201: 154
202: 143
204: 131
207: 156
208: 140
209: 179
210: 138
214: 175
217: 169
219: 170
221: 150
222: 165
224: 171
225: 177
227: 187
230: 152, 230
231: 166
232: 167
233: 157
235: 168
239: 200
240: 195
241: 197
243: 220
244: 214
245: 202
247: 224
249: 186
250: 194
252: 193
253: 185
254: 208
255: 215
258: 181
260: 217
262: 188
263: 176
264: 219, 241
265: 189
267: 227
268: 221
269: 210
271: 225
272: 204
273: 196
274: 252
275: 226
276: 198
277: 239
278: 243
279: 236
280: 234
281: 262
284: 218
285: 213
286: 240
288: 223
291: 256
294: 257
295: 249
296: 235
297: 248
298: 222
299: 206
300: 212
301: 191
302: 250, 264
303: 232
304: 277
305: 254
306: 245
307: 251
308: 267
309: 244
310: 201
312: 259
314: 203
315: 229
316: 155
317: 290
318: 242
319: 253
320: 278
321: 275
322: 238
323: 268
324: 265
325: 266
327: 247
328: 246
330: 276
331: 270
332: 261
333: 295
334: 305
335: 287
336: 260
337: 284, 335
338: 293
339: 228
341: 309
342: 313
343: 299
344: 291
346: 279
347: 269
348: 272
349: 273
350: 263
351: 292
352: 294
353: 281
354: 316
355: 300
356: 237
357: 301
358: 280
359: 274
360: 298
361: 258
362: 233
363: 302
364: 286
365: 317
366: 306
367: 311
368: 303
370: 322
371: 310
372: 307
373: 329
374: 297
375: 288
376: 282
377: 325
378: 323
380: 304
381: 331
382: 327
383: 318
384: 315
385: 326
386: 271
387: 308
388: 338
389: 320
390: 330
391: 312
392: 333
394: 321
395: 347
396: 319
397: 354
398: 341
399: 355
400: 283
401: 324
402: 348
403: 456
404: 350
406: 336
407: 340, 342
408: 332, 457
409: 334
410: 328
412: 346
413: 349
414: 314
415: 285
416: 337
417: 343
418: 339
419: 344
420: 352
421: 356
422: 366
423: 362
424: 364
425: 353
426: 345, 373
429: 374
430: 365
431: 359
432: 358
433: 371
434: 375
435: 357
436: 370
437: 376
438: 363
439: 360
440: 351
441: 361
442: 383, 419
443: 367
444: 394
445: 399
446: 378
447: 395
448: 388
449: 380
450: 387
451: 369
452: 382
453: 379
454: 377
455: 392
456: 381
457: 372
459: 397
460: 438
461: 401
462: 384
463: 389
464: 396
465: 390
466: 406
467: 386
469: 398
470: 402
471: 391
472: 407
473: 408
474: 405
475: 400
476: 393
477: 385
478: 368
479: 414
480: 410
481: 412
482: 417
484: 404
485: 418
486: 411
488: 415
489: 416
490: 422
491: 423
492: 427
493: 409
494: 403
495: 434, 454
496: 420
497: 430, 444, 453
498: 413
499: 421
500: 432
501: 428
502: 425
503: 431, 449, 451
504: 429
505: 426
506: 436
507: 437
508: 424
509: 440
510: 435
511: 433
512: 439
513: 445
514: 442
