SIMDEUM000919587582
SIMDEUM000932739095
SIMDEUM000929276244
SIMDEUM000926189400
SIMDEUM000911474933
SIMDEUM000933663105
SIMDEUM000925265555
SIMDEUM000913325437
SIMDEUM000935684041
SIMDEUM000920747734
SIMDEUM000940823906
SIMDEUM000938263111
SIMDEUM000931098195
SIMDEUM000929189864
SIMDEUM000913892370
SIMDEUM000941364903
SIMDEUM000804179455
SIMDEUM000919253926
SIMDEUM000910794565
SIMDEUM000943707915
SIMDEUM000915040032
SIMDEUM000979317838
SIMDEUM000926428551
SIMDEUM000933038755
SIMDEUM000912851741
