index,population
0,admixed
1,admixed
2,admixed
3,admixed
4,admixed
5,admixed
6,admixed
7,admixed
8,admixed
9,admixed
10,admixed
11,admixed
12,admixed
13,admixed
14,admixed
15,admixed
16,admixed
17,admixed
18,admixed
19,admixed
20,admixed
21,admixed
22,admixed
23,admixed
24,admixed
25,admixed
26,admixed
27,admixed
28,admixed
29,admixed
30,admixed
31,admixed
32,admixed
33,admixed
34,admixed
35,0
36,0
37,0
38,0
39,0
40,0
41,0
42,0
43,0
44,0
45,0
46,0
47,0
48,0
49,0
50,0
51,0
52,0
53,0
54,0
55,0
56,0
57,0
58,0
59,0
60,0
61,0
62,0
63,0
64,0
65,0
66,0
67,0
68,0
69,0
70,1
71,1
72,1
73,1
74,1
75,1
76,1
77,1
78,1
79,1
80,1
81,1
82,1
83,1
84,1
85,1
86,1
87,1
88,1
89,1
90,1
91,1
92,1
93,1
94,1
95,1
96,1
97,1
98,1
99,1
100,1
101,1
102,1
103,1
104,1
