0	-0.00120736615901
0	0.000880665899861
0	-0.000625012718961
0	-0.000112221058805
0	0.00246762615897
0	0.00247071554271
0	0.00173451447549
0	0.00227303642038
0	-0.000253713453074
50	0.000646680763342
50	-0.00252690595409
50	-0.00077901228304
50	0.000654056609481
50	0.00137582367068
50	0.00398339937371
50	-0.00103638189056
50	-0.00111325736058
50	0.000808417599229
50	0.000252735992315
100	-0.000774912288666
100	-0.000264797940951
100	0.000474787175531
100	7.16087843841e-05
100	-0.00221004383978
100	-0.00069843047335
100	-0.00111578503819
100	-0.00232848326176
100	0.00053707670263
100	-0.00113044694957
150	0.00124160352921
150	0.00159980629426
150	0.00194847616953
150	-0.00025729317865
150	-0.00378623269312
150	-0.00234834095489
150	0.000959650069969
150	-9.45135030932e-05
150	5.61291762045e-06
150	0.00172530617819
200	-0.00209877768141
200	-0.00295233619567
200	0.00112136618719
200	-0.00104762982571
200	-0.00071513662673
200	0.00193641099799
200	-0.00328587683847
200	-5.38887974709e-05
200	-0.000341137027659
200	-0.00173216774092
250	0.000304544175011
250	0.000109664375059
250	-0.00027831572139
250	6.34893682381e-05
250	-0.00105895142724
250	-0.000752310522938
250	-0.00292072180896
250	-0.00204266231765
250	-0.00248467209852
250	-0.00298867674097
300	-0.00248199939023
300	-0.0019699766229
300	-0.00439144342915
300	-0.00215282578242
300	-0.00201904763922
300	-0.00120183197233
300	-0.00147442059322
300	-0.00216352352181
300	0.000203821517047
300	-0.000865109862814
350	0.000723091214354
350	-0.00169956576432
350	-0.00266381261631
350	-0.00410840799498
350	-0.00227433847362
350	-0.00244092117596
350	-0.00145644369481
350	-0.00284292320713
350	-0.00236582520939
350	-0.00136604584019
400	-0.00402281456948
400	0.000491594620181
400	-0.000481724706718
400	-0.00113537799278
400	-0.00235856907112
400	-0.00214032551883
400	-0.00284879349666
400	0.000476852136201
400	0.00184273729161
400	-0.00154623840595
450	0.000136571019776
450	-0.00228397265467
450	-0.00278625764761
450	-0.000329002793889
450	0.000713726375998
450	-0.000181083008104
450	-0.00300837789305
450	-0.00126785316191
450	-0.0003302482161
450	-0.000263582445707
500	-0.00292352803756
500	-0.00173363646434
500	-0.00242733663537
500	-0.00370430647202
500	-0.00307351738817
500	-0.00452809916526
500	-0.00158820752298
500	-0.00340202799856
500	-0.00135151514705
500	-0.00125444818312
550	-0.00103096741174
550	-0.000379848709517
550	-0.00128077240303
550	-0.00169243624014
550	-0.00226772921823
550	4.03189901518e-05
550	-0.00276645980841
550	-0.00360651435468
550	-0.000437504160999
550	-0.00410659165833
600	-0.00303990480094
600	-0.00339905371854
600	-0.00104027469824
600	-0.00444552606128
600	-0.00260584868686
600	-0.00317368064207
600	-0.00179522385877
600	-0.001395804755
600	-0.00330660701777
600	-0.00414711046854
