,scenario,replicate,damage,coverage,error_rate,expected_class,observed_class,softmax_for_observed_class,nb_SNP
0,scenario_05003,BacterialDemoSelection_05003_002.npz,0,0,0,0,0,0.9670812487602234,329
1,scenario_05003,BacterialDemoSelection_05003_007.npz,0,0,0,0,0,0.9438114166259766,327
2,scenario_05003,BacterialDemoSelection_05003_015.npz,0,0,0,0,0,0.9999977350234985,391
3,scenario_05003,BacterialDemoSelection_05003_029.npz,0,0,0,0,0,0.9999818801879883,410
4,scenario_05003,BacterialDemoSelection_05003_033.npz,0,0,0,0,0,0.8611253499984741,185
5,scenario_05003,BacterialDemoSelection_05003_062.npz,0,0,0,0,0,0.9547140002250671,301
6,scenario_05003,BacterialDemoSelection_05003_079.npz,0,0,0,0,0,0.9422052502632141,316
7,scenario_05003,BacterialDemoSelection_05003_080.npz,0,0,0,0,0,0.9681811332702637,297
8,scenario_05003,BacterialDemoSelection_05003_089.npz,0,0,0,0,0,0.978056788444519,331
9,scenario_05003,BacterialDemoSelection_05003_099.npz,0,0,0,0,0,0.9996981620788574,429
10,scenario_05008,BacterialDemoSelection_05008_008.npz,0,0,0,0,0,0.9999996423721313,2657
11,scenario_05008,BacterialDemoSelection_05008_011.npz,0,0,0,0,0,0.9999967813491821,2361
12,scenario_05008,BacterialDemoSelection_05008_013.npz,0,0,0,0,0,0.9999979734420776,1575
13,scenario_05008,BacterialDemoSelection_05008_019.npz,0,0,0,0,0,0.9999985694885254,2426
14,scenario_05008,BacterialDemoSelection_05008_046.npz,0,0,0,0,0,0.9999996423721313,2497
15,scenario_05008,BacterialDemoSelection_05008_057.npz,0,0,0,0,0,0.9999995231628418,1840
16,scenario_05008,BacterialDemoSelection_05008_077.npz,0,0,0,0,0,0.9999998807907104,1746
17,scenario_05008,BacterialDemoSelection_05008_085.npz,0,0,0,0,0,0.9999992847442627,1301
18,scenario_05008,BacterialDemoSelection_05008_092.npz,0,0,0,0,0,1.0,1760
19,scenario_05008,BacterialDemoSelection_05008_097.npz,0,0,0,0,0,0.9999991655349731,1426
20,scenario_05020,BacterialDemoSelection_05020_015.npz,0,0,0,0,0,0.9996330738067627,384
21,scenario_05020,BacterialDemoSelection_05020_016.npz,0,0,0,0,0,1.0,597
22,scenario_05020,BacterialDemoSelection_05020_023.npz,0,0,0,0,0,0.9802379608154297,358
23,scenario_05020,BacterialDemoSelection_05020_028.npz,0,0,0,0,0,1.0,646
24,scenario_05020,BacterialDemoSelection_05020_032.npz,0,0,0,0,0,1.0,525
25,scenario_05020,BacterialDemoSelection_05020_033.npz,0,0,0,0,0,1.0,461
26,scenario_05020,BacterialDemoSelection_05020_045.npz,0,0,0,0,0,1.0,799
27,scenario_05020,BacterialDemoSelection_05020_050.npz,0,0,0,0,0,1.0,721
28,scenario_05020,BacterialDemoSelection_05020_053.npz,0,0,0,0,0,0.9999996423721313,361
29,scenario_05020,BacterialDemoSelection_05020_086.npz,0,0,0,0,0,1.0,592
30,scenario_05035,BacterialDemoSelection_05035_003.npz,0,0,0,0,0,1.0,532
31,scenario_05035,BacterialDemoSelection_05035_012.npz,0,0,0,0,0,0.9999995231628418,495
32,scenario_05035,BacterialDemoSelection_05035_019.npz,0,0,0,0,0,1.0,563
33,scenario_05035,BacterialDemoSelection_05035_020.npz,0,0,0,0,0,0.9999912977218628,368
34,scenario_05035,BacterialDemoSelection_05035_025.npz,0,0,0,0,0,1.0,507
35,scenario_05035,BacterialDemoSelection_05035_061.npz,0,0,0,0,0,1.0,613
36,scenario_05035,BacterialDemoSelection_05035_067.npz,0,0,0,0,0,0.9351908564567566,256
37,scenario_05035,BacterialDemoSelection_05035_084.npz,0,0,0,0,0,1.0,559
38,scenario_05035,BacterialDemoSelection_05035_091.npz,0,0,0,0,0,0.9999982118606567,370
39,scenario_05035,BacterialDemoSelection_05035_093.npz,0,0,0,0,0,1.0,556
40,scenario_05070,BacterialDemoSelection_05070_003.npz,0,0,0,0,0,0.9999986886978149,3091
41,scenario_05070,BacterialDemoSelection_05070_007.npz,0,0,0,0,0,0.999994158744812,3838
42,scenario_05070,BacterialDemoSelection_05070_047.npz,0,0,0,0,0,0.9999977350234985,5124
43,scenario_05070,BacterialDemoSelection_05070_054.npz,0,0,0,0,0,0.9999821186065674,3696
44,scenario_05070,BacterialDemoSelection_05070_057.npz,0,0,0,0,0,0.999996542930603,2472
45,scenario_05070,BacterialDemoSelection_05070_067.npz,0,0,0,0,0,0.9999996423721313,2052
46,scenario_05070,BacterialDemoSelection_05070_078.npz,0,0,0,0,0,0.9999955892562866,4153
47,scenario_05070,BacterialDemoSelection_05070_080.npz,0,0,0,0,0,0.999998927116394,2321
48,scenario_05070,BacterialDemoSelection_05070_081.npz,0,0,0,0,0,0.9999986886978149,2421
49,scenario_05070,BacterialDemoSelection_05070_082.npz,0,0,0,0,0,0.9999992847442627,3260
50,scenario_05120,BacterialDemoSelection_05120_043.npz,0,0,0,0,0,0.9999957084655762,372
51,scenario_05120,BacterialDemoSelection_05120_049.npz,0,0,0,0,0,0.9776036739349365,328
52,scenario_05120,BacterialDemoSelection_05120_050.npz,0,0,0,0,0,0.9788132905960083,321
53,scenario_05120,BacterialDemoSelection_05120_053.npz,0,0,0,0,0,0.9733079075813293,298
54,scenario_05120,BacterialDemoSelection_05120_060.npz,0,0,0,0,0,1.0,450
55,scenario_05120,BacterialDemoSelection_05120_069.npz,0,0,0,0,0,0.9999980926513672,396
56,scenario_05120,BacterialDemoSelection_05120_082.npz,0,0,0,0,0,0.9820212125778198,278
57,scenario_05120,BacterialDemoSelection_05120_088.npz,0,0,0,0,0,0.9903379678726196,252
58,scenario_05120,BacterialDemoSelection_05120_089.npz,0,0,0,0,0,0.9868505001068115,328
59,scenario_05120,BacterialDemoSelection_05120_097.npz,0,0,0,0,0,0.86348956823349,214
60,scenario_05149,BacterialDemoSelection_05149_007.npz,0,0,0,0,0,1.0,874
61,scenario_05149,BacterialDemoSelection_05149_010.npz,0,0,0,0,0,1.0,879
62,scenario_05149,BacterialDemoSelection_05149_020.npz,0,0,0,0,0,0.9999998807907104,487
63,scenario_05149,BacterialDemoSelection_05149_035.npz,0,0,0,0,0,1.0,1099
64,scenario_05149,BacterialDemoSelection_05149_039.npz,0,0,0,0,0,0.9996351003646851,427
65,scenario_05149,BacterialDemoSelection_05149_042.npz,0,0,0,0,0,1.0,843
66,scenario_05149,BacterialDemoSelection_05149_060.npz,0,0,0,0,0,1.0,700
67,scenario_05149,BacterialDemoSelection_05149_073.npz,0,0,0,0,0,1.0,895
68,scenario_05149,BacterialDemoSelection_05149_074.npz,0,0,0,0,0,0.9999934434890747,432
69,scenario_05149,BacterialDemoSelection_05149_089.npz,0,0,0,0,0,1.0,574
70,scenario_05205,BacterialDemoSelection_05205_000.npz,0,0,0,0,0,1.0,697
71,scenario_05205,BacterialDemoSelection_05205_006.npz,0,0,0,0,0,1.0,737
72,scenario_05205,BacterialDemoSelection_05205_008.npz,0,0,0,0,0,0.9999997615814209,386
73,scenario_05205,BacterialDemoSelection_05205_012.npz,0,0,0,0,0,1.0,495
74,scenario_05205,BacterialDemoSelection_05205_015.npz,0,0,0,0,0,1.0,544
75,scenario_05205,BacterialDemoSelection_05205_022.npz,0,0,0,0,0,0.9999985694885254,416
76,scenario_05205,BacterialDemoSelection_05205_029.npz,0,0,0,0,0,1.0,553
77,scenario_05205,BacterialDemoSelection_05205_049.npz,0,0,0,0,0,1.0,446
78,scenario_05205,BacterialDemoSelection_05205_059.npz,0,0,0,0,0,1.0,443
79,scenario_05205,BacterialDemoSelection_05205_092.npz,0,0,0,0,0,1.0,732
80,scenario_05211,BacterialDemoSelection_05211_005.npz,0,0,0,0,0,1.0,1009
81,scenario_05211,BacterialDemoSelection_05211_014.npz,0,0,0,0,0,1.0,633
82,scenario_05211,BacterialDemoSelection_05211_016.npz,0,0,0,0,0,1.0,476
83,scenario_05211,BacterialDemoSelection_05211_022.npz,0,0,0,0,0,1.0,557
84,scenario_05211,BacterialDemoSelection_05211_045.npz,0,0,0,0,0,0.9987742304801941,403
85,scenario_05211,BacterialDemoSelection_05211_054.npz,0,0,0,0,0,1.0,677
86,scenario_05211,BacterialDemoSelection_05211_057.npz,0,0,0,0,0,1.0,550
87,scenario_05211,BacterialDemoSelection_05211_058.npz,0,0,0,0,0,1.0,680
88,scenario_05211,BacterialDemoSelection_05211_083.npz,0,0,0,0,0,0.9999979734420776,434
89,scenario_05211,BacterialDemoSelection_05211_095.npz,0,0,0,0,0,1.0,492
90,scenario_05237,BacterialDemoSelection_05237_003.npz,0,0,0,0,0,1.0,475
91,scenario_05237,BacterialDemoSelection_05237_010.npz,0,0,0,0,0,1.0,967
92,scenario_05237,BacterialDemoSelection_05237_017.npz,0,0,0,0,0,1.0,620
93,scenario_05237,BacterialDemoSelection_05237_026.npz,0,0,0,0,0,1.0,621
94,scenario_05237,BacterialDemoSelection_05237_034.npz,0,0,0,0,0,1.0,567
95,scenario_05237,BacterialDemoSelection_05237_043.npz,0,0,0,0,0,1.0,709
96,scenario_05237,BacterialDemoSelection_05237_048.npz,0,0,0,0,0,1.0,932
97,scenario_05237,BacterialDemoSelection_05237_056.npz,0,0,0,0,0,1.0,1033
98,scenario_05237,BacterialDemoSelection_05237_077.npz,0,0,0,0,0,1.0,599
99,scenario_05237,BacterialDemoSelection_05237_096.npz,0,0,0,0,0,1.0,1053
100,scenario_05256,BacterialDemoSelection_05256_007.npz,0,0,0,0,0,1.0,989
101,scenario_05256,BacterialDemoSelection_05256_010.npz,0,0,0,0,0,1.0,1112
102,scenario_05256,BacterialDemoSelection_05256_030.npz,0,0,0,0,0,0.9999997615814209,1794
103,scenario_05256,BacterialDemoSelection_05256_037.npz,0,0,0,0,0,0.9999998807907104,1913
104,scenario_05256,BacterialDemoSelection_05256_038.npz,0,0,0,0,0,1.0,931
105,scenario_05256,BacterialDemoSelection_05256_039.npz,0,0,0,0,0,1.0,683
106,scenario_05256,BacterialDemoSelection_05256_043.npz,0,0,0,0,0,0.9999994039535522,1353
107,scenario_05256,BacterialDemoSelection_05256_047.npz,0,0,0,0,0,1.0,1078
108,scenario_05256,BacterialDemoSelection_05256_049.npz,0,0,0,0,0,0.9999998807907104,2280
109,scenario_05256,BacterialDemoSelection_05256_055.npz,0,0,0,0,0,0.9999754428863525,1311
110,scenario_05299,BacterialDemoSelection_05299_003.npz,0,0,0,0,0,1.0,1173
111,scenario_05299,BacterialDemoSelection_05299_030.npz,0,0,0,0,0,0.9999697208404541,741
112,scenario_05299,BacterialDemoSelection_05299_051.npz,0,0,0,0,0,1.0,638
113,scenario_05299,BacterialDemoSelection_05299_056.npz,0,0,0,0,0,1.0,518
114,scenario_05299,BacterialDemoSelection_05299_066.npz,0,0,0,0,0,1.0,564
115,scenario_05299,BacterialDemoSelection_05299_067.npz,0,0,0,0,0,1.0,795
116,scenario_05299,BacterialDemoSelection_05299_071.npz,0,0,0,0,0,1.0,634
117,scenario_05299,BacterialDemoSelection_05299_085.npz,0,0,0,0,0,1.0,572
118,scenario_05299,BacterialDemoSelection_05299_088.npz,0,0,0,0,0,1.0,912
119,scenario_05299,BacterialDemoSelection_05299_095.npz,0,0,0,0,0,1.0,986
120,scenario_05345,BacterialDemoSelection_05345_009.npz,0,0,0,0,0,0.9999998807907104,1183
121,scenario_05345,BacterialDemoSelection_05345_010.npz,0,0,0,0,0,1.0,1279
122,scenario_05345,BacterialDemoSelection_05345_018.npz,0,0,0,0,0,0.9999994039535522,1446
123,scenario_05345,BacterialDemoSelection_05345_023.npz,0,0,0,0,0,1.0,1063
124,scenario_05345,BacterialDemoSelection_05345_031.npz,0,0,0,0,0,0.9999995231628418,2140
125,scenario_05345,BacterialDemoSelection_05345_038.npz,0,0,0,0,0,0.9999998807907104,1406
126,scenario_05345,BacterialDemoSelection_05345_053.npz,0,0,0,0,0,0.9999998807907104,1446
127,scenario_05345,BacterialDemoSelection_05345_057.npz,0,0,0,0,0,0.9999998807907104,1064
128,scenario_05345,BacterialDemoSelection_05345_067.npz,0,0,0,0,0,0.9999996423721313,1397
129,scenario_05345,BacterialDemoSelection_05345_073.npz,0,0,0,0,0,0.9999998807907104,1151
130,scenario_05364,BacterialDemoSelection_05364_004.npz,0,0,0,0,0,0.9999984502792358,2099
131,scenario_05364,BacterialDemoSelection_05364_010.npz,0,0,0,0,0,0.9999996423721313,2448
132,scenario_05364,BacterialDemoSelection_05364_034.npz,0,0,0,0,0,0.9999997615814209,2591
133,scenario_05364,BacterialDemoSelection_05364_041.npz,0,0,0,0,0,0.9999990463256836,2569
134,scenario_05364,BacterialDemoSelection_05364_066.npz,0,0,0,0,0,0.9999998807907104,1625
135,scenario_05364,BacterialDemoSelection_05364_069.npz,0,0,0,0,0,0.9999983310699463,2398
136,scenario_05364,BacterialDemoSelection_05364_073.npz,0,0,0,0,0,0.9999994039535522,2339
137,scenario_05364,BacterialDemoSelection_05364_079.npz,0,0,0,0,0,0.9999963045120239,2494
138,scenario_05364,BacterialDemoSelection_05364_087.npz,0,0,0,0,0,0.9999977350234985,2984
139,scenario_05364,BacterialDemoSelection_05364_097.npz,0,0,0,0,0,0.9999992847442627,2057
140,scenario_05382,BacterialDemoSelection_05382_001.npz,0,0,0,0,0,0.9999969005584717,3596
141,scenario_05382,BacterialDemoSelection_05382_006.npz,0,0,0,0,0,0.9999984502792358,5223
142,scenario_05382,BacterialDemoSelection_05382_036.npz,0,0,0,0,0,0.9999998807907104,3065
143,scenario_05382,BacterialDemoSelection_05382_042.npz,0,0,0,0,0,0.9999985694885254,3237
144,scenario_05382,BacterialDemoSelection_05382_049.npz,0,0,0,0,0,0.9999971389770508,4248
145,scenario_05382,BacterialDemoSelection_05382_054.npz,0,0,0,0,0,0.9999991655349731,2473
146,scenario_05382,BacterialDemoSelection_05382_060.npz,0,0,0,0,0,0.9999977350234985,5118
147,scenario_05382,BacterialDemoSelection_05382_073.npz,0,0,0,0,0,0.9999988079071045,4192
148,scenario_05382,BacterialDemoSelection_05382_076.npz,0,0,0,0,0,0.9999996423721313,2651
149,scenario_05382,BacterialDemoSelection_05382_086.npz,0,0,0,0,0,0.9999985694885254,3199
150,scenario_05389,BacterialDemoSelection_05389_004.npz,0,0,0,0,0,0.9999998807907104,1631
151,scenario_05389,BacterialDemoSelection_05389_042.npz,0,0,0,0,0,1.0,1139
152,scenario_05389,BacterialDemoSelection_05389_051.npz,0,0,0,0,0,1.0,1267
153,scenario_05389,BacterialDemoSelection_05389_053.npz,0,0,0,0,0,1.0,1252
154,scenario_05389,BacterialDemoSelection_05389_070.npz,0,0,0,0,0,0.9999995231628418,1717
155,scenario_05389,BacterialDemoSelection_05389_071.npz,0,0,0,0,0,0.9999997615814209,2368
156,scenario_05389,BacterialDemoSelection_05389_076.npz,0,0,0,0,0,1.0,893
157,scenario_05389,BacterialDemoSelection_05389_080.npz,0,0,0,0,0,0.9999998807907104,1180
158,scenario_05389,BacterialDemoSelection_05389_092.npz,0,0,0,0,0,0.9999992847442627,1728
159,scenario_05389,BacterialDemoSelection_05389_096.npz,0,0,0,0,0,0.9999997615814209,1462
160,scenario_05392,BacterialDemoSelection_05392_014.npz,0,0,0,0,0,1.0,867
161,scenario_05392,BacterialDemoSelection_05392_016.npz,0,0,0,0,0,1.0,729
162,scenario_05392,BacterialDemoSelection_05392_022.npz,0,0,0,0,0,0.9999998807907104,841
163,scenario_05392,BacterialDemoSelection_05392_038.npz,0,0,0,0,0,1.0,898
164,scenario_05392,BacterialDemoSelection_05392_043.npz,0,0,0,0,0,1.0,559
165,scenario_05392,BacterialDemoSelection_05392_050.npz,0,0,0,0,0,1.0,643
166,scenario_05392,BacterialDemoSelection_05392_053.npz,0,0,0,0,0,1.0,714
167,scenario_05392,BacterialDemoSelection_05392_062.npz,0,0,0,0,0,1.0,914
168,scenario_05392,BacterialDemoSelection_05392_065.npz,0,0,0,0,0,1.0,1265
169,scenario_05392,BacterialDemoSelection_05392_096.npz,0,0,0,0,0,1.0,932
170,scenario_05414,BacterialDemoSelection_05414_000.npz,0,0,0,0,0,1.0,1019
171,scenario_05414,BacterialDemoSelection_05414_001.npz,0,0,0,0,0,1.0,1483
172,scenario_05414,BacterialDemoSelection_05414_009.npz,0,0,0,0,0,0.9999998807907104,1432
173,scenario_05414,BacterialDemoSelection_05414_013.npz,0,0,0,0,0,0.9999998807907104,1036
174,scenario_05414,BacterialDemoSelection_05414_025.npz,0,0,0,0,0,1.0,943
175,scenario_05414,BacterialDemoSelection_05414_049.npz,0,0,0,0,0,1.0,1116
176,scenario_05414,BacterialDemoSelection_05414_053.npz,0,0,0,0,0,0.9999995231628418,1844
177,scenario_05414,BacterialDemoSelection_05414_065.npz,0,0,0,0,0,1.0,998
178,scenario_05414,BacterialDemoSelection_05414_082.npz,0,0,0,0,0,1.0,823
179,scenario_05414,BacterialDemoSelection_05414_095.npz,0,0,0,0,0,1.0,727
180,scenario_05499,BacterialDemoSelection_05499_005.npz,0,0,0,0,0,1.0,487
181,scenario_05499,BacterialDemoSelection_05499_016.npz,0,0,0,0,0,1.0,545
182,scenario_05499,BacterialDemoSelection_05499_041.npz,0,0,0,0,0,1.0,951
183,scenario_05499,BacterialDemoSelection_05499_052.npz,0,0,0,0,0,1.0,861
184,scenario_05499,BacterialDemoSelection_05499_057.npz,0,0,0,0,0,1.0,705
185,scenario_05499,BacterialDemoSelection_05499_060.npz,0,0,0,0,0,0.9999998807907104,1043
186,scenario_05499,BacterialDemoSelection_05499_076.npz,0,0,0,0,0,1.0,697
187,scenario_05499,BacterialDemoSelection_05499_079.npz,0,0,0,0,0,1.0,879
188,scenario_05499,BacterialDemoSelection_05499_086.npz,0,0,0,0,0,0.9803770780563354,422
189,scenario_05499,BacterialDemoSelection_05499_089.npz,0,0,0,0,0,1.0,1031
190,scenario_05502,BacterialDemoSelection_05502_003.npz,0,0,0,1,1,1.0,413
191,scenario_05502,BacterialDemoSelection_05502_014.npz,0,0,0,1,1,1.0,505
192,scenario_05502,BacterialDemoSelection_05502_023.npz,0,0,0,1,1,1.0,508
193,scenario_05502,BacterialDemoSelection_05502_034.npz,0,0,0,1,1,1.0,397
194,scenario_05502,BacterialDemoSelection_05502_039.npz,0,0,0,1,1,1.0,496
195,scenario_05502,BacterialDemoSelection_05502_052.npz,0,0,0,1,1,1.0,434
196,scenario_05502,BacterialDemoSelection_05502_053.npz,0,0,0,1,1,1.0,481
197,scenario_05502,BacterialDemoSelection_05502_064.npz,0,0,0,1,1,1.0,412
198,scenario_05502,BacterialDemoSelection_05502_079.npz,0,0,0,1,1,1.0,478
199,scenario_05502,BacterialDemoSelection_05502_094.npz,0,0,0,1,1,1.0,472
200,scenario_05505,BacterialDemoSelection_05505_019.npz,0,0,0,1,1,0.9998984336853027,315
201,scenario_05505,BacterialDemoSelection_05505_020.npz,0,0,0,1,1,1.0,452
202,scenario_05505,BacterialDemoSelection_05505_022.npz,0,0,0,1,1,1.0,387
203,scenario_05505,BacterialDemoSelection_05505_029.npz,0,0,0,1,1,1.0,336
204,scenario_05505,BacterialDemoSelection_05505_048.npz,0,0,0,1,1,1.0,344
205,scenario_05505,BacterialDemoSelection_05505_050.npz,0,0,0,1,1,0.9998968839645386,249
206,scenario_05505,BacterialDemoSelection_05505_063.npz,0,0,0,1,1,1.0,448
207,scenario_05505,BacterialDemoSelection_05505_067.npz,0,0,0,1,1,1.0,399
208,scenario_05505,BacterialDemoSelection_05505_093.npz,0,0,0,1,1,1.0,419
209,scenario_05505,BacterialDemoSelection_05505_094.npz,0,0,0,1,1,1.0,390
210,scenario_05514,BacterialDemoSelection_05514_002.npz,0,0,0,1,1,1.0,623
211,scenario_05514,BacterialDemoSelection_05514_008.npz,0,0,0,1,1,1.0,543
212,scenario_05514,BacterialDemoSelection_05514_011.npz,0,0,0,1,0,1.430511474609375e-06,3021
213,scenario_05514,BacterialDemoSelection_05514_017.npz,0,0,0,1,1,1.0,606
214,scenario_05514,BacterialDemoSelection_05514_019.npz,0,0,0,1,1,1.0,585
215,scenario_05514,BacterialDemoSelection_05514_035.npz,0,0,0,1,1,1.0,633
216,scenario_05514,BacterialDemoSelection_05514_062.npz,0,0,0,1,1,1.0,600
217,scenario_05514,BacterialDemoSelection_05514_063.npz,0,0,0,1,1,1.0,681
218,scenario_05514,BacterialDemoSelection_05514_082.npz,0,0,0,1,1,0.9999969005584717,547
219,scenario_05514,BacterialDemoSelection_05514_089.npz,0,0,0,1,1,1.0,641
220,scenario_05517,BacterialDemoSelection_05517_004.npz,0,0,0,1,0,0.14203470945358276,156
221,scenario_05517,BacterialDemoSelection_05517_014.npz,0,0,0,1,0,0.13074779510498047,145
222,scenario_05517,BacterialDemoSelection_05517_017.npz,0,0,0,1,0,0.15490084886550903,146
223,scenario_05517,BacterialDemoSelection_05517_031.npz,0,0,0,1,0,0.13810420036315918,157
224,scenario_05517,BacterialDemoSelection_05517_037.npz,0,0,0,1,0,0.13271069526672363,179
225,scenario_05517,BacterialDemoSelection_05517_050.npz,0,0,0,1,0,0.15078336000442505,172
226,scenario_05517,BacterialDemoSelection_05517_051.npz,0,0,0,1,0,0.13874244689941406,191
227,scenario_05517,BacterialDemoSelection_05517_062.npz,0,0,0,1,0,0.14443403482437134,178
228,scenario_05517,BacterialDemoSelection_05517_087.npz,0,0,0,1,0,0.14748990535736084,164
229,scenario_05517,BacterialDemoSelection_05517_088.npz,0,0,0,1,0,0.14061397314071655,225
230,scenario_05527,BacterialDemoSelection_05527_000.npz,0,0,0,1,0,0.00251162052154541,406
231,scenario_05527,BacterialDemoSelection_05527_002.npz,0,0,0,1,0,0.0005255341529846191,433
232,scenario_05527,BacterialDemoSelection_05527_004.npz,0,0,0,1,0,3.170967102050781e-05,356
233,scenario_05527,BacterialDemoSelection_05527_007.npz,0,0,0,1,0,0.00021880865097045898,413
234,scenario_05527,BacterialDemoSelection_05527_035.npz,0,0,0,1,0,0.052198708057403564,282
235,scenario_05527,BacterialDemoSelection_05527_041.npz,0,0,0,1,0,0.048424601554870605,285
236,scenario_05527,BacterialDemoSelection_05527_042.npz,0,0,0,1,0,0.14256364107131958,258
237,scenario_05527,BacterialDemoSelection_05527_047.npz,0,0,0,1,0,0.06494778394699097,299
238,scenario_05527,BacterialDemoSelection_05527_051.npz,0,0,0,1,0,4.9591064453125e-05,448
239,scenario_05527,BacterialDemoSelection_05527_068.npz,0,0,0,1,0,0.10299450159072876,313
240,scenario_05548,BacterialDemoSelection_05548_000.npz,0,0,0,1,1,1.0,432
241,scenario_05548,BacterialDemoSelection_05548_021.npz,0,0,0,1,1,1.0,479
242,scenario_05548,BacterialDemoSelection_05548_040.npz,0,0,0,1,1,1.0,534
243,scenario_05548,BacterialDemoSelection_05548_043.npz,0,0,0,1,1,1.0,470
244,scenario_05548,BacterialDemoSelection_05548_051.npz,0,0,0,1,1,1.0,482
245,scenario_05548,BacterialDemoSelection_05548_067.npz,0,0,0,1,1,1.0,526
246,scenario_05548,BacterialDemoSelection_05548_070.npz,0,0,0,1,1,1.0,482
247,scenario_05548,BacterialDemoSelection_05548_072.npz,0,0,0,1,1,1.0,482
248,scenario_05548,BacterialDemoSelection_05548_073.npz,0,0,0,1,1,1.0,502
249,scenario_05548,BacterialDemoSelection_05548_080.npz,0,0,0,1,1,1.0,436
250,scenario_05550,BacterialDemoSelection_05550_007.npz,0,0,0,1,0,0.0013768672943115234,350
251,scenario_05550,BacterialDemoSelection_05550_022.npz,0,0,0,1,1,1.0,343
252,scenario_05550,BacterialDemoSelection_05550_024.npz,0,0,0,1,1,1.0,422
253,scenario_05550,BacterialDemoSelection_05550_052.npz,0,0,0,1,0,0.2299322485923767,379
254,scenario_05550,BacterialDemoSelection_05550_058.npz,0,0,0,1,1,1.0,412
255,scenario_05550,BacterialDemoSelection_05550_071.npz,0,0,0,1,1,1.0,364
256,scenario_05550,BacterialDemoSelection_05550_072.npz,0,0,0,1,1,0.9999994039535522,377
257,scenario_05550,BacterialDemoSelection_05550_073.npz,0,0,0,1,0,0.006515800952911377,420
258,scenario_05550,BacterialDemoSelection_05550_075.npz,0,0,0,1,0,0.00862652063369751,344
259,scenario_05550,BacterialDemoSelection_05550_093.npz,0,0,0,1,1,1.0,379
260,scenario_05558,BacterialDemoSelection_05558_001.npz,0,0,0,1,1,1.0,491
261,scenario_05558,BacterialDemoSelection_05558_008.npz,0,0,0,1,1,1.0,478
262,scenario_05558,BacterialDemoSelection_05558_012.npz,0,0,0,1,1,1.0,464
263,scenario_05558,BacterialDemoSelection_05558_026.npz,0,0,0,1,1,1.0,519
264,scenario_05558,BacterialDemoSelection_05558_041.npz,0,0,0,1,1,1.0,540
265,scenario_05558,BacterialDemoSelection_05558_061.npz,0,0,0,1,1,1.0,458
266,scenario_05558,BacterialDemoSelection_05558_065.npz,0,0,0,1,1,1.0,482
267,scenario_05558,BacterialDemoSelection_05558_070.npz,0,0,0,1,1,1.0,514
268,scenario_05558,BacterialDemoSelection_05558_095.npz,0,0,0,1,1,1.0,507
269,scenario_05558,BacterialDemoSelection_05558_096.npz,0,0,0,1,1,1.0,453
270,scenario_05576,BacterialDemoSelection_05576_001.npz,0,0,0,1,0,0.0494915246963501,254
271,scenario_05576,BacterialDemoSelection_05576_004.npz,0,0,0,1,0,0.055278003215789795,242
272,scenario_05576,BacterialDemoSelection_05576_017.npz,0,0,0,1,0,0.14651423692703247,217
273,scenario_05576,BacterialDemoSelection_05576_025.npz,0,0,0,1,0,0.1378653645515442,185
274,scenario_05576,BacterialDemoSelection_05576_037.npz,0,0,0,1,0,0.15188825130462646,231
275,scenario_05576,BacterialDemoSelection_05576_038.npz,0,0,0,1,1,0.999873161315918,263
276,scenario_05576,BacterialDemoSelection_05576_053.npz,0,0,0,1,0,0.14767968654632568,177
277,scenario_05576,BacterialDemoSelection_05576_068.npz,0,0,0,1,0,0.14607000350952148,229
278,scenario_05576,BacterialDemoSelection_05576_069.npz,0,0,0,1,0,0.06556481122970581,250
279,scenario_05576,BacterialDemoSelection_05576_072.npz,0,0,0,1,0,0.04911637306213379,257
280,scenario_05585,BacterialDemoSelection_05585_010.npz,0,0,0,1,1,1.0,390
281,scenario_05585,BacterialDemoSelection_05585_024.npz,0,0,0,1,1,1.0,375
282,scenario_05585,BacterialDemoSelection_05585_025.npz,0,0,0,1,1,0.9986715316772461,301
283,scenario_05585,BacterialDemoSelection_05585_033.npz,0,0,0,1,0,0.06061065196990967,300
284,scenario_05585,BacterialDemoSelection_05585_057.npz,0,0,0,1,1,1.0,367
285,scenario_05585,BacterialDemoSelection_05585_062.npz,0,0,0,1,1,1.0,325
286,scenario_05585,BacterialDemoSelection_05585_065.npz,0,0,0,1,1,0.9999997615814209,370
287,scenario_05585,BacterialDemoSelection_05585_080.npz,0,0,0,1,0,1.1920928955078125e-07,691
288,scenario_05585,BacterialDemoSelection_05585_085.npz,0,0,0,1,1,1.0,357
289,scenario_05585,BacterialDemoSelection_05585_087.npz,0,0,0,1,0,3.314018249511719e-05,436
290,scenario_05608,BacterialDemoSelection_05608_008.npz,0,0,0,1,1,1.0,461
291,scenario_05608,BacterialDemoSelection_05608_046.npz,0,0,0,1,1,1.0,401
292,scenario_05608,BacterialDemoSelection_05608_051.npz,0,0,0,1,1,0.9707036018371582,411
293,scenario_05608,BacterialDemoSelection_05608_054.npz,0,0,0,1,0,0.13875067234039307,314
294,scenario_05608,BacterialDemoSelection_05608_076.npz,0,0,0,1,1,0.9999485015869141,392
295,scenario_05608,BacterialDemoSelection_05608_079.npz,0,0,0,1,0,0.05460745096206665,298
296,scenario_05608,BacterialDemoSelection_05608_082.npz,0,0,0,1,1,0.9974461793899536,347
297,scenario_05608,BacterialDemoSelection_05608_090.npz,0,0,0,1,1,0.9999998807907104,431
298,scenario_05608,BacterialDemoSelection_05608_091.npz,0,0,0,1,1,1.0,461
299,scenario_05608,BacterialDemoSelection_05608_093.npz,0,0,0,1,0,0.028057217597961426,344
300,scenario_05620,BacterialDemoSelection_05620_008.npz,0,0,0,1,0,0.011662662029266357,255
301,scenario_05620,BacterialDemoSelection_05620_014.npz,0,0,0,1,0,0.024031221866607666,244
302,scenario_05620,BacterialDemoSelection_05620_019.npz,0,0,0,1,0,0.01635003089904785,261
303,scenario_05620,BacterialDemoSelection_05620_026.npz,0,0,0,1,0,9.5367431640625e-07,400
304,scenario_05620,BacterialDemoSelection_05620_038.npz,0,0,0,1,0,2.2649765014648438e-06,345
305,scenario_05620,BacterialDemoSelection_05620_042.npz,0,0,0,1,0,0.14761489629745483,222
306,scenario_05620,BacterialDemoSelection_05620_050.npz,0,0,0,1,0,0.022437095642089844,274
307,scenario_05620,BacterialDemoSelection_05620_054.npz,0,0,0,1,0,0.151370108127594,200
308,scenario_05620,BacterialDemoSelection_05620_079.npz,0,0,0,1,0,0.01240384578704834,300
309,scenario_05620,BacterialDemoSelection_05620_097.npz,0,0,0,1,0,0.01690894365310669,256
310,scenario_05629,BacterialDemoSelection_05629_005.npz,0,0,0,1,1,1.0,249
311,scenario_05629,BacterialDemoSelection_05629_028.npz,0,0,0,1,1,1.0,241
312,scenario_05629,BacterialDemoSelection_05629_030.npz,0,0,0,1,1,1.0,272
313,scenario_05629,BacterialDemoSelection_05629_035.npz,0,0,0,1,0,0.16114658117294312,219
314,scenario_05629,BacterialDemoSelection_05629_038.npz,0,0,0,1,0,0.14863353967666626,205
315,scenario_05629,BacterialDemoSelection_05629_041.npz,0,0,0,1,0,0.16776353120803833,230
316,scenario_05629,BacterialDemoSelection_05629_043.npz,0,0,0,1,1,0.9999792575836182,263
317,scenario_05629,BacterialDemoSelection_05629_051.npz,0,0,0,1,0,0.15286558866500854,206
318,scenario_05629,BacterialDemoSelection_05629_071.npz,0,0,0,1,0,0.14328694343566895,211
319,scenario_05629,BacterialDemoSelection_05629_095.npz,0,0,0,1,0,0.15588796138763428,239
320,scenario_05752,BacterialDemoSelection_05752_003.npz,0,0,0,1,0,0.05390232801437378,285
321,scenario_05752,BacterialDemoSelection_05752_008.npz,0,0,0,1,0,0.06360608339309692,283
322,scenario_05752,BacterialDemoSelection_05752_013.npz,0,0,0,1,0,0.020357608795166016,271
323,scenario_05752,BacterialDemoSelection_05752_019.npz,0,0,0,1,0,0.007106125354766846,342
324,scenario_05752,BacterialDemoSelection_05752_023.npz,0,0,0,1,0,0.04794728755950928,308
325,scenario_05752,BacterialDemoSelection_05752_025.npz,0,0,0,1,0,0.00238955020904541,362
326,scenario_05752,BacterialDemoSelection_05752_032.npz,0,0,0,1,0,0.0059285759925842285,408
327,scenario_05752,BacterialDemoSelection_05752_074.npz,0,0,0,1,0,0.03435373306274414,312
328,scenario_05752,BacterialDemoSelection_05752_094.npz,0,0,0,1,0,0.0018205642700195312,376
329,scenario_05752,BacterialDemoSelection_05752_098.npz,0,0,0,1,0,0.06092315912246704,321
330,scenario_05754,BacterialDemoSelection_05754_042.npz,0,0,0,1,0,2.384185791015625e-07,790
331,scenario_05754,BacterialDemoSelection_05754_057.npz,0,0,0,1,0,5.638599395751953e-05,1363
332,scenario_05754,BacterialDemoSelection_05754_064.npz,0,0,0,1,0,1.1920928955078125e-07,1009
333,scenario_05754,BacterialDemoSelection_05754_067.npz,0,0,0,1,0,0.008615493774414062,2089
334,scenario_05754,BacterialDemoSelection_05754_068.npz,0,0,0,1,0,2.968311309814453e-05,1257
335,scenario_05754,BacterialDemoSelection_05754_069.npz,0,0,0,1,0,0.0,926
336,scenario_05754,BacterialDemoSelection_05754_079.npz,0,0,0,1,0,0.0005440115928649902,1824
337,scenario_05754,BacterialDemoSelection_05754_080.npz,0,0,0,1,0,2.384185791015625e-07,1332
338,scenario_05754,BacterialDemoSelection_05754_097.npz,0,0,0,1,0,2.86102294921875e-06,1069
339,scenario_05754,BacterialDemoSelection_05754_099.npz,0,0,0,1,0,0.0001004934310913086,1772
340,scenario_05757,BacterialDemoSelection_05757_004.npz,0,0,0,1,0,0.1735900640487671,204
341,scenario_05757,BacterialDemoSelection_05757_013.npz,0,0,0,1,0,0.15348601341247559,199
342,scenario_05757,BacterialDemoSelection_05757_016.npz,0,0,0,1,0,0.15268296003341675,230
343,scenario_05757,BacterialDemoSelection_05757_024.npz,0,0,0,1,1,1.0,245
344,scenario_05757,BacterialDemoSelection_05757_044.npz,0,0,0,1,0,0.17049551010131836,222
345,scenario_05757,BacterialDemoSelection_05757_051.npz,0,0,0,1,1,1.0,312
346,scenario_05757,BacterialDemoSelection_05757_056.npz,0,0,0,1,1,0.9999998807907104,257
347,scenario_05757,BacterialDemoSelection_05757_063.npz,0,0,0,1,1,1.0,256
348,scenario_05757,BacterialDemoSelection_05757_066.npz,0,0,0,1,1,0.9971097111701965,245
349,scenario_05757,BacterialDemoSelection_05757_092.npz,0,0,0,1,1,0.9999998807907104,242
350,scenario_05760,BacterialDemoSelection_05760_004.npz,0,0,0,1,1,0.9999998807907104,403
351,scenario_05760,BacterialDemoSelection_05760_023.npz,0,0,0,1,1,0.9999978542327881,461
352,scenario_05760,BacterialDemoSelection_05760_024.npz,0,0,0,1,1,1.0,369
353,scenario_05760,BacterialDemoSelection_05760_026.npz,0,0,0,1,0,0.0009341835975646973,359
354,scenario_05760,BacterialDemoSelection_05760_038.npz,0,0,0,1,1,0.9999985694885254,346
355,scenario_05760,BacterialDemoSelection_05760_040.npz,0,0,0,1,1,1.0,358
356,scenario_05760,BacterialDemoSelection_05760_065.npz,0,0,0,1,1,1.0,366
357,scenario_05760,BacterialDemoSelection_05760_068.npz,0,0,0,1,1,1.0,375
358,scenario_05760,BacterialDemoSelection_05760_085.npz,0,0,0,1,0,0.04313051700592041,321
359,scenario_05760,BacterialDemoSelection_05760_095.npz,0,0,0,1,0,0.05349767208099365,317
360,scenario_05769,BacterialDemoSelection_05769_008.npz,0,0,0,1,0,0.17254287004470825,232
361,scenario_05769,BacterialDemoSelection_05769_012.npz,0,0,0,1,0,0.14457517862319946,187
362,scenario_05769,BacterialDemoSelection_05769_024.npz,0,0,0,1,0,0.16347730159759521,230
363,scenario_05769,BacterialDemoSelection_05769_044.npz,0,0,0,1,0,0.14194566011428833,195
364,scenario_05769,BacterialDemoSelection_05769_051.npz,0,0,0,1,1,1.0,243
365,scenario_05769,BacterialDemoSelection_05769_054.npz,0,0,0,1,1,1.0,247
366,scenario_05769,BacterialDemoSelection_05769_057.npz,0,0,0,1,0,0.14377707242965698,197
367,scenario_05769,BacterialDemoSelection_05769_067.npz,0,0,0,1,0,0.16370445489883423,239
368,scenario_05769,BacterialDemoSelection_05769_073.npz,0,0,0,1,0,0.1575474739074707,198
369,scenario_05769,BacterialDemoSelection_05769_099.npz,0,0,0,1,0,0.1393369436264038,189
370,scenario_05773,BacterialDemoSelection_05773_020.npz,0,0,0,1,0,0.14019519090652466,159
371,scenario_05776,BacterialDemoSelection_05776_001.npz,0,0,0,1,1,1.0,577
372,scenario_05776,BacterialDemoSelection_05776_019.npz,0,0,0,1,1,1.0,675
373,scenario_05776,BacterialDemoSelection_05776_030.npz,0,0,0,1,1,1.0,709
374,scenario_05776,BacterialDemoSelection_05776_045.npz,0,0,0,1,1,1.0,572
375,scenario_05776,BacterialDemoSelection_05776_048.npz,0,0,0,1,1,1.0,550
376,scenario_05776,BacterialDemoSelection_05776_055.npz,0,0,0,1,1,1.0,650
377,scenario_05776,BacterialDemoSelection_05776_065.npz,0,0,0,1,1,1.0,545
378,scenario_05776,BacterialDemoSelection_05776_085.npz,0,0,0,1,1,1.0,609
379,scenario_05776,BacterialDemoSelection_05776_093.npz,0,0,0,1,1,1.0,611
380,scenario_05776,BacterialDemoSelection_05776_094.npz,0,0,0,1,1,1.0,583
381,scenario_05784,BacterialDemoSelection_05784_006.npz,0,0,0,1,0,0.07341361045837402,321
382,scenario_05784,BacterialDemoSelection_05784_008.npz,0,0,0,1,1,0.8359463810920715,396
383,scenario_05784,BacterialDemoSelection_05784_022.npz,0,0,0,1,0,2.4318695068359375e-05,478
384,scenario_05784,BacterialDemoSelection_05784_024.npz,0,0,0,1,1,0.9999979734420776,489
385,scenario_05784,BacterialDemoSelection_05784_034.npz,0,0,0,1,1,0.9999163150787354,383
386,scenario_05784,BacterialDemoSelection_05784_037.npz,0,0,0,1,0,0.02559870481491089,437
387,scenario_05784,BacterialDemoSelection_05784_050.npz,0,0,0,1,0,0.001704871654510498,401
388,scenario_05784,BacterialDemoSelection_05784_056.npz,0,0,0,1,0,0.003068208694458008,360
389,scenario_05784,BacterialDemoSelection_05784_062.npz,0,0,0,1,1,1.0,400
390,scenario_05784,BacterialDemoSelection_05784_085.npz,0,0,0,1,0,0.0015763044357299805,510
391,scenario_05796,BacterialDemoSelection_05796_018.npz,0,0,0,1,0,0.04771769046783447,246
392,scenario_05796,BacterialDemoSelection_05796_036.npz,0,0,0,1,0,0.05119723081588745,263
393,scenario_05796,BacterialDemoSelection_05796_039.npz,0,0,0,1,0,0.05990445613861084,315
394,scenario_05796,BacterialDemoSelection_05796_046.npz,0,0,0,1,0,0.050767600536346436,276
395,scenario_05796,BacterialDemoSelection_05796_059.npz,0,0,0,1,0,0.1508370041847229,201
396,scenario_05796,BacterialDemoSelection_05796_061.npz,0,0,0,1,0,0.04921424388885498,253
397,scenario_05796,BacterialDemoSelection_05796_066.npz,0,0,0,1,0,0.14056378602981567,208
398,scenario_05796,BacterialDemoSelection_05796_080.npz,0,0,0,1,0,0.0590362548828125,270
399,scenario_05796,BacterialDemoSelection_05796_082.npz,0,0,0,1,0,0.051809608936309814,306
400,scenario_05796,BacterialDemoSelection_05796_089.npz,0,0,0,1,0,0.08243364095687866,288
401,scenario_05800,BacterialDemoSelection_05800_003.npz,0,0,0,1,1,0.9999943971633911,478
402,scenario_05800,BacterialDemoSelection_05800_011.npz,0,0,0,1,1,1.0,497
403,scenario_05800,BacterialDemoSelection_05800_020.npz,0,0,0,1,1,1.0,518
404,scenario_05800,BacterialDemoSelection_05800_025.npz,0,0,0,1,1,1.0,571
405,scenario_05800,BacterialDemoSelection_05800_031.npz,0,0,0,1,1,1.0,526
406,scenario_05800,BacterialDemoSelection_05800_037.npz,0,0,0,1,1,1.0,652
407,scenario_05800,BacterialDemoSelection_05800_054.npz,0,0,0,1,1,1.0,648
408,scenario_05800,BacterialDemoSelection_05800_058.npz,0,0,0,1,1,1.0,553
409,scenario_05800,BacterialDemoSelection_05800_091.npz,0,0,0,1,1,0.9999892711639404,634
410,scenario_05800,BacterialDemoSelection_05800_095.npz,0,0,0,1,1,1.0,466
411,scenario_05802,BacterialDemoSelection_05802_003.npz,0,0,0,1,0,1.239776611328125e-05,1746
412,scenario_05802,BacterialDemoSelection_05802_012.npz,0,0,0,1,0,5.805492401123047e-05,2220
413,scenario_05802,BacterialDemoSelection_05802_027.npz,0,0,0,1,0,1.049041748046875e-05,1532
414,scenario_05802,BacterialDemoSelection_05802_028.npz,0,0,0,1,0,5.841255187988281e-06,1856
415,scenario_05802,BacterialDemoSelection_05802_032.npz,0,0,0,1,0,8.344650268554688e-07,1542
416,scenario_05802,BacterialDemoSelection_05802_035.npz,0,0,0,1,0,3.5762786865234375e-07,1273
417,scenario_05802,BacterialDemoSelection_05802_045.npz,0,0,0,1,0,9.5367431640625e-07,1208
418,scenario_05802,BacterialDemoSelection_05802_072.npz,0,0,0,1,0,0.0002142786979675293,2077
419,scenario_05802,BacterialDemoSelection_05802_080.npz,0,0,0,1,0,5.14984130859375e-05,2101
420,scenario_05802,BacterialDemoSelection_05802_084.npz,0,0,0,1,0,1.71661376953125e-05,1706
421,scenario_05818,BacterialDemoSelection_05818_002.npz,0,0,0,1,0,0.0645209550857544,323
422,scenario_05818,BacterialDemoSelection_05818_010.npz,0,0,0,1,0,0.0005519986152648926,342
423,scenario_05818,BacterialDemoSelection_05818_012.npz,0,0,0,1,0,0.08201092481613159,307
424,scenario_05818,BacterialDemoSelection_05818_024.npz,0,0,0,1,0,0.030645370483398438,245
425,scenario_05818,BacterialDemoSelection_05818_025.npz,0,0,0,1,0,0.06781798601150513,400
426,scenario_05818,BacterialDemoSelection_05818_032.npz,0,0,0,1,0,0.0020062923431396484,426
427,scenario_05818,BacterialDemoSelection_05818_036.npz,0,0,0,1,1,1.0,349
428,scenario_05818,BacterialDemoSelection_05818_050.npz,0,0,0,1,0,0.07119399309158325,299
429,scenario_05818,BacterialDemoSelection_05818_085.npz,0,0,0,1,1,0.9999970197677612,335
430,scenario_05818,BacterialDemoSelection_05818_099.npz,0,0,0,1,0,0.028439342975616455,365
431,scenario_05823,BacterialDemoSelection_05823_075.npz,0,0,0,1,0,0.14883458614349365,151
432,scenario_05823,BacterialDemoSelection_05823_098.npz,0,0,0,1,0,0.13460630178451538,145
433,scenario_05830,BacterialDemoSelection_05830_012.npz,0,0,0,1,1,1.0,366
434,scenario_05830,BacterialDemoSelection_05830_024.npz,0,0,0,1,1,1.0,367
435,scenario_05830,BacterialDemoSelection_05830_025.npz,0,0,0,1,1,1.0,389
436,scenario_05830,BacterialDemoSelection_05830_048.npz,0,0,0,1,1,1.0,356
437,scenario_05830,BacterialDemoSelection_05830_052.npz,0,0,0,1,1,1.0,333
438,scenario_05830,BacterialDemoSelection_05830_073.npz,0,0,0,1,1,1.0,366
439,scenario_05830,BacterialDemoSelection_05830_074.npz,0,0,0,1,1,1.0,291
440,scenario_05830,BacterialDemoSelection_05830_076.npz,0,0,0,1,1,1.0,338
441,scenario_05830,BacterialDemoSelection_05830_077.npz,0,0,0,1,1,1.0,348
442,scenario_05830,BacterialDemoSelection_05830_081.npz,0,0,0,1,1,0.9999905824661255,309
443,scenario_05834,BacterialDemoSelection_05834_003.npz,0,0,0,1,1,1.0,929
444,scenario_05834,BacterialDemoSelection_05834_012.npz,0,0,0,1,1,0.7470201849937439,822
445,scenario_05834,BacterialDemoSelection_05834_030.npz,0,0,0,1,1,1.0,955
446,scenario_05834,BacterialDemoSelection_05834_037.npz,0,0,0,1,1,1.0,791
447,scenario_05834,BacterialDemoSelection_05834_039.npz,0,0,0,1,1,0.9999998807907104,849
448,scenario_05834,BacterialDemoSelection_05834_054.npz,0,0,0,1,1,1.0,1034
449,scenario_05834,BacterialDemoSelection_05834_055.npz,0,0,0,1,0,0.005672752857208252,783
450,scenario_05834,BacterialDemoSelection_05834_069.npz,0,0,0,1,1,0.9988126754760742,905
451,scenario_05834,BacterialDemoSelection_05834_077.npz,0,0,0,1,1,1.0,691
452,scenario_05834,BacterialDemoSelection_05834_088.npz,0,0,0,1,1,0.9999861717224121,923
453,scenario_05836,BacterialDemoSelection_05836_020.npz,0,0,0,1,1,1.0,405
454,scenario_05836,BacterialDemoSelection_05836_025.npz,0,0,0,1,1,1.0,420
455,scenario_05836,BacterialDemoSelection_05836_053.npz,0,0,0,1,1,1.0,454
456,scenario_05836,BacterialDemoSelection_05836_061.npz,0,0,0,1,1,1.0,395
457,scenario_05836,BacterialDemoSelection_05836_062.npz,0,0,0,1,1,1.0,448
458,scenario_05836,BacterialDemoSelection_05836_078.npz,0,0,0,1,1,1.0,401
459,scenario_05836,BacterialDemoSelection_05836_086.npz,0,0,0,1,1,1.0,390
460,scenario_05836,BacterialDemoSelection_05836_087.npz,0,0,0,1,1,1.0,375
461,scenario_05836,BacterialDemoSelection_05836_090.npz,0,0,0,1,0,0.02541375160217285,325
462,scenario_05836,BacterialDemoSelection_05836_098.npz,0,0,0,1,1,1.0,374
463,scenario_05840,BacterialDemoSelection_05840_004.npz,0,0,0,1,0,0.035748839378356934,248
464,scenario_05840,BacterialDemoSelection_05840_009.npz,0,0,0,1,0,0.037921011447906494,329
465,scenario_05840,BacterialDemoSelection_05840_019.npz,0,0,0,1,0,0.10661053657531738,258
466,scenario_05840,BacterialDemoSelection_05840_023.npz,0,0,0,1,0,0.14393126964569092,224
467,scenario_05840,BacterialDemoSelection_05840_026.npz,0,0,0,1,0,0.0124167799949646,271
468,scenario_05840,BacterialDemoSelection_05840_034.npz,0,0,0,1,1,0.9993342757225037,310
469,scenario_05840,BacterialDemoSelection_05840_045.npz,0,0,0,1,0,0.03145545721054077,242
470,scenario_05840,BacterialDemoSelection_05840_060.npz,0,0,0,1,0,0.1251150369644165,266
471,scenario_05840,BacterialDemoSelection_05840_071.npz,0,0,0,1,0,0.06465142965316772,257
472,scenario_05840,BacterialDemoSelection_05840_094.npz,0,0,0,1,0,0.17131972312927246,308
473,scenario_05853,BacterialDemoSelection_05853_022.npz,0,0,0,1,1,1.0,278
474,scenario_05853,BacterialDemoSelection_05853_030.npz,0,0,0,1,1,1.0,276
475,scenario_05853,BacterialDemoSelection_05853_041.npz,0,0,0,1,1,1.0,270
476,scenario_05853,BacterialDemoSelection_05853_051.npz,0,0,0,1,1,1.0,322
477,scenario_05853,BacterialDemoSelection_05853_052.npz,0,0,0,1,1,1.0,264
478,scenario_05853,BacterialDemoSelection_05853_058.npz,0,0,0,1,1,0.9997832179069519,277
479,scenario_05853,BacterialDemoSelection_05853_059.npz,0,0,0,1,1,0.9996132254600525,285
480,scenario_05853,BacterialDemoSelection_05853_072.npz,0,0,0,1,1,1.0,303
481,scenario_05853,BacterialDemoSelection_05853_073.npz,0,0,0,1,1,0.8867799043655396,263
482,scenario_05853,BacterialDemoSelection_05853_075.npz,0,0,0,1,1,0.9991859793663025,260
483,scenario_05862,BacterialDemoSelection_05862_006.npz,0,0,0,1,0,0.10679996013641357,243
484,scenario_05862,BacterialDemoSelection_05862_013.npz,0,0,0,1,0,0.147960364818573,229
485,scenario_05862,BacterialDemoSelection_05862_028.npz,0,0,0,1,0,0.15125340223312378,202
486,scenario_05862,BacterialDemoSelection_05862_034.npz,0,0,0,1,0,0.150346577167511,206
487,scenario_05862,BacterialDemoSelection_05862_035.npz,0,0,0,1,0,0.06582003831863403,271
488,scenario_05862,BacterialDemoSelection_05862_046.npz,0,0,0,1,0,0.04393523931503296,268
489,scenario_05862,BacterialDemoSelection_05862_051.npz,0,0,0,1,0,0.14868378639221191,214
490,scenario_05862,BacterialDemoSelection_05862_059.npz,0,0,0,1,0,0.14404946565628052,194
491,scenario_05862,BacterialDemoSelection_05862_064.npz,0,0,0,1,0,0.057366132736206055,265
492,scenario_05862,BacterialDemoSelection_05862_097.npz,0,0,0,1,0,0.14111483097076416,213
493,scenario_05871,BacterialDemoSelection_05871_003.npz,0,0,0,1,0,0.15137630701065063,192
494,scenario_05871,BacterialDemoSelection_05871_005.npz,0,0,0,1,0,0.1532110571861267,176
495,scenario_05871,BacterialDemoSelection_05871_006.npz,0,0,0,1,0,0.14763259887695312,199
496,scenario_05871,BacterialDemoSelection_05871_010.npz,0,0,0,1,0,0.14454054832458496,196
497,scenario_05871,BacterialDemoSelection_05871_011.npz,0,0,0,1,1,1.0,249
498,scenario_05871,BacterialDemoSelection_05871_028.npz,0,0,0,1,0,0.14350062608718872,148
499,scenario_05871,BacterialDemoSelection_05871_062.npz,0,0,0,1,0,0.1472901701927185,165
500,scenario_05871,BacterialDemoSelection_05871_081.npz,0,0,0,1,0,0.16808807849884033,239
501,scenario_05871,BacterialDemoSelection_05871_095.npz,0,0,0,1,0,0.15134727954864502,171
502,scenario_05871,BacterialDemoSelection_05871_098.npz,0,0,0,1,0,0.13675904273986816,167
503,scenario_05881,BacterialDemoSelection_05881_018.npz,0,0,0,1,0,0.0,490
504,scenario_05881,BacterialDemoSelection_05881_024.npz,0,0,0,1,0,0.03249865770339966,333
505,scenario_05881,BacterialDemoSelection_05881_026.npz,0,0,0,1,0,6.794929504394531e-06,401
506,scenario_05881,BacterialDemoSelection_05881_031.npz,0,0,0,1,0,0.018876254558563232,328
507,scenario_05881,BacterialDemoSelection_05881_035.npz,0,0,0,1,0,0.0,497
508,scenario_05881,BacterialDemoSelection_05881_043.npz,0,0,0,1,0,0.0,574
509,scenario_05881,BacterialDemoSelection_05881_046.npz,0,0,0,1,0,6.9141387939453125e-06,368
510,scenario_05881,BacterialDemoSelection_05881_054.npz,0,0,0,1,0,0.0,608
511,scenario_05881,BacterialDemoSelection_05881_084.npz,0,0,0,1,0,0.018618464469909668,339
512,scenario_05881,BacterialDemoSelection_05881_093.npz,0,0,0,1,0,0.04064464569091797,329
513,scenario_05885,BacterialDemoSelection_05885_013.npz,0,0,0,1,1,0.998829185962677,266
514,scenario_05885,BacterialDemoSelection_05885_016.npz,0,0,0,1,0,0.15569305419921875,193
515,scenario_05885,BacterialDemoSelection_05885_025.npz,0,0,0,1,0,0.14864581823349,195
516,scenario_05885,BacterialDemoSelection_05885_032.npz,0,0,0,1,0,0.15335512161254883,184
517,scenario_05885,BacterialDemoSelection_05885_040.npz,0,0,0,1,0,0.1498146653175354,233
518,scenario_05885,BacterialDemoSelection_05885_044.npz,0,0,0,1,1,1.0,272
519,scenario_05885,BacterialDemoSelection_05885_058.npz,0,0,0,1,0,0.1505739688873291,231
520,scenario_05885,BacterialDemoSelection_05885_066.npz,0,0,0,1,0,0.14640164375305176,203
521,scenario_05885,BacterialDemoSelection_05885_068.npz,0,0,0,1,0,0.1454293131828308,215
522,scenario_05885,BacterialDemoSelection_05885_085.npz,0,0,0,1,0,0.16189557313919067,239
523,scenario_05894,BacterialDemoSelection_05894_002.npz,0,0,0,1,0,0.003436863422393799,413
524,scenario_05894,BacterialDemoSelection_05894_020.npz,0,0,0,1,0,6.961822509765625e-05,521
525,scenario_05894,BacterialDemoSelection_05894_029.npz,0,0,0,1,0,0.016722798347473145,437
526,scenario_05894,BacterialDemoSelection_05894_033.npz,0,0,0,1,1,0.7571825385093689,368
527,scenario_05894,BacterialDemoSelection_05894_037.npz,0,0,0,1,1,1.0,343
528,scenario_05894,BacterialDemoSelection_05894_047.npz,0,0,0,1,1,1.0,429
529,scenario_05894,BacterialDemoSelection_05894_055.npz,0,0,0,1,0,0.0012426376342773438,423
530,scenario_05894,BacterialDemoSelection_05894_061.npz,0,0,0,1,0,0.0,750
531,scenario_05894,BacterialDemoSelection_05894_081.npz,0,0,0,1,1,1.0,454
532,scenario_05894,BacterialDemoSelection_05894_084.npz,0,0,0,1,0,0.059395432472229004,280
533,scenario_05906,BacterialDemoSelection_05906_006.npz,0,0,0,1,1,0.9996680021286011,275
534,scenario_05906,BacterialDemoSelection_05906_037.npz,0,0,0,1,1,0.9999847412109375,243
535,scenario_05906,BacterialDemoSelection_05906_040.npz,0,0,0,1,0,0.16072428226470947,213
536,scenario_05906,BacterialDemoSelection_05906_044.npz,0,0,0,1,1,1.0,248
537,scenario_05906,BacterialDemoSelection_05906_051.npz,0,0,0,1,0,0.15378642082214355,229
538,scenario_05906,BacterialDemoSelection_05906_062.npz,0,0,0,1,0,0.03176242113113403,275
539,scenario_05906,BacterialDemoSelection_05906_070.npz,0,0,0,1,1,0.9999988079071045,266
540,scenario_05906,BacterialDemoSelection_05906_075.npz,0,0,0,1,1,1.0,282
541,scenario_05906,BacterialDemoSelection_05906_091.npz,0,0,0,1,0,0.04653400182723999,291
542,scenario_05906,BacterialDemoSelection_05906_099.npz,0,0,0,1,0,0.16439414024353027,234
543,scenario_05912,BacterialDemoSelection_05912_004.npz,0,0,0,1,1,1.0,672
544,scenario_05912,BacterialDemoSelection_05912_009.npz,0,0,0,1,1,1.0,577
545,scenario_05912,BacterialDemoSelection_05912_041.npz,0,0,0,1,1,1.0,563
546,scenario_05912,BacterialDemoSelection_05912_061.npz,0,0,0,1,1,1.0,643
547,scenario_05912,BacterialDemoSelection_05912_070.npz,0,0,0,1,1,1.0,706
548,scenario_05912,BacterialDemoSelection_05912_081.npz,0,0,0,1,1,0.9999504089355469,484
549,scenario_05912,BacterialDemoSelection_05912_082.npz,0,0,0,1,1,1.0,564
550,scenario_05912,BacterialDemoSelection_05912_086.npz,0,0,0,1,1,1.0,652
551,scenario_05912,BacterialDemoSelection_05912_087.npz,0,0,0,1,1,1.0,758
552,scenario_05912,BacterialDemoSelection_05912_098.npz,0,0,0,1,1,1.0,677
553,scenario_05914,BacterialDemoSelection_05914_008.npz,0,0,0,1,1,0.9984110593795776,525
554,scenario_05914,BacterialDemoSelection_05914_014.npz,0,0,0,1,1,1.0,511
555,scenario_05914,BacterialDemoSelection_05914_019.npz,0,0,0,1,1,0.9929513335227966,598
556,scenario_05914,BacterialDemoSelection_05914_020.npz,0,0,0,1,0,0.04923814535140991,557
557,scenario_05914,BacterialDemoSelection_05914_031.npz,0,0,0,1,0,0.0020554661750793457,692
558,scenario_05914,BacterialDemoSelection_05914_046.npz,0,0,0,1,1,1.0,561
559,scenario_05914,BacterialDemoSelection_05914_055.npz,0,0,0,1,0,0.0675317645072937,570
560,scenario_05914,BacterialDemoSelection_05914_068.npz,0,0,0,1,0,0.0004652738571166992,650
561,scenario_05914,BacterialDemoSelection_05914_077.npz,0,0,0,1,1,1.0,535
562,scenario_05914,BacterialDemoSelection_05914_083.npz,0,0,0,1,1,1.0,588
563,scenario_05920,BacterialDemoSelection_05920_006.npz,0,0,0,1,1,0.9999998807907104,326
564,scenario_05920,BacterialDemoSelection_05920_012.npz,0,0,0,1,1,1.0,369
565,scenario_05920,BacterialDemoSelection_05920_025.npz,0,0,0,1,1,1.0,433
566,scenario_05920,BacterialDemoSelection_05920_056.npz,0,0,0,1,1,1.0,413
567,scenario_05920,BacterialDemoSelection_05920_057.npz,0,0,0,1,1,1.0,352
568,scenario_05920,BacterialDemoSelection_05920_063.npz,0,0,0,1,1,1.0,404
569,scenario_05920,BacterialDemoSelection_05920_067.npz,0,0,0,1,1,1.0,354
570,scenario_05920,BacterialDemoSelection_05920_068.npz,0,0,0,1,1,1.0,357
571,scenario_05920,BacterialDemoSelection_05920_071.npz,0,0,0,1,1,1.0,461
572,scenario_05920,BacterialDemoSelection_05920_073.npz,0,0,0,1,1,1.0,342
573,scenario_05924,BacterialDemoSelection_05924_003.npz,0,0,0,1,0,0.029445648193359375,255
574,scenario_05924,BacterialDemoSelection_05924_010.npz,0,0,0,1,1,0.9999988079071045,312
575,scenario_05924,BacterialDemoSelection_05924_024.npz,0,0,0,1,0,0.046455979347229004,310
576,scenario_05924,BacterialDemoSelection_05924_037.npz,0,0,0,1,0,0.04590320587158203,332
577,scenario_05924,BacterialDemoSelection_05924_038.npz,0,0,0,1,0,0.13584399223327637,208
578,scenario_05924,BacterialDemoSelection_05924_042.npz,0,0,0,1,0,0.050323545932769775,246
579,scenario_05924,BacterialDemoSelection_05924_075.npz,0,0,0,1,0,0.1438995599746704,231
580,scenario_05924,BacterialDemoSelection_05924_079.npz,0,0,0,1,0,0.14553827047348022,210
581,scenario_05924,BacterialDemoSelection_05924_088.npz,0,0,0,1,0,5.125999450683594e-06,419
582,scenario_05924,BacterialDemoSelection_05924_098.npz,0,0,0,1,1,1.0,364
583,scenario_05927,BacterialDemoSelection_05927_052.npz,0,0,0,1,0,0.15144246816635132,151
584,scenario_05930,BacterialDemoSelection_05930_013.npz,0,0,0,1,1,1.0,670
585,scenario_05930,BacterialDemoSelection_05930_023.npz,0,0,0,1,1,1.0,636
586,scenario_05930,BacterialDemoSelection_05930_040.npz,0,0,0,1,1,1.0,632
587,scenario_05930,BacterialDemoSelection_05930_047.npz,0,0,0,1,1,1.0,662
588,scenario_05930,BacterialDemoSelection_05930_048.npz,0,0,0,1,1,1.0,668
589,scenario_05930,BacterialDemoSelection_05930_062.npz,0,0,0,1,1,1.0,621
590,scenario_05930,BacterialDemoSelection_05930_064.npz,0,0,0,1,1,1.0,698
591,scenario_05930,BacterialDemoSelection_05930_070.npz,0,0,0,1,1,1.0,714
592,scenario_05930,BacterialDemoSelection_05930_071.npz,0,0,0,1,1,1.0,717
593,scenario_05930,BacterialDemoSelection_05930_094.npz,0,0,0,1,1,1.0,637
594,scenario_05933,BacterialDemoSelection_05933_014.npz,0,0,0,1,1,1.0,332
595,scenario_05933,BacterialDemoSelection_05933_020.npz,0,0,0,1,1,1.0,292
596,scenario_05933,BacterialDemoSelection_05933_027.npz,0,0,0,1,1,1.0,358
597,scenario_05933,BacterialDemoSelection_05933_033.npz,0,0,0,1,1,1.0,290
598,scenario_05933,BacterialDemoSelection_05933_035.npz,0,0,0,1,0,0.34140390157699585,276
599,scenario_05933,BacterialDemoSelection_05933_043.npz,0,0,0,1,1,1.0,287
600,scenario_05933,BacterialDemoSelection_05933_046.npz,0,0,0,1,1,1.0,408
601,scenario_05933,BacterialDemoSelection_05933_063.npz,0,0,0,1,1,1.0,311
602,scenario_05933,BacterialDemoSelection_05933_075.npz,0,0,0,1,1,1.0,299
603,scenario_05933,BacterialDemoSelection_05933_085.npz,0,0,0,1,1,1.0,280
604,scenario_05948,BacterialDemoSelection_05948_023.npz,0,0,0,1,1,1.0,549
605,scenario_05948,BacterialDemoSelection_05948_027.npz,0,0,0,1,1,1.0,539
606,scenario_05948,BacterialDemoSelection_05948_036.npz,0,0,0,1,1,1.0,582
607,scenario_05948,BacterialDemoSelection_05948_041.npz,0,0,0,1,1,1.0,437
608,scenario_05948,BacterialDemoSelection_05948_053.npz,0,0,0,1,1,1.0,504
609,scenario_05948,BacterialDemoSelection_05948_054.npz,0,0,0,1,1,1.0,463
610,scenario_05948,BacterialDemoSelection_05948_071.npz,0,0,0,1,1,1.0,493
611,scenario_05948,BacterialDemoSelection_05948_077.npz,0,0,0,1,1,1.0,423
612,scenario_05948,BacterialDemoSelection_05948_078.npz,0,0,0,1,1,1.0,473
613,scenario_05948,BacterialDemoSelection_05948_079.npz,0,0,0,1,1,1.0,443
614,scenario_05954,BacterialDemoSelection_05954_040.npz,0,0,0,1,0,0.00045692920684814453,611
615,scenario_05954,BacterialDemoSelection_05954_052.npz,0,0,0,1,1,0.9996569156646729,486
616,scenario_05954,BacterialDemoSelection_05954_055.npz,0,0,0,1,1,1.0,469
617,scenario_05954,BacterialDemoSelection_05954_056.npz,0,0,0,1,1,1.0,611
618,scenario_05954,BacterialDemoSelection_05954_059.npz,0,0,0,1,1,1.0,765
619,scenario_05954,BacterialDemoSelection_05954_061.npz,0,0,0,1,1,0.9999921321868896,534
620,scenario_05954,BacterialDemoSelection_05954_062.npz,0,0,0,1,1,1.0,638
621,scenario_05954,BacterialDemoSelection_05954_065.npz,0,0,0,1,1,1.0,716
622,scenario_05954,BacterialDemoSelection_05954_066.npz,0,0,0,1,1,1.0,574
623,scenario_05954,BacterialDemoSelection_05954_092.npz,0,0,0,1,0,1.5497207641601562e-06,907
624,scenario_05967,BacterialDemoSelection_05967_012.npz,0,0,0,1,0,0.15885984897613525,172
625,scenario_05967,BacterialDemoSelection_05967_029.npz,0,0,0,1,0,0.15574109554290771,167
626,scenario_05967,BacterialDemoSelection_05967_034.npz,0,0,0,1,0,0.16117167472839355,236
627,scenario_05967,BacterialDemoSelection_05967_036.npz,0,0,0,1,0,0.15264517068862915,159
628,scenario_05967,BacterialDemoSelection_05967_040.npz,0,0,0,1,0,0.1524929404258728,174
629,scenario_05967,BacterialDemoSelection_05967_043.npz,0,0,0,1,0,0.1514109969139099,211
630,scenario_05967,BacterialDemoSelection_05967_053.npz,0,0,0,1,0,0.16075754165649414,165
631,scenario_05967,BacterialDemoSelection_05967_055.npz,0,0,0,1,0,0.13404107093811035,209
632,scenario_05967,BacterialDemoSelection_05967_069.npz,0,0,0,1,0,0.14183545112609863,179
633,scenario_05986,BacterialDemoSelection_05986_004.npz,0,0,0,1,1,1.0,656
634,scenario_05986,BacterialDemoSelection_05986_013.npz,0,0,0,1,1,1.0,757
635,scenario_05986,BacterialDemoSelection_05986_027.npz,0,0,0,1,1,0.9999984502792358,709
636,scenario_05986,BacterialDemoSelection_05986_035.npz,0,0,0,1,1,0.9804219603538513,627
637,scenario_05986,BacterialDemoSelection_05986_043.npz,0,0,0,1,1,1.0,624
638,scenario_05986,BacterialDemoSelection_05986_045.npz,0,0,0,1,1,1.0,762
639,scenario_05986,BacterialDemoSelection_05986_052.npz,0,0,0,1,1,0.9999955892562866,613
640,scenario_05986,BacterialDemoSelection_05986_060.npz,0,0,0,1,1,1.0,677
641,scenario_05986,BacterialDemoSelection_05986_071.npz,0,0,0,1,1,0.9999901056289673,819
642,scenario_05986,BacterialDemoSelection_05986_091.npz,0,0,0,1,1,0.9995542168617249,683
643,scenario_05987,BacterialDemoSelection_05987_021.npz,0,0,0,1,0,0.1706104874610901,207
644,scenario_05987,BacterialDemoSelection_05987_030.npz,0,0,0,1,0,0.1688472032546997,152
645,scenario_05987,BacterialDemoSelection_05987_053.npz,0,0,0,1,0,0.1652611494064331,194
646,scenario_05987,BacterialDemoSelection_05987_069.npz,0,0,0,1,0,0.17406624555587769,198
647,scenario_05987,BacterialDemoSelection_05987_078.npz,0,0,0,1,0,0.15878921747207642,148
648,scenario_05987,BacterialDemoSelection_05987_079.npz,0,0,0,1,0,0.16595125198364258,211
649,scenario_05989,BacterialDemoSelection_05989_002.npz,0,0,0,1,1,0.9998987913131714,249
650,scenario_05989,BacterialDemoSelection_05989_007.npz,0,0,0,1,1,1.0,244
651,scenario_05989,BacterialDemoSelection_05989_026.npz,0,0,0,1,0,0.1602545976638794,231
652,scenario_05989,BacterialDemoSelection_05989_034.npz,0,0,0,1,1,1.0,290
653,scenario_05989,BacterialDemoSelection_05989_044.npz,0,0,0,1,1,1.0,249
654,scenario_05989,BacterialDemoSelection_05989_060.npz,0,0,0,1,0,0.17118704319000244,210
655,scenario_05989,BacterialDemoSelection_05989_076.npz,0,0,0,1,0,0.1700526475906372,239
656,scenario_05989,BacterialDemoSelection_05989_081.npz,0,0,0,1,1,1.0,261
657,scenario_05989,BacterialDemoSelection_05989_085.npz,0,0,0,1,1,0.9999657869338989,259
658,scenario_05989,BacterialDemoSelection_05989_097.npz,0,0,0,1,1,1.0,241
659,scenario_05997,BacterialDemoSelection_05997_005.npz,0,0,0,1,0,0.14827853441238403,173
660,scenario_05997,BacterialDemoSelection_05997_033.npz,0,0,0,1,0,0.13431328535079956,145
661,scenario_05997,BacterialDemoSelection_05997_042.npz,0,0,0,1,0,0.1418188214302063,157
662,scenario_05997,BacterialDemoSelection_05997_059.npz,0,0,0,1,0,0.1512613296508789,144
663,scenario_05997,BacterialDemoSelection_05997_060.npz,0,0,0,1,0,0.1364092230796814,148
664,scenario_05997,BacterialDemoSelection_05997_073.npz,0,0,0,1,0,0.14845043420791626,145
665,scenario_05997,BacterialDemoSelection_05997_075.npz,0,0,0,1,0,0.14559215307235718,159
666,scenario_05997,BacterialDemoSelection_05997_090.npz,0,0,0,1,0,0.13792788982391357,152
667,scenario_05651,BacterialDemoSelection_05651_048.npz,0,0,0,1,0,0.16075348854064941,146
668,scenario_05651,BacterialDemoSelection_05651_051.npz,0,0,0,1,0,0.13752126693725586,156
669,scenario_05651,BacterialDemoSelection_05651_059.npz,0,0,0,1,0,0.15151876211166382,159
670,scenario_05651,BacterialDemoSelection_05651_064.npz,0,0,0,1,0,0.1503424048423767,143
671,scenario_05651,BacterialDemoSelection_05651_091.npz,0,0,0,1,0,0.15084612369537354,158
672,scenario_05654,BacterialDemoSelection_05654_001.npz,0,0,0,1,1,1.0,488
673,scenario_05654,BacterialDemoSelection_05654_003.npz,0,0,0,1,1,1.0,383
674,scenario_05654,BacterialDemoSelection_05654_005.npz,0,0,0,1,1,1.0,442
675,scenario_05654,BacterialDemoSelection_05654_029.npz,0,0,0,1,1,1.0,553
676,scenario_05654,BacterialDemoSelection_05654_049.npz,0,0,0,1,1,1.0,572
677,scenario_05654,BacterialDemoSelection_05654_055.npz,0,0,0,1,1,1.0,447
678,scenario_05654,BacterialDemoSelection_05654_071.npz,0,0,0,1,1,1.0,508
679,scenario_05654,BacterialDemoSelection_05654_081.npz,0,0,0,1,1,1.0,485
680,scenario_05654,BacterialDemoSelection_05654_084.npz,0,0,0,1,1,1.0,481
681,scenario_05654,BacterialDemoSelection_05654_091.npz,0,0,0,1,1,1.0,526
682,scenario_05657,BacterialDemoSelection_05657_004.npz,0,0,0,1,1,1.0,447
683,scenario_05657,BacterialDemoSelection_05657_020.npz,0,0,0,1,1,0.9999927282333374,312
684,scenario_05657,BacterialDemoSelection_05657_026.npz,0,0,0,1,1,1.0,514
685,scenario_05657,BacterialDemoSelection_05657_030.npz,0,0,0,1,1,0.9980654120445251,287
686,scenario_05657,BacterialDemoSelection_05657_047.npz,0,0,0,1,1,1.0,361
687,scenario_05657,BacterialDemoSelection_05657_061.npz,0,0,0,1,1,1.0,435
688,scenario_05657,BacterialDemoSelection_05657_066.npz,0,0,0,1,1,1.0,434
689,scenario_05657,BacterialDemoSelection_05657_067.npz,0,0,0,1,1,1.0,384
690,scenario_05657,BacterialDemoSelection_05657_068.npz,0,0,0,1,1,1.0,444
691,scenario_05657,BacterialDemoSelection_05657_087.npz,0,0,0,1,1,1.0,410
692,scenario_05673,BacterialDemoSelection_05673_002.npz,0,0,0,1,1,1.0,324
693,scenario_05673,BacterialDemoSelection_05673_010.npz,0,0,0,1,1,0.9999977350234985,264
694,scenario_05673,BacterialDemoSelection_05673_028.npz,0,0,0,1,1,1.0,332
695,scenario_05673,BacterialDemoSelection_05673_041.npz,0,0,0,1,1,1.0,280
696,scenario_05673,BacterialDemoSelection_05673_050.npz,0,0,0,1,1,0.9999866485595703,316
697,scenario_05673,BacterialDemoSelection_05673_051.npz,0,0,0,1,1,0.9999349117279053,279
698,scenario_05673,BacterialDemoSelection_05673_064.npz,0,0,0,1,1,1.0,276
699,scenario_05673,BacterialDemoSelection_05673_078.npz,0,0,0,1,1,1.0,329
700,scenario_05673,BacterialDemoSelection_05673_083.npz,0,0,0,1,1,0.9999998807907104,253
701,scenario_05673,BacterialDemoSelection_05673_092.npz,0,0,0,1,1,1.0,251
702,scenario_05676,BacterialDemoSelection_05676_014.npz,0,0,0,1,1,1.0,486
703,scenario_05676,BacterialDemoSelection_05676_029.npz,0,0,0,1,1,1.0,557
704,scenario_05676,BacterialDemoSelection_05676_032.npz,0,0,0,1,1,1.0,525
705,scenario_05676,BacterialDemoSelection_05676_034.npz,0,0,0,1,1,1.0,451
706,scenario_05676,BacterialDemoSelection_05676_059.npz,0,0,0,1,1,1.0,522
707,scenario_05676,BacterialDemoSelection_05676_072.npz,0,0,0,1,1,1.0,503
708,scenario_05676,BacterialDemoSelection_05676_075.npz,0,0,0,1,1,1.0,439
709,scenario_05676,BacterialDemoSelection_05676_088.npz,0,0,0,1,1,1.0,475
710,scenario_05676,BacterialDemoSelection_05676_095.npz,0,0,0,1,1,1.0,451
711,scenario_05676,BacterialDemoSelection_05676_098.npz,0,0,0,1,1,1.0,454
712,scenario_05685,BacterialDemoSelection_05685_005.npz,0,0,0,1,0,0.15770548582077026,202
713,scenario_05685,BacterialDemoSelection_05685_037.npz,0,0,0,1,0,0.15513169765472412,209
714,scenario_05685,BacterialDemoSelection_05685_038.npz,0,0,0,1,0,0.14616304636001587,198
715,scenario_05685,BacterialDemoSelection_05685_041.npz,0,0,0,1,0,0.16116738319396973,225
716,scenario_05685,BacterialDemoSelection_05685_052.npz,0,0,0,1,0,0.1321764588356018,161
717,scenario_05685,BacterialDemoSelection_05685_061.npz,0,0,0,1,0,0.150628924369812,201
718,scenario_05685,BacterialDemoSelection_05685_068.npz,0,0,0,1,0,0.15315687656402588,212
719,scenario_05685,BacterialDemoSelection_05685_079.npz,0,0,0,1,0,0.17108893394470215,220
720,scenario_05685,BacterialDemoSelection_05685_080.npz,0,0,0,1,0,0.14404022693634033,159
721,scenario_05685,BacterialDemoSelection_05685_089.npz,0,0,0,1,0,0.15057653188705444,218
722,scenario_05687,BacterialDemoSelection_05687_001.npz,0,0,0,1,0,0.15148848295211792,164
723,scenario_05687,BacterialDemoSelection_05687_056.npz,0,0,0,1,0,0.0,514
724,scenario_05687,BacterialDemoSelection_05687_070.npz,0,0,0,1,0,0.1650441288948059,189
725,scenario_05687,BacterialDemoSelection_05687_096.npz,0,0,0,1,0,0.15729856491088867,147
726,scenario_05694,BacterialDemoSelection_05694_003.npz,0,0,0,1,1,1.0,375
727,scenario_05694,BacterialDemoSelection_05694_013.npz,0,0,0,1,1,0.9999910593032837,384
728,scenario_05694,BacterialDemoSelection_05694_015.npz,0,0,0,1,1,1.0,368
729,scenario_05694,BacterialDemoSelection_05694_019.npz,0,0,0,1,1,1.0,454
730,scenario_05694,BacterialDemoSelection_05694_022.npz,0,0,0,1,1,1.0,377
731,scenario_05694,BacterialDemoSelection_05694_025.npz,0,0,0,1,0,0.07859665155410767,302
732,scenario_05694,BacterialDemoSelection_05694_026.npz,0,0,0,1,1,1.0,485
733,scenario_05694,BacterialDemoSelection_05694_063.npz,0,0,0,1,1,1.0,517
734,scenario_05694,BacterialDemoSelection_05694_067.npz,0,0,0,1,1,1.0,493
735,scenario_05694,BacterialDemoSelection_05694_084.npz,0,0,0,1,0,0.21769899129867554,366
736,scenario_05705,BacterialDemoSelection_05705_000.npz,0,0,0,1,0,0.14903604984283447,200
737,scenario_05705,BacterialDemoSelection_05705_017.npz,0,0,0,1,0,0.030959665775299072,261
738,scenario_05705,BacterialDemoSelection_05705_043.npz,0,0,0,1,0,0.044049859046936035,297
739,scenario_05705,BacterialDemoSelection_05705_047.npz,0,0,0,1,1,1.0,300
740,scenario_05705,BacterialDemoSelection_05705_051.npz,0,0,0,1,0,0.19469982385635376,255
741,scenario_05705,BacterialDemoSelection_05705_070.npz,0,0,0,1,1,0.9997542500495911,268
742,scenario_05705,BacterialDemoSelection_05705_071.npz,0,0,0,1,1,1.0,299
743,scenario_05705,BacterialDemoSelection_05705_082.npz,0,0,0,1,1,0.9975922703742981,318
744,scenario_05705,BacterialDemoSelection_05705_092.npz,0,0,0,1,0,0.47602081298828125,262
745,scenario_05705,BacterialDemoSelection_05705_095.npz,0,0,0,1,0,0.14458799362182617,198
746,scenario_05716,BacterialDemoSelection_05716_009.npz,0,0,0,1,1,0.9999969005584717,253
747,scenario_05716,BacterialDemoSelection_05716_015.npz,0,0,0,1,0,0.1418742537498474,193
748,scenario_05716,BacterialDemoSelection_05716_017.npz,0,0,0,1,0,0.14273804426193237,196
749,scenario_05716,BacterialDemoSelection_05716_043.npz,0,0,0,1,0,0.1489848494529724,219
750,scenario_05716,BacterialDemoSelection_05716_045.npz,0,0,0,1,1,0.9999998807907104,258
751,scenario_05716,BacterialDemoSelection_05716_057.npz,0,0,0,1,0,0.1552826166152954,223
752,scenario_05716,BacterialDemoSelection_05716_063.npz,0,0,0,1,0,0.14368414878845215,188
753,scenario_05716,BacterialDemoSelection_05716_067.npz,0,0,0,1,0,0.15511220693588257,214
754,scenario_05716,BacterialDemoSelection_05716_080.npz,0,0,0,1,0,0.15892863273620605,211
755,scenario_05716,BacterialDemoSelection_05716_086.npz,0,0,0,1,0,0.14165246486663818,218
756,scenario_05725,BacterialDemoSelection_05725_003.npz,0,0,0,1,0,0.1486474871635437,161
757,scenario_05725,BacterialDemoSelection_05725_013.npz,0,0,0,1,0,0.1566031575202942,189
758,scenario_05725,BacterialDemoSelection_05725_031.npz,0,0,0,1,0,0.16113632917404175,184
759,scenario_05725,BacterialDemoSelection_05725_049.npz,0,0,0,1,0,0.14035964012145996,181
760,scenario_05725,BacterialDemoSelection_05725_058.npz,0,0,0,1,0,0.1369038224220276,168
761,scenario_05725,BacterialDemoSelection_05725_059.npz,0,0,0,1,0,0.1471465826034546,178
762,scenario_05725,BacterialDemoSelection_05725_063.npz,0,0,0,1,0,0.1419045329093933,219
763,scenario_05725,BacterialDemoSelection_05725_070.npz,0,0,0,1,0,0.15185946226119995,142
764,scenario_05725,BacterialDemoSelection_05725_094.npz,0,0,0,1,0,0.146761953830719,160
765,scenario_05725,BacterialDemoSelection_05725_098.npz,0,0,0,1,0,0.1720680594444275,213
766,scenario_05727,BacterialDemoSelection_05727_009.npz,0,0,0,1,0,0.1496334671974182,143
767,scenario_05727,BacterialDemoSelection_05727_017.npz,0,0,0,1,0,0.14183318614959717,146
768,scenario_05727,BacterialDemoSelection_05727_025.npz,0,0,0,1,0,0.15781527757644653,155
769,scenario_05730,BacterialDemoSelection_05730_006.npz,0,0,0,1,0,0.029723703861236572,249
770,scenario_05730,BacterialDemoSelection_05730_014.npz,0,0,0,1,0,0.13846808671951294,186
771,scenario_05730,BacterialDemoSelection_05730_037.npz,0,0,0,1,0,0.05313688516616821,287
772,scenario_05730,BacterialDemoSelection_05730_051.npz,0,0,0,1,0,0.11145931482315063,329
773,scenario_05730,BacterialDemoSelection_05730_052.npz,0,0,0,1,1,0.9305825233459473,285
774,scenario_05730,BacterialDemoSelection_05730_058.npz,0,0,0,1,0,0.07407402992248535,261
775,scenario_05730,BacterialDemoSelection_05730_068.npz,0,0,0,1,0,0.148837149143219,234
776,scenario_05730,BacterialDemoSelection_05730_070.npz,0,0,0,1,1,0.9983920454978943,284
777,scenario_05730,BacterialDemoSelection_05730_075.npz,0,0,0,1,1,0.8972764611244202,356
778,scenario_05730,BacterialDemoSelection_05730_083.npz,0,0,0,1,0,0.058491408824920654,246
779,scenario_05736,BacterialDemoSelection_05736_004.npz,0,0,0,1,1,1.0,399
780,scenario_05736,BacterialDemoSelection_05736_014.npz,0,0,0,1,1,1.0,424
781,scenario_05736,BacterialDemoSelection_05736_026.npz,0,0,0,1,1,1.0,413
782,scenario_05736,BacterialDemoSelection_05736_042.npz,0,0,0,1,1,1.0,352
783,scenario_05736,BacterialDemoSelection_05736_051.npz,0,0,0,1,1,1.0,404
784,scenario_05736,BacterialDemoSelection_05736_073.npz,0,0,0,1,1,1.0,373
785,scenario_05736,BacterialDemoSelection_05736_079.npz,0,0,0,1,1,1.0,448
786,scenario_05736,BacterialDemoSelection_05736_080.npz,0,0,0,1,1,1.0,470
787,scenario_05736,BacterialDemoSelection_05736_087.npz,0,0,0,1,1,1.0,391
788,scenario_05736,BacterialDemoSelection_05736_095.npz,0,0,0,1,1,1.0,344
789,scenario_05737,BacterialDemoSelection_05737_029.npz,0,0,0,1,1,0.9531327486038208,287
790,scenario_05737,BacterialDemoSelection_05737_038.npz,0,0,0,1,0,0.1319791078567505,203
791,scenario_05737,BacterialDemoSelection_05737_055.npz,0,0,0,1,0,0.13484174013137817,232
792,scenario_05737,BacterialDemoSelection_05737_056.npz,0,0,0,1,0,0.09929102659225464,355
793,scenario_05737,BacterialDemoSelection_05737_062.npz,0,0,0,1,0,0.21564561128616333,281
794,scenario_05737,BacterialDemoSelection_05737_069.npz,0,0,0,1,0,0.10081207752227783,241
795,scenario_05737,BacterialDemoSelection_05737_072.npz,0,0,0,1,0,0.1508312225341797,233
796,scenario_05737,BacterialDemoSelection_05737_076.npz,0,0,0,1,0,0.0334811806678772,322
797,scenario_05737,BacterialDemoSelection_05737_077.npz,0,0,0,1,0,0.15360254049301147,291
798,scenario_05737,BacterialDemoSelection_05737_078.npz,0,0,0,1,0,0.15683317184448242,237
799,scenario_05740,BacterialDemoSelection_05740_009.npz,0,0,0,1,1,0.95907062292099,263
800,scenario_05740,BacterialDemoSelection_05740_021.npz,0,0,0,1,0,0.1502642035484314,209
801,scenario_05740,BacterialDemoSelection_05740_028.npz,0,0,0,1,0,0.15370047092437744,203
802,scenario_05740,BacterialDemoSelection_05740_030.npz,0,0,0,1,0,0.15059435367584229,212
803,scenario_05740,BacterialDemoSelection_05740_040.npz,0,0,0,1,1,0.7420712113380432,243
804,scenario_05740,BacterialDemoSelection_05740_059.npz,0,0,0,1,0,0.14450907707214355,198
805,scenario_05740,BacterialDemoSelection_05740_076.npz,0,0,0,1,0,0.009441971778869629,245
806,scenario_05740,BacterialDemoSelection_05740_088.npz,0,0,0,1,0,0.1436043381690979,215
807,scenario_05740,BacterialDemoSelection_05740_089.npz,0,0,0,1,0,0.15961676836013794,225
808,scenario_05740,BacterialDemoSelection_05740_098.npz,0,0,0,1,0,0.15343976020812988,212
809,scenario_05400,BacterialDemoSelection_05400_012.npz,0,0,0,0,0,0.9999991655349731,1665
810,scenario_05400,BacterialDemoSelection_05400_016.npz,0,0,0,0,0,1.0,1749
811,scenario_05400,BacterialDemoSelection_05400_019.npz,0,0,0,0,0,0.9999994039535522,3120
812,scenario_05400,BacterialDemoSelection_05400_042.npz,0,0,0,0,0,0.9999922513961792,2419
813,scenario_05400,BacterialDemoSelection_05400_051.npz,0,0,0,0,0,0.9999985694885254,3970
814,scenario_05400,BacterialDemoSelection_05400_058.npz,0,0,0,0,0,0.9999997615814209,2777
815,scenario_05400,BacterialDemoSelection_05400_064.npz,0,0,0,0,0,0.9999985694885254,3474
816,scenario_05400,BacterialDemoSelection_05400_072.npz,0,0,0,0,0,0.9999995231628418,2466
817,scenario_05400,BacterialDemoSelection_05400_084.npz,0,0,0,0,0,0.9999983310699463,1492
818,scenario_05400,BacterialDemoSelection_05400_088.npz,0,0,0,0,0,0.9999995231628418,2480
819,scenario_05743,BacterialDemoSelection_05743_012.npz,0,0,0,1,0,0.14827430248260498,206
820,scenario_05743,BacterialDemoSelection_05743_013.npz,0,0,0,1,0,0.1606617569923401,235
821,scenario_05743,BacterialDemoSelection_05743_014.npz,0,0,0,1,0,0.1415005922317505,164
822,scenario_05743,BacterialDemoSelection_05743_015.npz,0,0,0,1,0,0.1648656725883484,220
823,scenario_05743,BacterialDemoSelection_05743_038.npz,0,0,0,1,0,0.14125853776931763,212
824,scenario_05743,BacterialDemoSelection_05743_047.npz,0,0,0,1,0,0.17323607206344604,218
825,scenario_05743,BacterialDemoSelection_05743_051.npz,0,0,0,1,0,0.15928882360458374,151
826,scenario_05743,BacterialDemoSelection_05743_053.npz,0,0,0,1,0,0.16224336624145508,201
827,scenario_05743,BacterialDemoSelection_05743_058.npz,0,0,0,1,0,0.1727358102798462,206
828,scenario_05743,BacterialDemoSelection_05743_097.npz,0,0,0,1,0,0.15547311305999756,205
829,scenario_05850,BacterialDemoSelection_05850_003.npz,0,0,0,1,1,1.0,369
830,scenario_05850,BacterialDemoSelection_05850_023.npz,0,0,0,1,1,1.0,433
831,scenario_05850,BacterialDemoSelection_05850_058.npz,0,0,0,1,1,0.9999953508377075,319
832,scenario_05850,BacterialDemoSelection_05850_061.npz,0,0,0,1,1,1.0,435
833,scenario_05850,BacterialDemoSelection_05850_067.npz,0,0,0,1,1,1.0,344
834,scenario_05850,BacterialDemoSelection_05850_068.npz,0,0,0,1,1,1.0,322
835,scenario_05850,BacterialDemoSelection_05850_071.npz,0,0,0,1,1,1.0,378
836,scenario_05850,BacterialDemoSelection_05850_083.npz,0,0,0,1,1,1.0,349
837,scenario_05850,BacterialDemoSelection_05850_088.npz,0,0,0,1,0,0.07451426982879639,339
838,scenario_05850,BacterialDemoSelection_05850_093.npz,0,0,0,1,1,1.0,383
