Runtime notice: d_max = 276.310211 = -log(epsilon = 1.000000e-12) * rho = 10.000000
Runtime notice: t= 0 ------------------------------
Runtime notice: doNext(current: '{ state: { word: nobody number: 0 } action: { word: papy number: 20 } time: 0 }')
Runtime notice: ScalarField::getValue('{ state: { word: nobody number: 0 } action: { word: zpapy number: 20 } time: 0 }', K_max: -1 d_max: 276.310211 < diameter: 7.000000 save: 0 size: 2 >= count: 2
Runtime notice: 	 ('{ word: mapy number: 15 }' -> -1.000000, '{ word: mama number: 10 }' -> 1.000000) => '{ word: mapy number: 15 }' -> -1.000000, d_min12 = 7.000000 d_min = 36.000000 #2
Runtime notice: ScalarField::getValue('{ state: { word: nobody number: 0 } action: { word: ziapy number: 20 } time: 0 }', K_max: -1 d_max: 276.310211 < diameter: 7.000000 save: 0 size: 2 >= count: 2
Runtime notice: 	 ('{ word: mapy number: 15 }' -> -1.000000, '{ word: mama number: 10 }' -> 1.000000) => '{ word: mapy number: 15 }' -> -1.000000, d_min12 = 7.000000 d_min = 36.000000 #2
Runtime notice: ScalarField::getValue('{ state: { word: nobody number: 0 } action: { word: zizpy number: 20 } time: 0 }', K_max: -1 d_max: 276.310211 < diameter: 7.000000 save: 0 size: 2 >= count: 2
Runtime notice: 	 ('{ word: mapy number: 15 }' -> -1.000000, '{ word: mama number: 10 }' -> 1.000000) => '{ word: mapy number: 15 }' -> -1.000000, d_min12 = 7.000000 d_min = 36.000000 #2
Runtime notice: ScalarField::getValue('{ state: { word: nobody number: 0 } action: { word: zizoy number: 20 } time: 0 }', K_max: -1 d_max: 276.310211 < diameter: 7.000000 save: 0 size: 2 >= count: 2
Runtime notice: 	 ('{ word: mapy number: 15 }' -> -1.000000, '{ word: mama number: 10 }' -> 1.000000) => '{ word: mapy number: 15 }' -> -1.000000, d_min12 = 7.000000 d_min = 36.000000 #2
Runtime notice: ScalarField::getValue('{ state: { word: nobody number: 0 } action: { word: zizou number: 20 } time: 0 }', K_max: -1 d_max: 276.310211 < diameter: 7.000000 save: 0 size: 2 >= count: 2
Runtime notice: 	 ('{ word: mapy number: 15 }' -> -1.000000, '{ word: mama number: 10 }' -> 1.000000) => '{ word: mapy number: 15 }' -> -1.000000, d_min12 = 7.000000 d_min = 36.000000 #2
Runtime notice: ScalarField::getValue('{ state: { word: nobody number: 0 } action: { word: zizou number: 19 } time: 0 }', K_max: -1 d_max: 276.310211 < diameter: 7.000000 save: 0 size: 2 >= count: 2
Runtime notice: 	 ('{ word: mapy number: 15 }' -> -1.000000, '{ word: mama number: 10 }' -> 1.000000) => '{ word: mapy number: 15 }' -> -1.000000, d_min12 = 7.000000 d_min = 35.000000 #2
Runtime notice: ScalarField::getValue('{ state: { word: nobody number: 0 } action: { word: zizou number: 18 } time: 0 }', K_max: -1 d_max: 276.310211 < diameter: 7.000000 save: 0 size: 2 >= count: 2
Runtime notice: 	 ('{ word: mapy number: 15 }' -> -1.000000, '{ word: mama number: 10 }' -> 1.000000) => '{ word: mapy number: 15 }' -> -1.000000, d_min12 = 7.000000 d_min = 34.000000 #2
Runtime notice: ScalarField::getValue('{ state: { word: nobody number: 0 } action: { word: zizou number: 17 } time: 0 }', K_max: -1 d_max: 276.310211 < diameter: 7.000000 save: 0 size: 2 >= count: 2
Runtime notice: 	 ('{ word: mapy number: 15 }' -> -1.000000, '{ word: mama number: 10 }' -> 1.000000) => '{ word: mapy number: 15 }' -> -1.000000, d_min12 = 7.000000 d_min = 33.000000 #2
Runtime notice: ScalarField::getValue('{ state: { word: nobody number: 0 } action: { word: zizou number: 16 } time: 0 }', K_max: -1 d_max: 276.310211 < diameter: 7.000000 save: 0 size: 2 >= count: 2
Runtime notice: 	 ('{ word: mapy number: 15 }' -> -1.000000, '{ word: mama number: 10 }' -> 1.000000) => '{ word: mapy number: 15 }' -> -1.000000, d_min12 = 7.000000 d_min = 32.000000 #2
Runtime notice: ScalarField::getValue('{ state: { word: nobody number: 0 } action: { word: zizou number: 15 } time: 0 }', K_max: -1 d_max: 276.310211 < diameter: 7.000000 save: 0 size: 2 >= count: 2
Runtime notice: 	 ('{ word: mapy number: 15 }' -> -1.000000, '{ word: mama number: 10 }' -> 1.000000) => '{ word: mapy number: 15 }' -> -1.000000, d_min12 = 7.000000 d_min = 33.000000 #2
Runtime notice: ScalarField::getValue('{ state: { word: nobody number: 0 } action: { word: zizou number: 14 } time: 0 }', K_max: -1 d_max: 276.310211 < diameter: 7.000000 save: 0 size: 2 >= count: 2
Runtime notice: 	 ('{ word: mapy number: 15 }' -> -1.000000, '{ word: mama number: 10 }' -> 1.000000) => '{ word: mapy number: 15 }' -> -1.000000, d_min12 = 7.000000 d_min = 34.000000 #2
Runtime notice: ScalarField::getValue('{ state: { word: nobody number: 0 } action: { word: zizou number: 13 } time: 0 }', K_max: -1 d_max: 276.310211 < diameter: 7.000000 save: 0 size: 2 >= count: 2
Runtime notice: 	 ('{ word: mapy number: 15 }' -> -1.000000, '{ word: mama number: 10 }' -> 1.000000) => '{ word: mapy number: 15 }' -> -1.000000, d_min12 = 7.000000 d_min = 35.000000 #2
Runtime notice: ScalarField::getValue('{ state: { word: nobody number: 0 } action: { word: zizou number: 12 } time: 0 }', K_max: -1 d_max: 276.310211 < diameter: 7.000000 save: 0 size: 2 >= count: 2
Runtime notice: 	 ('{ word: mapy number: 15 }' -> -1.000000, '{ word: mama number: 10 }' -> 1.000000) => '{ word: mapy number: 15 }' -> -1.000000, d_min12 = 7.000000 d_min = 36.000000 #2
Runtime notice: ScalarField::getValue('{ state: { word: nobody number: 0 } action: { word: zizou number: 11 } time: 0 }', K_max: -1 d_max: 276.310211 < diameter: 7.000000 save: 0 size: 2 >= count: 2
Runtime notice: 	 ('{ word: mapy number: 15 }' -> -1.000000, '{ word: mama number: 10 }' -> 1.000000) => '{ word: mapy number: 15 }' -> -1.000000, d_min12 = 7.000000 d_min = 37.000000 #2
Runtime notice: ScalarField::getValue('{ state: { word: nobody number: 0 } action: { word: zizou number: 10 } time: 0 }', K_max: -1 d_max: 276.310211 < diameter: 7.000000 save: 0 size: 2 >= count: 2
Runtime notice: 	 ('{ word: mapy number: 15 }' -> -1.000000, '{ word: mama number: 10 }' -> 1.000000) => '{ word: mapy number: 15 }' -> -1.000000, d_min12 = 7.000000 d_min = 38.000000 #2
Runtime notice: ScalarField::getValue('{ state: { word: nobody number: 0 } action: { word: zizou number: 9 } time: 0 }', K_max: -1 d_max: 276.310211 < diameter: 7.000000 save: 0 size: 2 >= count: 2
Runtime notice: 	 ('{ word: mapy number: 15 }' -> -1.000000, '{ word: mama number: 10 }' -> 1.000000) => '{ word: mapy number: 15 }' -> -1.000000, d_min12 = 7.000000 d_min = 39.000000 #2
Runtime notice: ScalarField::getValue('{ state: { word: nobody number: 0 } action: { word: zizou number: 8 } time: 0 }', K_max: -1 d_max: 276.310211 < diameter: 7.000000 save: 0 size: 2 >= count: 2
Runtime notice: 	 ('{ word: mapy number: 15 }' -> -1.000000, '{ word: mama number: 10 }' -> 1.000000) => '{ word: mapy number: 15 }' -> -1.000000, d_min12 = 7.000000 d_min = 40.000000 #2
Runtime notice: ScalarField::getValue('{ state: { word: nobody number: 0 } action: { word: zizou number: 7 } time: 0 }', K_max: -1 d_max: 276.310211 < diameter: 7.000000 save: 0 size: 2 >= count: 2
Runtime notice: 	 ('{ word: mapy number: 15 }' -> -1.000000, '{ word: mama number: 10 }' -> 1.000000) => '{ word: mapy number: 15 }' -> -1.000000, d_min12 = 7.000000 d_min = 41.000000 #2
Runtime notice: ScalarField::getValue('{ state: { word: nobody number: 0 } action: { word: zizou number: 6 } time: 0 }', K_max: -1 d_max: 276.310211 < diameter: 7.000000 save: 0 size: 2 >= count: 2
Runtime notice: 	 ('{ word: mapy number: 15 }' -> -1.000000, '{ word: mama number: 10 }' -> 1.000000) => '{ word: mapy number: 15 }' -> -1.000000, d_min12 = 7.000000 d_min = 42.000000 #2
Runtime notice: ScalarField::getValue('{ state: { word: nobody number: 0 } action: { word: zizou number: 5 } time: 0 }', K_max: -1 d_max: 276.310211 < diameter: 7.000000 save: 0 size: 2 >= count: 2
Runtime notice: 	 ('{ word: mapy number: 15 }' -> -1.000000, '{ word: mama number: 10 }' -> 1.000000) => '{ word: mapy number: 15 }' -> -1.000000, d_min12 = 7.000000 d_min = 43.000000 #2
Runtime notice: ScalarField::getValue('{ state: { word: nobody number: 0 } action: { word: zizou number: 4 } time: 0 }', K_max: -1 d_max: 276.310211 < diameter: 7.000000 save: 0 size: 2 >= count: 2
Runtime notice: 	 ('{ word: mapy number: 15 }' -> -1.000000, '{ word: mama number: 10 }' -> 1.000000) => '{ word: mapy number: 15 }' -> -1.000000, d_min12 = 7.000000 d_min = 44.000000 #2
Runtime notice: ScalarField::getValue('{ state: { word: nobody number: 0 } action: { word: zizou number: 3 } time: 0 }', K_max: -1 d_max: 276.310211 < diameter: 7.000000 save: 0 size: 2 >= count: 2
Runtime notice: 	 ('{ word: mapy number: 15 }' -> -1.000000, '{ word: mama number: 10 }' -> 1.000000) => '{ word: mapy number: 15 }' -> -1.000000, d_min12 = 7.000000 d_min = 45.000000 #2
Runtime notice: ScalarField::getValue('{ state: { word: nobody number: 0 } action: { word: zizou number: 2 } time: 0 }', K_max: -1 d_max: 276.310211 < diameter: 7.000000 save: 0 size: 2 >= count: 2
Runtime notice: 	 ('{ word: mapy number: 15 }' -> -1.000000, '{ word: mama number: 10 }' -> 1.000000) => '{ word: mapy number: 15 }' -> -1.000000, d_min12 = 7.000000 d_min = 46.000000 #2
Runtime notice: ScalarField::getValue('{ state: { word: nobody number: 0 } action: { word: zizou number: 1 } time: 0 }', K_max: -1 d_max: 276.310211 < diameter: 7.000000 save: 0 size: 2 >= count: 2
Runtime notice: 	 ('{ word: mapy number: 15 }' -> -1.000000, '{ word: mama number: 10 }' -> 1.000000) => '{ word: mapy number: 15 }' -> -1.000000, d_min12 = 7.000000 d_min = 47.000000 #2
Runtime notice: ScalarField::getValue('{ state: { word: nobody number: 0 } action: { word: zizou number: 0 } time: 0 }', K_max: -1 d_max: 276.310211 < diameter: 7.000000 save: 0 size: 2 >= count: 2
Runtime notice: 	 ('{ word: mapy number: 15 }' -> -1.000000, '{ word: mama number: 10 }' -> 1.000000) => '{ word: mapy number: 15 }' -> -1.000000, d_min12 = 7.000000 d_min = 48.000000 #2
Runtime notice: ScalarField::getValue('{ state: { word: nobody number: 0 } action: { word: apapy number: 20 } time: 0 }', K_max: -1 d_max: 276.310211 < diameter: 7.000000 save: 0 size: 2 >= count: 2
Runtime notice: 	 ('{ word: mapy number: 15 }' -> -1.000000, '{ word: mama number: 10 }' -> 1.000000) => '{ word: mapy number: 15 }' -> -1.000000, d_min12 = 7.000000 d_min = 36.000000 #2
Runtime notice: ScalarField::getValue('{ state: { word: nobody number: 0 } action: { word: alpapy number: 20 } time: 0 }', K_max: -1 d_max: 276.310211 < diameter: 7.000000 save: 0 size: 2 >= count: 2
Runtime notice: 	 ('{ word: mapy number: 15 }' -> -1.000000, '{ word: mama number: 10 }' -> 1.000000) => '{ word: mapy number: 15 }' -> -1.000000, d_min12 = 7.000000 d_min = 37.000000 #2
Runtime notice: ScalarField::getValue('{ state: { word: nobody number: 0 } action: { word: albapy number: 20 } time: 0 }', K_max: -1 d_max: 276.310211 < diameter: 7.000000 save: 0 size: 2 >= count: 2
Runtime notice: 	 ('{ word: mapy number: 15 }' -> -1.000000, '{ word: mama number: 10 }' -> 1.000000) => '{ word: mapy number: 15 }' -> -1.000000, d_min12 = 7.000000 d_min = 37.000000 #2
Runtime notice: ScalarField::getValue('{ state: { word: nobody number: 0 } action: { word: albepy number: 20 } time: 0 }', K_max: -1 d_max: 276.310211 < diameter: 7.000000 save: 0 size: 2 >= count: 2
Runtime notice: 	 ('{ word: mapy number: 15 }' -> -1.000000, '{ word: mama number: 10 }' -> 1.000000) => '{ word: mapy number: 15 }' -> -1.000000, d_min12 = 7.000000 d_min = 37.000000 #2
Runtime notice: ScalarField::getValue('{ state: { word: nobody number: 0 } action: { word: albery number: 20 } time: 0 }', K_max: -1 d_max: 276.310211 < diameter: 7.000000 save: 0 size: 2 >= count: 2
Runtime notice: 	 ('{ word: mapy number: 15 }' -> -1.000000, '{ word: mama number: 10 }' -> 1.000000) => '{ word: mapy number: 15 }' -> -1.000000, d_min12 = 7.000000 d_min = 37.000000 #2
Runtime notice: ScalarField::getValue('{ state: { word: nobody number: 0 } action: { word: albert number: 20 } time: 0 }', K_max: -1 d_max: 276.310211 < diameter: 7.000000 save: 0 size: 2 >= count: 2
Runtime notice: 	 ('{ word: mapy number: 15 }' -> -1.000000, '{ word: mama number: 10 }' -> 1.000000) => '{ word: mapy number: 15 }' -> -1.000000, d_min12 = 7.000000 d_min = 37.000000 #2
Runtime notice: ScalarField::getValue('{ state: { word: nobody number: 0 } action: { word: albert number: 19 } time: 0 }', K_max: -1 d_max: 276.310211 < diameter: 7.000000 save: 0 size: 2 >= count: 2
Runtime notice: 	 ('{ word: mapy number: 15 }' -> -1.000000, '{ word: mama number: 10 }' -> 1.000000) => '{ word: mapy number: 15 }' -> -1.000000, d_min12 = 7.000000 d_min = 36.000000 #2
Runtime notice: ScalarField::getValue('{ state: { word: nobody number: 0 } action: { word: albert number: 18 } time: 0 }', K_max: -1 d_max: 276.310211 < diameter: 7.000000 save: 0 size: 2 >= count: 2
Runtime notice: 	 ('{ word: mapy number: 15 }' -> -1.000000, '{ word: mama number: 10 }' -> 1.000000) => '{ word: mapy number: 15 }' -> -1.000000, d_min12 = 7.000000 d_min = 35.000000 #2
Runtime notice: ScalarField::getValue('{ state: { word: nobody number: 0 } action: { word: albert number: 17 } time: 0 }', K_max: -1 d_max: 276.310211 < diameter: 7.000000 save: 0 size: 2 >= count: 2
Runtime notice: 	 ('{ word: mapy number: 15 }' -> -1.000000, '{ word: mama number: 10 }' -> 1.000000) => '{ word: mapy number: 15 }' -> -1.000000, d_min12 = 7.000000 d_min = 34.000000 #2
Runtime notice: ScalarField::getValue('{ state: { word: nobody number: 0 } action: { word: albert number: 16 } time: 0 }', K_max: -1 d_max: 276.310211 < diameter: 7.000000 save: 0 size: 2 >= count: 2
Runtime notice: 	 ('{ word: mapy number: 15 }' -> -1.000000, '{ word: mama number: 10 }' -> 1.000000) => '{ word: mapy number: 15 }' -> -1.000000, d_min12 = 7.000000 d_min = 33.000000 #2
Runtime notice: ScalarField::getValue('{ state: { word: nobody number: 0 } action: { word: albert number: 15 } time: 0 }', K_max: -1 d_max: 276.310211 < diameter: 7.000000 save: 0 size: 2 >= count: 2
Runtime notice: 	 ('{ word: mapy number: 15 }' -> -1.000000, '{ word: mama number: 10 }' -> 1.000000) => '{ word: mapy number: 15 }' -> -1.000000, d_min12 = 7.000000 d_min = 34.000000 #2
Runtime notice: ScalarField::getValue('{ state: { word: nobody number: 0 } action: { word: albert number: 14 } time: 0 }', K_max: -1 d_max: 276.310211 < diameter: 7.000000 save: 0 size: 2 >= count: 2
Runtime notice: 	 ('{ word: mapy number: 15 }' -> -1.000000, '{ word: mama number: 10 }' -> 1.000000) => '{ word: mapy number: 15 }' -> -1.000000, d_min12 = 7.000000 d_min = 35.000000 #2
Runtime notice: ScalarField::getValue('{ state: { word: nobody number: 0 } action: { word: albert number: 13 } time: 0 }', K_max: -1 d_max: 276.310211 < diameter: 7.000000 save: 0 size: 2 >= count: 2
Runtime notice: 	 ('{ word: mapy number: 15 }' -> -1.000000, '{ word: mama number: 10 }' -> 1.000000) => '{ word: mapy number: 15 }' -> -1.000000, d_min12 = 7.000000 d_min = 36.000000 #2
Runtime notice: ScalarField::getValue('{ state: { word: nobody number: 0 } action: { word: albert number: 12 } time: 0 }', K_max: -1 d_max: 276.310211 < diameter: 7.000000 save: 0 size: 2 >= count: 2
Runtime notice: 	 ('{ word: mapy number: 15 }' -> -1.000000, '{ word: mama number: 10 }' -> 1.000000) => '{ word: mapy number: 15 }' -> -1.000000, d_min12 = 7.000000 d_min = 37.000000 #2
Runtime notice: ScalarField::getValue('{ state: { word: nobody number: 0 } action: { word: albert number: 11 } time: 0 }', K_max: -1 d_max: 276.310211 < diameter: 7.000000 save: 0 size: 2 >= count: 2
Runtime notice: 	 ('{ word: mapy number: 15 }' -> -1.000000, '{ word: mama number: 10 }' -> 1.000000) => '{ word: mapy number: 15 }' -> -1.000000, d_min12 = 7.000000 d_min = 38.000000 #2
Runtime notice: ScalarField::getValue('{ state: { word: nobody number: 0 } action: { word: albert number: 10 } time: 0 }', K_max: -1 d_max: 276.310211 < diameter: 7.000000 save: 0 size: 2 >= count: 2
Runtime notice: 	 ('{ word: mapy number: 15 }' -> -1.000000, '{ word: mama number: 10 }' -> 1.000000) => '{ word: mapy number: 15 }' -> -1.000000, d_min12 = 7.000000 d_min = 39.000000 #2
Runtime notice: ScalarField::getValue('{ state: { word: nobody number: 0 } action: { word: albert number: 9 } time: 0 }', K_max: -1 d_max: 276.310211 < diameter: 7.000000 save: 0 size: 2 >= count: 2
Runtime notice: 	 ('{ word: mapy number: 15 }' -> -1.000000, '{ word: mama number: 10 }' -> 1.000000) => '{ word: mapy number: 15 }' -> -1.000000, d_min12 = 7.000000 d_min = 40.000000 #2
Runtime notice: ScalarField::getValue('{ state: { word: nobody number: 0 } action: { word: albert number: 8 } time: 0 }', K_max: -1 d_max: 276.310211 < diameter: 7.000000 save: 0 size: 2 >= count: 2
Runtime notice: 	 ('{ word: mapy number: 15 }' -> -1.000000, '{ word: mama number: 10 }' -> 1.000000) => '{ word: mapy number: 15 }' -> -1.000000, d_min12 = 7.000000 d_min = 41.000000 #2
Runtime notice: ScalarField::getValue('{ state: { word: nobody number: 0 } action: { word: albert number: 7 } time: 0 }', K_max: -1 d_max: 276.310211 < diameter: 7.000000 save: 0 size: 2 >= count: 2
Runtime notice: 	 ('{ word: mapy number: 15 }' -> -1.000000, '{ word: mama number: 10 }' -> 1.000000) => '{ word: mapy number: 15 }' -> -1.000000, d_min12 = 7.000000 d_min = 42.000000 #2
Runtime notice: ScalarField::getValue('{ state: { word: nobody number: 0 } action: { word: albert number: 6 } time: 0 }', K_max: -1 d_max: 276.310211 < diameter: 7.000000 save: 0 size: 2 >= count: 2
Runtime notice: 	 ('{ word: mapy number: 15 }' -> -1.000000, '{ word: mama number: 10 }' -> 1.000000) => '{ word: mapy number: 15 }' -> -1.000000, d_min12 = 7.000000 d_min = 43.000000 #2
Runtime notice: ScalarField::getValue('{ state: { word: nobody number: 0 } action: { word: albert number: 5 } time: 0 }', K_max: -1 d_max: 276.310211 < diameter: 7.000000 save: 0 size: 2 >= count: 2
Runtime notice: 	 ('{ word: mapy number: 15 }' -> -1.000000, '{ word: mama number: 10 }' -> 1.000000) => '{ word: mapy number: 15 }' -> -1.000000, d_min12 = 7.000000 d_min = 44.000000 #2
Runtime notice: ScalarField::getValue('{ state: { word: nobody number: 0 } action: { word: albert number: 4 } time: 0 }', K_max: -1 d_max: 276.310211 < diameter: 7.000000 save: 0 size: 2 >= count: 2
Runtime notice: 	 ('{ word: mapy number: 15 }' -> -1.000000, '{ word: mama number: 10 }' -> 1.000000) => '{ word: mapy number: 15 }' -> -1.000000, d_min12 = 7.000000 d_min = 45.000000 #2
Runtime notice: ScalarField::getValue('{ state: { word: nobody number: 0 } action: { word: albert number: 3 } time: 0 }', K_max: -1 d_max: 276.310211 < diameter: 7.000000 save: 0 size: 2 >= count: 2
Runtime notice: 	 ('{ word: mapy number: 15 }' -> -1.000000, '{ word: mama number: 10 }' -> 1.000000) => '{ word: mapy number: 15 }' -> -1.000000, d_min12 = 7.000000 d_min = 46.000000 #2
Runtime notice: ScalarField::getValue('{ state: { word: nobody number: 0 } action: { word: albert number: 2 } time: 0 }', K_max: -1 d_max: 276.310211 < diameter: 7.000000 save: 0 size: 2 >= count: 2
Runtime notice: 	 ('{ word: mapy number: 15 }' -> -1.000000, '{ word: mama number: 10 }' -> 1.000000) => '{ word: mapy number: 15 }' -> -1.000000, d_min12 = 7.000000 d_min = 47.000000 #2
Runtime notice: ScalarField::getValue('{ state: { word: nobody number: 0 } action: { word: albert number: 1 } time: 0 }', K_max: -1 d_max: 276.310211 < diameter: 7.000000 save: 0 size: 2 >= count: 2
Runtime notice: 	 ('{ word: mapy number: 15 }' -> -1.000000, '{ word: mama number: 10 }' -> 1.000000) => '{ word: mapy number: 15 }' -> -1.000000, d_min12 = 7.000000 d_min = 48.000000 #2
Runtime notice: ScalarField::getValue('{ state: { word: nobody number: 0 } action: { word: albert number: 0 } time: 0 }', K_max: -1 d_max: 276.310211 < diameter: 7.000000 save: 0 size: 2 >= count: 2
Runtime notice: 	 ('{ word: mapy number: 15 }' -> -1.000000, '{ word: mama number: 10 }' -> 1.000000) => '{ word: mapy number: 15 }' -> -1.000000, d_min12 = 7.000000 d_min = 49.000000 #2
Runtime notice: ScalarField::getValue('{ state: { word: nobody number: 0 } action: { word: mpapy number: 20 } time: 0 }', K_max: -1 d_max: 276.310211 < diameter: 7.000000 save: 0 size: 2 >= count: 2
Runtime notice: 	 ('{ word: mapy number: 15 }' -> -1.000000, '{ word: mama number: 10 }' -> 1.000000) => '{ word: mapy number: 15 }' -> -1.000000, d_min12 = 7.000000 d_min = 36.000000 #2
Runtime notice: ScalarField::getValue('{ state: { word: nobody number: 0 } action: { word: mapapy number: 20 } time: 0 }', K_max: -1 d_max: 276.310211 < diameter: 7.000000 save: 0 size: 2 >= count: 2
Runtime notice: 	 ('{ word: mapy number: 15 }' -> -1.000000, '{ word: mama number: 10 }' -> 1.000000) => '{ word: mapy number: 15 }' -> -1.000000, d_min12 = 7.000000 d_min = 37.000000 #2
Runtime notice: ScalarField::getValue('{ state: { word: nobody number: 0 } action: { word: marpapy number: 20 } time: 0 }', K_max: -1 d_max: 276.310211 < diameter: 7.000000 save: 0 size: 2 >= count: 2
Runtime notice: 	 ('{ word: mapy number: 15 }' -> -1.000000, '{ word: mama number: 10 }' -> 1.000000) => '{ word: mapy number: 15 }' -> -1.000000, d_min12 = 7.000000 d_min = 38.000000 #2
Runtime notice: ScalarField::getValue('{ state: { word: nobody number: 0 } action: { word: martpapy number: 20 } time: 0 }', K_max: -1 d_max: 276.310211 < diameter: 7.000000 save: 0 size: 2 >= count: 2
Runtime notice: 	 ('{ word: mapy number: 15 }' -> -1.000000, '{ word: mama number: 10 }' -> 1.000000) => '{ word: mapy number: 15 }' -> -1.000000, d_min12 = 7.000000 d_min = 39.000000 #2
Runtime notice: ScalarField::getValue('{ state: { word: nobody number: 0 } action: { word: martipapy number: 20 } time: 0 }', K_max: -1 d_max: 276.310211 < diameter: 7.000000 save: 0 size: 2 >= count: 2
Runtime notice: 	 ('{ word: mapy number: 15 }' -> -1.000000, '{ word: mama number: 10 }' -> 1.000000) => '{ word: mapy number: 15 }' -> -1.000000, d_min12 = 7.000000 d_min = 40.000000 #2
Runtime notice: ScalarField::getValue('{ state: { word: nobody number: 0 } action: { word: martinapy number: 20 } time: 0 }', K_max: -1 d_max: 276.310211 < diameter: 7.000000 save: 0 size: 2 >= count: 2
Runtime notice: 	 ('{ word: mapy number: 15 }' -> -1.000000, '{ word: mama number: 10 }' -> 1.000000) => '{ word: mapy number: 15 }' -> -1.000000, d_min12 = 7.000000 d_min = 40.000000 #2
Runtime notice: ScalarField::getValue('{ state: { word: nobody number: 0 } action: { word: martinaly number: 20 } time: 0 }', K_max: -1 d_max: 276.310211 < diameter: 7.000000 save: 0 size: 2 >= count: 2
Runtime notice: 	 ('{ word: mapy number: 15 }' -> -1.000000, '{ word: mama number: 10 }' -> 1.000000) => '{ word: mapy number: 15 }' -> -1.000000, d_min12 = 7.000000 d_min = 40.000000 #2
Runtime notice: ScalarField::getValue('{ state: { word: nobody number: 0 } action: { word: martinale number: 20 } time: 0 }', K_max: -1 d_max: 276.310211 < diameter: 7.000000 save: 0 size: 2 >= count: 2
Runtime notice: 	 ('{ word: mapy number: 15 }' -> -1.000000, '{ word: mama number: 10 }' -> 1.000000) => '{ word: mapy number: 15 }' -> -1.000000, d_min12 = 7.000000 d_min = 40.000000 #2
Runtime notice: ScalarField::getValue('{ state: { word: nobody number: 0 } action: { word: martinale number: 19 } time: 0 }', K_max: -1 d_max: 276.310211 < diameter: 7.000000 save: 0 size: 2 >= count: 2
Runtime notice: 	 ('{ word: mapy number: 15 }' -> -1.000000, '{ word: mama number: 10 }' -> 1.000000) => '{ word: mapy number: 15 }' -> -1.000000, d_min12 = 7.000000 d_min = 39.000000 #2
Runtime notice: ScalarField::getValue('{ state: { word: nobody number: 0 } action: { word: martinale number: 18 } time: 0 }', K_max: -1 d_max: 276.310211 < diameter: 7.000000 save: 0 size: 2 >= count: 2
Runtime notice: 	 ('{ word: mapy number: 15 }' -> -1.000000, '{ word: mama number: 10 }' -> 1.000000) => '{ word: mapy number: 15 }' -> -1.000000, d_min12 = 7.000000 d_min = 38.000000 #2
Runtime notice: ScalarField::getValue('{ state: { word: nobody number: 0 } action: { word: martinale number: 17 } time: 0 }', K_max: -1 d_max: 276.310211 < diameter: 7.000000 save: 0 size: 2 >= count: 2
Runtime notice: 	 ('{ word: mapy number: 15 }' -> -1.000000, '{ word: mama number: 10 }' -> 1.000000) => '{ word: mapy number: 15 }' -> -1.000000, d_min12 = 7.000000 d_min = 37.000000 #2
Runtime notice: ScalarField::getValue('{ state: { word: nobody number: 0 } action: { word: martinale number: 16 } time: 0 }', K_max: -1 d_max: 276.310211 < diameter: 7.000000 save: 0 size: 2 >= count: 2
Runtime notice: 	 ('{ word: mapy number: 15 }' -> -1.000000, '{ word: mama number: 10 }' -> 1.000000) => '{ word: mapy number: 15 }' -> -1.000000, d_min12 = 7.000000 d_min = 36.000000 #2
Runtime notice: ScalarField::getValue('{ state: { word: nobody number: 0 } action: { word: martinale number: 15 } time: 0 }', K_max: -1 d_max: 276.310211 < diameter: 7.000000 save: 0 size: 2 >= count: 2
Runtime notice: 	 ('{ word: mapy number: 15 }' -> -1.000000, '{ word: mama number: 10 }' -> 1.000000) => '{ word: mapy number: 15 }' -> -1.000000, d_min12 = 7.000000 d_min = 37.000000 #2
Runtime notice: ScalarField::getValue('{ state: { word: nobody number: 0 } action: { word: martinale number: 14 } time: 0 }', K_max: -1 d_max: 276.310211 < diameter: 7.000000 save: 0 size: 2 >= count: 2
Runtime notice: 	 ('{ word: mapy number: 15 }' -> -1.000000, '{ word: mama number: 10 }' -> 1.000000) => '{ word: mapy number: 15 }' -> -1.000000, d_min12 = 7.000000 d_min = 38.000000 #2
Runtime notice: ScalarField::getValue('{ state: { word: nobody number: 0 } action: { word: martinale number: 13 } time: 0 }', K_max: -1 d_max: 276.310211 < diameter: 7.000000 save: 0 size: 2 >= count: 2
Runtime notice: 	 ('{ word: mapy number: 15 }' -> -1.000000, '{ word: mama number: 10 }' -> 1.000000) => '{ word: mapy number: 15 }' -> -1.000000, d_min12 = 7.000000 d_min = 39.000000 #2
Runtime notice: ScalarField::getValue('{ state: { word: nobody number: 0 } action: { word: martinale number: 12 } time: 0 }', K_max: -1 d_max: 276.310211 < diameter: 7.000000 save: 0 size: 2 >= count: 2
Runtime notice: 	 ('{ word: mapy number: 15 }' -> -1.000000, '{ word: mama number: 10 }' -> 1.000000) => '{ word: mapy number: 15 }' -> -1.000000, d_min12 = 7.000000 d_min = 40.000000 #2
Runtime notice: ScalarField::getValue('{ state: { word: nobody number: 0 } action: { word: martinale number: 11 } time: 0 }', K_max: -1 d_max: 276.310211 < diameter: 7.000000 save: 0 size: 2 >= count: 2
Runtime notice: 	 ('{ word: mapy number: 15 }' -> -1.000000, '{ word: mama number: 10 }' -> 1.000000) => '{ word: mapy number: 15 }' -> -1.000000, d_min12 = 7.000000 d_min = 41.000000 #2
Runtime notice: ScalarField::getValue('{ state: { word: nobody number: 0 } action: { word: martinale number: 10 } time: 0 }', K_max: -1 d_max: 276.310211 < diameter: 7.000000 save: 0 size: 2 >= count: 2
Runtime notice: 	 ('{ word: mapy number: 15 }' -> -1.000000, '{ word: mama number: 10 }' -> 1.000000) => '{ word: mapy number: 15 }' -> -1.000000, d_min12 = 7.000000 d_min = 42.000000 #2
Runtime notice: ScalarField::getValue('{ state: { word: nobody number: 0 } action: { word: martinale number: 9 } time: 0 }', K_max: -1 d_max: 276.310211 < diameter: 7.000000 save: 0 size: 2 >= count: 2
Runtime notice: 	 ('{ word: mapy number: 15 }' -> -1.000000, '{ word: mama number: 10 }' -> 1.000000) => '{ word: mapy number: 15 }' -> -1.000000, d_min12 = 7.000000 d_min = 43.000000 #2
Runtime notice: ScalarField::getValue('{ state: { word: nobody number: 0 } action: { word: martinale number: 8 } time: 0 }', K_max: -1 d_max: 276.310211 < diameter: 7.000000 save: 0 size: 2 >= count: 2
Runtime notice: 	 ('{ word: mapy number: 15 }' -> -1.000000, '{ word: mama number: 10 }' -> 1.000000) => '{ word: mapy number: 15 }' -> -1.000000, d_min12 = 7.000000 d_min = 44.000000 #2
Runtime notice: ScalarField::getValue('{ state: { word: nobody number: 0 } action: { word: martinale number: 7 } time: 0 }', K_max: -1 d_max: 276.310211 < diameter: 7.000000 save: 0 size: 2 >= count: 2
Runtime notice: 	 ('{ word: mapy number: 15 }' -> -1.000000, '{ word: mama number: 10 }' -> 1.000000) => '{ word: mapy number: 15 }' -> -1.000000, d_min12 = 7.000000 d_min = 45.000000 #2
Runtime notice: ScalarField::getValue('{ state: { word: nobody number: 0 } action: { word: martinale number: 6 } time: 0 }', K_max: -1 d_max: 276.310211 < diameter: 7.000000 save: 0 size: 2 >= count: 2
Runtime notice: 	 ('{ word: mapy number: 15 }' -> -1.000000, '{ word: mama number: 10 }' -> 1.000000) => '{ word: mapy number: 15 }' -> -1.000000, d_min12 = 7.000000 d_min = 46.000000 #2
Runtime notice: ScalarField::getValue('{ state: { word: nobody number: 0 } action: { word: martinale number: 5 } time: 0 }', K_max: -1 d_max: 276.310211 < diameter: 7.000000 save: 0 size: 2 >= count: 2
Runtime notice: 	 ('{ word: mapy number: 15 }' -> -1.000000, '{ word: mama number: 10 }' -> 1.000000) => '{ word: mapy number: 15 }' -> -1.000000, d_min12 = 7.000000 d_min = 47.000000 #2
Runtime notice: ScalarField::getValue('{ state: { word: nobody number: 0 } action: { word: martinale number: 4 } time: 0 }', K_max: -1 d_max: 276.310211 < diameter: 7.000000 save: 0 size: 2 >= count: 2
Runtime notice: 	 ('{ word: mapy number: 15 }' -> -1.000000, '{ word: mama number: 10 }' -> 1.000000) => '{ word: mapy number: 15 }' -> -1.000000, d_min12 = 7.000000 d_min = 48.000000 #2
Runtime notice: ScalarField::getValue('{ state: { word: nobody number: 0 } action: { word: martinale number: 3 } time: 0 }', K_max: -1 d_max: 276.310211 < diameter: 7.000000 save: 0 size: 2 >= count: 2
Runtime notice: 	 ('{ word: mapy number: 15 }' -> -1.000000, '{ word: mama number: 10 }' -> 1.000000) => '{ word: mapy number: 15 }' -> -1.000000, d_min12 = 7.000000 d_min = 49.000000 #2
Runtime notice: ScalarField::getValue('{ state: { word: nobody number: 0 } action: { word: martinale number: 2 } time: 0 }', K_max: -1 d_max: 276.310211 < diameter: 7.000000 save: 0 size: 2 >= count: 2
Runtime notice: 	 ('{ word: mapy number: 15 }' -> -1.000000, '{ word: mama number: 10 }' -> 1.000000) => '{ word: mapy number: 15 }' -> -1.000000, d_min12 = 7.000000 d_min = 50.000000 #2
Runtime notice: ScalarField::getValue('{ state: { word: nobody number: 0 } action: { word: martinale number: 1 } time: 0 }', K_max: -1 d_max: 276.310211 < diameter: 7.000000 save: 0 size: 2 >= count: 2
Runtime notice: 	 ('{ word: mapy number: 15 }' -> -1.000000, '{ word: mama number: 10 }' -> 1.000000) => '{ word: mapy number: 15 }' -> -1.000000, d_min12 = 7.000000 d_min = 51.000000 #2
Runtime notice: ScalarField::getValue('{ state: { word: nobody number: 0 } action: { word: martinale number: 0 } time: 0 }', K_max: -1 d_max: 276.310211 < diameter: 7.000000 save: 0 size: 2 >= count: 2
Runtime notice: 	 ('{ word: mapy number: 15 }' -> -1.000000, '{ word: mama number: 10 }' -> 1.000000) => '{ word: mapy number: 15 }' -> -1.000000, d_min12 = 7.000000 d_min = 52.000000 #2
Runtime notice: ScalarField::getValue('{ state: { word: nobody number: 0 } action: { word: zpapy number: 20 } time: 0 }', K_max: -1 d_max: 276.310211 < diameter: 7.000000 save: 0 size: 2 >= count: 2
Runtime notice: 	 ('{ word: mapy number: 15 }' -> -1.000000, '{ word: mama number: 10 }' -> 1.000000) => '{ word: mapy number: 15 }' -> -1.000000, d_min12 = 7.000000 d_min = 36.000000 #2
Runtime notice: ScalarField::getValue('{ state: { word: nobody number: 0 } action: { word: ziapy number: 20 } time: 0 }', K_max: -1 d_max: 276.310211 < diameter: 7.000000 save: 0 size: 2 >= count: 2
Runtime notice: 	 ('{ word: mapy number: 15 }' -> -1.000000, '{ word: mama number: 10 }' -> 1.000000) => '{ word: mapy number: 15 }' -> -1.000000, d_min12 = 7.000000 d_min = 36.000000 #2
Runtime notice: ScalarField::getValue('{ state: { word: nobody number: 0 } action: { word: zizpy number: 20 } time: 0 }', K_max: -1 d_max: 276.310211 < diameter: 7.000000 save: 0 size: 2 >= count: 2
Runtime notice: 	 ('{ word: mapy number: 15 }' -> -1.000000, '{ word: mama number: 10 }' -> 1.000000) => '{ word: mapy number: 15 }' -> -1.000000, d_min12 = 7.000000 d_min = 36.000000 #2
Runtime notice: ScalarField::getValue('{ state: { word: nobody number: 0 } action: { word: zizoy number: 20 } time: 0 }', K_max: -1 d_max: 276.310211 < diameter: 7.000000 save: 0 size: 2 >= count: 2
Runtime notice: 	 ('{ word: mapy number: 15 }' -> -1.000000, '{ word: mama number: 10 }' -> 1.000000) => '{ word: mapy number: 15 }' -> -1.000000, d_min12 = 7.000000 d_min = 36.000000 #2
Runtime notice: ScalarField::getValue('{ state: { word: nobody number: 0 } action: { word: zizou number: 20 } time: 0 }', K_max: -1 d_max: 276.310211 < diameter: 7.000000 save: 0 size: 2 >= count: 2
Runtime notice: 	 ('{ word: mapy number: 15 }' -> -1.000000, '{ word: mama number: 10 }' -> 1.000000) => '{ word: mapy number: 15 }' -> -1.000000, d_min12 = 7.000000 d_min = 36.000000 #2
Runtime notice: ScalarField::getValue('{ state: { word: nobody number: 0 } action: { word: zizou number: 21 } time: 0 }', K_max: -1 d_max: 276.310211 < diameter: 7.000000 save: 0 size: 2 >= count: 2
Runtime notice: 	 ('{ word: mapy number: 15 }' -> -1.000000, '{ word: mama number: 10 }' -> 1.000000) => '{ word: mapy number: 15 }' -> -1.000000, d_min12 = 7.000000 d_min = 37.000000 #2
Runtime notice: ScalarField::getValue('{ state: { word: nobody number: 0 } action: { word: zizou number: 22 } time: 0 }', K_max: -1 d_max: 276.310211 < diameter: 7.000000 save: 0 size: 2 >= count: 2
Runtime notice: 	 ('{ word: mapy number: 15 }' -> -1.000000, '{ word: mama number: 10 }' -> 1.000000) => '{ word: mapy number: 15 }' -> -1.000000, d_min12 = 7.000000 d_min = 38.000000 #2
Runtime notice: ScalarField::getValue('{ state: { word: nobody number: 0 } action: { word: zizou number: 23 } time: 0 }', K_max: -1 d_max: 276.310211 < diameter: 7.000000 save: 0 size: 2 >= count: 2
Runtime notice: 	 ('{ word: mapy number: 15 }' -> -1.000000, '{ word: mama number: 10 }' -> 1.000000) => '{ word: mapy number: 15 }' -> -1.000000, d_min12 = 7.000000 d_min = 39.000000 #2
Runtime notice: ScalarField::getValue('{ state: { word: nobody number: 0 } action: { word: zizou number: 24 } time: 0 }', K_max: -1 d_max: 276.310211 < diameter: 7.000000 save: 0 size: 2 >= count: 2
Runtime notice: 	 ('{ word: mapy number: 15 }' -> -1.000000, '{ word: mama number: 10 }' -> 1.000000) => '{ word: mapy number: 15 }' -> -1.000000, d_min12 = 7.000000 d_min = 40.000000 #2
Runtime notice: ScalarField::getValue('{ state: { word: nobody number: 0 } action: { word: zizou number: 25 } time: 0 }', K_max: -1 d_max: 276.310211 < diameter: 7.000000 save: 0 size: 2 >= count: 2
Runtime notice: 	 ('{ word: mapy number: 15 }' -> -1.000000, '{ word: mama number: 10 }' -> 1.000000) => '{ word: mapy number: 15 }' -> -1.000000, d_min12 = 7.000000 d_min = 41.000000 #2
Runtime notice: ScalarField::getValue('{ state: { word: nobody number: 0 } action: { word: zizou number: 26 } time: 0 }', K_max: -1 d_max: 276.310211 < diameter: 7.000000 save: 0 size: 2 >= count: 2
Runtime notice: 	 ('{ word: mapy number: 15 }' -> -1.000000, '{ word: mama number: 10 }' -> 1.000000) => '{ word: mapy number: 15 }' -> -1.000000, d_min12 = 7.000000 d_min = 42.000000 #2
Runtime notice: ScalarField::getValue('{ state: { word: nobody number: 0 } action: { word: zizou number: 27 } time: 0 }', K_max: -1 d_max: 276.310211 < diameter: 7.000000 save: 0 size: 2 >= count: 2
Runtime notice: 	 ('{ word: mapy number: 15 }' -> -1.000000, '{ word: mama number: 10 }' -> 1.000000) => '{ word: mapy number: 15 }' -> -1.000000, d_min12 = 7.000000 d_min = 43.000000 #2
Runtime notice: ScalarField::getValue('{ state: { word: nobody number: 0 } action: { word: zizou number: 28 } time: 0 }', K_max: -1 d_max: 276.310211 < diameter: 7.000000 save: 0 size: 2 >= count: 2
Runtime notice: 	 ('{ word: mapy number: 15 }' -> -1.000000, '{ word: mama number: 10 }' -> 1.000000) => '{ word: mapy number: 15 }' -> -1.000000, d_min12 = 7.000000 d_min = 44.000000 #2
Runtime notice: ScalarField::getValue('{ state: { word: nobody number: 0 } action: { word: zizou number: 29 } time: 0 }', K_max: -1 d_max: 276.310211 < diameter: 7.000000 save: 0 size: 2 >= count: 2
Runtime notice: 	 ('{ word: mapy number: 15 }' -> -1.000000, '{ word: mama number: 10 }' -> 1.000000) => '{ word: mapy number: 15 }' -> -1.000000, d_min12 = 7.000000 d_min = 45.000000 #2
Runtime notice: ScalarField::getValue('{ state: { word: nobody number: 0 } action: { word: zizou number: 30 } time: 0 }', K_max: -1 d_max: 276.310211 < diameter: 7.000000 save: 0 size: 2 >= count: 2
Runtime notice: 	 ('{ word: mapy number: 15 }' -> -1.000000, '{ word: mama number: 10 }' -> 1.000000) => '{ word: mapy number: 15 }' -> -1.000000, d_min12 = 7.000000 d_min = 46.000000 #2
Runtime notice: ScalarField::getValue('{ state: { word: nobody number: 0 } action: { word: zizou number: 31 } time: 0 }', K_max: -1 d_max: 276.310211 < diameter: 7.000000 save: 0 size: 2 >= count: 2
Runtime notice: 	 ('{ word: mapy number: 15 }' -> -1.000000, '{ word: mama number: 10 }' -> 1.000000) => '{ word: mapy number: 15 }' -> -1.000000, d_min12 = 7.000000 d_min = 47.000000 #2
Runtime notice: ScalarField::getValue('{ state: { word: nobody number: 0 } action: { word: zizou number: 32 } time: 0 }', K_max: -1 d_max: 276.310211 < diameter: 7.000000 save: 0 size: 2 >= count: 2
Runtime notice: 	 ('{ word: mapy number: 15 }' -> -1.000000, '{ word: mama number: 10 }' -> 1.000000) => '{ word: mapy number: 15 }' -> -1.000000, d_min12 = 7.000000 d_min = 48.000000 #2
Runtime notice: ScalarField::getValue('{ state: { word: nobody number: 0 } action: { word: apapy number: 20 } time: 0 }', K_max: -1 d_max: 276.310211 < diameter: 7.000000 save: 0 size: 2 >= count: 2
Runtime notice: 	 ('{ word: mapy number: 15 }' -> -1.000000, '{ word: mama number: 10 }' -> 1.000000) => '{ word: mapy number: 15 }' -> -1.000000, d_min12 = 7.000000 d_min = 36.000000 #2
Runtime notice: ScalarField::getValue('{ state: { word: nobody number: 0 } action: { word: alpapy number: 20 } time: 0 }', K_max: -1 d_max: 276.310211 < diameter: 7.000000 save: 0 size: 2 >= count: 2
Runtime notice: 	 ('{ word: mapy number: 15 }' -> -1.000000, '{ word: mama number: 10 }' -> 1.000000) => '{ word: mapy number: 15 }' -> -1.000000, d_min12 = 7.000000 d_min = 37.000000 #2
Runtime notice: ScalarField::getValue('{ state: { word: nobody number: 0 } action: { word: albapy number: 20 } time: 0 }', K_max: -1 d_max: 276.310211 < diameter: 7.000000 save: 0 size: 2 >= count: 2
Runtime notice: 	 ('{ word: mapy number: 15 }' -> -1.000000, '{ word: mama number: 10 }' -> 1.000000) => '{ word: mapy number: 15 }' -> -1.000000, d_min12 = 7.000000 d_min = 37.000000 #2
Runtime notice: ScalarField::getValue('{ state: { word: nobody number: 0 } action: { word: albepy number: 20 } time: 0 }', K_max: -1 d_max: 276.310211 < diameter: 7.000000 save: 0 size: 2 >= count: 2
Runtime notice: 	 ('{ word: mapy number: 15 }' -> -1.000000, '{ word: mama number: 10 }' -> 1.000000) => '{ word: mapy number: 15 }' -> -1.000000, d_min12 = 7.000000 d_min = 37.000000 #2
Runtime notice: ScalarField::getValue('{ state: { word: nobody number: 0 } action: { word: albery number: 20 } time: 0 }', K_max: -1 d_max: 276.310211 < diameter: 7.000000 save: 0 size: 2 >= count: 2
Runtime notice: 	 ('{ word: mapy number: 15 }' -> -1.000000, '{ word: mama number: 10 }' -> 1.000000) => '{ word: mapy number: 15 }' -> -1.000000, d_min12 = 7.000000 d_min = 37.000000 #2
Runtime notice: ScalarField::getValue('{ state: { word: nobody number: 0 } action: { word: albert number: 20 } time: 0 }', K_max: -1 d_max: 276.310211 < diameter: 7.000000 save: 0 size: 2 >= count: 2
Runtime notice: 	 ('{ word: mapy number: 15 }' -> -1.000000, '{ word: mama number: 10 }' -> 1.000000) => '{ word: mapy number: 15 }' -> -1.000000, d_min12 = 7.000000 d_min = 37.000000 #2
Runtime notice: ScalarField::getValue('{ state: { word: nobody number: 0 } action: { word: albert number: 21 } time: 0 }', K_max: -1 d_max: 276.310211 < diameter: 7.000000 save: 0 size: 2 >= count: 2
Runtime notice: 	 ('{ word: mapy number: 15 }' -> -1.000000, '{ word: mama number: 10 }' -> 1.000000) => '{ word: mapy number: 15 }' -> -1.000000, d_min12 = 7.000000 d_min = 38.000000 #2
Runtime notice: ScalarField::getValue('{ state: { word: nobody number: 0 } action: { word: albert number: 22 } time: 0 }', K_max: -1 d_max: 276.310211 < diameter: 7.000000 save: 0 size: 2 >= count: 2
Runtime notice: 	 ('{ word: mapy number: 15 }' -> -1.000000, '{ word: mama number: 10 }' -> 1.000000) => '{ word: mapy number: 15 }' -> -1.000000, d_min12 = 7.000000 d_min = 39.000000 #2
Runtime notice: ScalarField::getValue('{ state: { word: nobody number: 0 } action: { word: albert number: 23 } time: 0 }', K_max: -1 d_max: 276.310211 < diameter: 7.000000 save: 0 size: 2 >= count: 2
Runtime notice: 	 ('{ word: mapy number: 15 }' -> -1.000000, '{ word: mama number: 10 }' -> 1.000000) => '{ word: mapy number: 15 }' -> -1.000000, d_min12 = 7.000000 d_min = 40.000000 #2
Runtime notice: ScalarField::getValue('{ state: { word: nobody number: 0 } action: { word: albert number: 24 } time: 0 }', K_max: -1 d_max: 276.310211 < diameter: 7.000000 save: 0 size: 2 >= count: 2
Runtime notice: 	 ('{ word: mapy number: 15 }' -> -1.000000, '{ word: mama number: 10 }' -> 1.000000) => '{ word: mapy number: 15 }' -> -1.000000, d_min12 = 7.000000 d_min = 41.000000 #2
Runtime notice: ScalarField::getValue('{ state: { word: nobody number: 0 } action: { word: albert number: 25 } time: 0 }', K_max: -1 d_max: 276.310211 < diameter: 7.000000 save: 0 size: 2 >= count: 2
Runtime notice: 	 ('{ word: mapy number: 15 }' -> -1.000000, '{ word: mama number: 10 }' -> 1.000000) => '{ word: mapy number: 15 }' -> -1.000000, d_min12 = 7.000000 d_min = 42.000000 #2
Runtime notice: ScalarField::getValue('{ state: { word: nobody number: 0 } action: { word: albert number: 26 } time: 0 }', K_max: -1 d_max: 276.310211 < diameter: 7.000000 save: 0 size: 2 >= count: 2
Runtime notice: 	 ('{ word: mapy number: 15 }' -> -1.000000, '{ word: mama number: 10 }' -> 1.000000) => '{ word: mapy number: 15 }' -> -1.000000, d_min12 = 7.000000 d_min = 43.000000 #2
Runtime notice: ScalarField::getValue('{ state: { word: nobody number: 0 } action: { word: albert number: 27 } time: 0 }', K_max: -1 d_max: 276.310211 < diameter: 7.000000 save: 0 size: 2 >= count: 2
Runtime notice: 	 ('{ word: mapy number: 15 }' -> -1.000000, '{ word: mama number: 10 }' -> 1.000000) => '{ word: mapy number: 15 }' -> -1.000000, d_min12 = 7.000000 d_min = 44.000000 #2
Runtime notice: ScalarField::getValue('{ state: { word: nobody number: 0 } action: { word: albert number: 28 } time: 0 }', K_max: -1 d_max: 276.310211 < diameter: 7.000000 save: 0 size: 2 >= count: 2
Runtime notice: 	 ('{ word: mapy number: 15 }' -> -1.000000, '{ word: mama number: 10 }' -> 1.000000) => '{ word: mapy number: 15 }' -> -1.000000, d_min12 = 7.000000 d_min = 45.000000 #2
Runtime notice: ScalarField::getValue('{ state: { word: nobody number: 0 } action: { word: albert number: 29 } time: 0 }', K_max: -1 d_max: 276.310211 < diameter: 7.000000 save: 0 size: 2 >= count: 2
Runtime notice: 	 ('{ word: mapy number: 15 }' -> -1.000000, '{ word: mama number: 10 }' -> 1.000000) => '{ word: mapy number: 15 }' -> -1.000000, d_min12 = 7.000000 d_min = 46.000000 #2
Runtime notice: ScalarField::getValue('{ state: { word: nobody number: 0 } action: { word: albert number: 30 } time: 0 }', K_max: -1 d_max: 276.310211 < diameter: 7.000000 save: 0 size: 2 >= count: 2
Runtime notice: 	 ('{ word: mapy number: 15 }' -> -1.000000, '{ word: mama number: 10 }' -> 1.000000) => '{ word: mapy number: 15 }' -> -1.000000, d_min12 = 7.000000 d_min = 47.000000 #2
Runtime notice: ScalarField::getValue('{ state: { word: nobody number: 0 } action: { word: albert number: 31 } time: 0 }', K_max: -1 d_max: 276.310211 < diameter: 7.000000 save: 0 size: 2 >= count: 2
Runtime notice: 	 ('{ word: mapy number: 15 }' -> -1.000000, '{ word: mama number: 10 }' -> 1.000000) => '{ word: mapy number: 15 }' -> -1.000000, d_min12 = 7.000000 d_min = 48.000000 #2
Runtime notice: ScalarField::getValue('{ state: { word: nobody number: 0 } action: { word: albert number: 32 } time: 0 }', K_max: -1 d_max: 276.310211 < diameter: 7.000000 save: 0 size: 2 >= count: 2
Runtime notice: 	 ('{ word: mapy number: 15 }' -> -1.000000, '{ word: mama number: 10 }' -> 1.000000) => '{ word: mapy number: 15 }' -> -1.000000, d_min12 = 7.000000 d_min = 49.000000 #2
Runtime notice: ScalarField::getValue('{ state: { word: nobody number: 0 } action: { word: mpapy number: 20 } time: 0 }', K_max: -1 d_max: 276.310211 < diameter: 7.000000 save: 0 size: 2 >= count: 2
Runtime notice: 	 ('{ word: mapy number: 15 }' -> -1.000000, '{ word: mama number: 10 }' -> 1.000000) => '{ word: mapy number: 15 }' -> -1.000000, d_min12 = 7.000000 d_min = 36.000000 #2
Runtime notice: ScalarField::getValue('{ state: { word: nobody number: 0 } action: { word: mapapy number: 20 } time: 0 }', K_max: -1 d_max: 276.310211 < diameter: 7.000000 save: 0 size: 2 >= count: 2
Runtime notice: 	 ('{ word: mapy number: 15 }' -> -1.000000, '{ word: mama number: 10 }' -> 1.000000) => '{ word: mapy number: 15 }' -> -1.000000, d_min12 = 7.000000 d_min = 37.000000 #2
Runtime notice: ScalarField::getValue('{ state: { word: nobody number: 0 } action: { word: marpapy number: 20 } time: 0 }', K_max: -1 d_max: 276.310211 < diameter: 7.000000 save: 0 size: 2 >= count: 2
Runtime notice: 	 ('{ word: mapy number: 15 }' -> -1.000000, '{ word: mama number: 10 }' -> 1.000000) => '{ word: mapy number: 15 }' -> -1.000000, d_min12 = 7.000000 d_min = 38.000000 #2
Runtime notice: ScalarField::getValue('{ state: { word: nobody number: 0 } action: { word: martpapy number: 20 } time: 0 }', K_max: -1 d_max: 276.310211 < diameter: 7.000000 save: 0 size: 2 >= count: 2
Runtime notice: 	 ('{ word: mapy number: 15 }' -> -1.000000, '{ word: mama number: 10 }' -> 1.000000) => '{ word: mapy number: 15 }' -> -1.000000, d_min12 = 7.000000 d_min = 39.000000 #2
Runtime notice: ScalarField::getValue('{ state: { word: nobody number: 0 } action: { word: martipapy number: 20 } time: 0 }', K_max: -1 d_max: 276.310211 < diameter: 7.000000 save: 0 size: 2 >= count: 2
Runtime notice: 	 ('{ word: mapy number: 15 }' -> -1.000000, '{ word: mama number: 10 }' -> 1.000000) => '{ word: mapy number: 15 }' -> -1.000000, d_min12 = 7.000000 d_min = 40.000000 #2
Runtime notice: ScalarField::getValue('{ state: { word: nobody number: 0 } action: { word: martinapy number: 20 } time: 0 }', K_max: -1 d_max: 276.310211 < diameter: 7.000000 save: 0 size: 2 >= count: 2
Runtime notice: 	 ('{ word: mapy number: 15 }' -> -1.000000, '{ word: mama number: 10 }' -> 1.000000) => '{ word: mapy number: 15 }' -> -1.000000, d_min12 = 7.000000 d_min = 40.000000 #2
Runtime notice: ScalarField::getValue('{ state: { word: nobody number: 0 } action: { word: martinaly number: 20 } time: 0 }', K_max: -1 d_max: 276.310211 < diameter: 7.000000 save: 0 size: 2 >= count: 2
Runtime notice: 	 ('{ word: mapy number: 15 }' -> -1.000000, '{ word: mama number: 10 }' -> 1.000000) => '{ word: mapy number: 15 }' -> -1.000000, d_min12 = 7.000000 d_min = 40.000000 #2
Runtime notice: ScalarField::getValue('{ state: { word: nobody number: 0 } action: { word: martinale number: 20 } time: 0 }', K_max: -1 d_max: 276.310211 < diameter: 7.000000 save: 0 size: 2 >= count: 2
Runtime notice: 	 ('{ word: mapy number: 15 }' -> -1.000000, '{ word: mama number: 10 }' -> 1.000000) => '{ word: mapy number: 15 }' -> -1.000000, d_min12 = 7.000000 d_min = 40.000000 #2
Runtime notice: ScalarField::getValue('{ state: { word: nobody number: 0 } action: { word: martinale number: 21 } time: 0 }', K_max: -1 d_max: 276.310211 < diameter: 7.000000 save: 0 size: 2 >= count: 2
Runtime notice: 	 ('{ word: mapy number: 15 }' -> -1.000000, '{ word: mama number: 10 }' -> 1.000000) => '{ word: mapy number: 15 }' -> -1.000000, d_min12 = 7.000000 d_min = 41.000000 #2
Runtime notice: ScalarField::getValue('{ state: { word: nobody number: 0 } action: { word: martinale number: 22 } time: 0 }', K_max: -1 d_max: 276.310211 < diameter: 7.000000 save: 0 size: 2 >= count: 2
Runtime notice: 	 ('{ word: mapy number: 15 }' -> -1.000000, '{ word: mama number: 10 }' -> 1.000000) => '{ word: mapy number: 15 }' -> -1.000000, d_min12 = 7.000000 d_min = 42.000000 #2
Runtime notice: ScalarField::getValue('{ state: { word: nobody number: 0 } action: { word: martinale number: 23 } time: 0 }', K_max: -1 d_max: 276.310211 < diameter: 7.000000 save: 0 size: 2 >= count: 2
Runtime notice: 	 ('{ word: mapy number: 15 }' -> -1.000000, '{ word: mama number: 10 }' -> 1.000000) => '{ word: mapy number: 15 }' -> -1.000000, d_min12 = 7.000000 d_min = 43.000000 #2
Runtime notice: ScalarField::getValue('{ state: { word: nobody number: 0 } action: { word: martinale number: 24 } time: 0 }', K_max: -1 d_max: 276.310211 < diameter: 7.000000 save: 0 size: 2 >= count: 2
Runtime notice: 	 ('{ word: mapy number: 15 }' -> -1.000000, '{ word: mama number: 10 }' -> 1.000000) => '{ word: mapy number: 15 }' -> -1.000000, d_min12 = 7.000000 d_min = 44.000000 #2
Runtime notice: ScalarField::getValue('{ state: { word: nobody number: 0 } action: { word: martinale number: 25 } time: 0 }', K_max: -1 d_max: 276.310211 < diameter: 7.000000 save: 0 size: 2 >= count: 2
Runtime notice: 	 ('{ word: mapy number: 15 }' -> -1.000000, '{ word: mama number: 10 }' -> 1.000000) => '{ word: mapy number: 15 }' -> -1.000000, d_min12 = 7.000000 d_min = 45.000000 #2
Runtime notice: ScalarField::getValue('{ state: { word: nobody number: 0 } action: { word: martinale number: 26 } time: 0 }', K_max: -1 d_max: 276.310211 < diameter: 7.000000 save: 0 size: 2 >= count: 2
Runtime notice: 	 ('{ word: mapy number: 15 }' -> -1.000000, '{ word: mama number: 10 }' -> 1.000000) => '{ word: mapy number: 15 }' -> -1.000000, d_min12 = 7.000000 d_min = 46.000000 #2
Runtime notice: ScalarField::getValue('{ state: { word: nobody number: 0 } action: { word: martinale number: 27 } time: 0 }', K_max: -1 d_max: 276.310211 < diameter: 7.000000 save: 0 size: 2 >= count: 2
Runtime notice: 	 ('{ word: mapy number: 15 }' -> -1.000000, '{ word: mama number: 10 }' -> 1.000000) => '{ word: mapy number: 15 }' -> -1.000000, d_min12 = 7.000000 d_min = 47.000000 #2
Runtime notice: ScalarField::getValue('{ state: { word: nobody number: 0 } action: { word: martinale number: 28 } time: 0 }', K_max: -1 d_max: 276.310211 < diameter: 7.000000 save: 0 size: 2 >= count: 2
Runtime notice: 	 ('{ word: mapy number: 15 }' -> -1.000000, '{ word: mama number: 10 }' -> 1.000000) => '{ word: mapy number: 15 }' -> -1.000000, d_min12 = 7.000000 d_min = 48.000000 #2
Runtime notice: ScalarField::getValue('{ state: { word: nobody number: 0 } action: { word: martinale number: 29 } time: 0 }', K_max: -1 d_max: 276.310211 < diameter: 7.000000 save: 0 size: 2 >= count: 2
Runtime notice: 	 ('{ word: mapy number: 15 }' -> -1.000000, '{ word: mama number: 10 }' -> 1.000000) => '{ word: mapy number: 15 }' -> -1.000000, d_min12 = 7.000000 d_min = 49.000000 #2
Runtime notice: ScalarField::getValue('{ state: { word: nobody number: 0 } action: { word: martinale number: 30 } time: 0 }', K_max: -1 d_max: 276.310211 < diameter: 7.000000 save: 0 size: 2 >= count: 2
Runtime notice: 	 ('{ word: mapy number: 15 }' -> -1.000000, '{ word: mama number: 10 }' -> 1.000000) => '{ word: mapy number: 15 }' -> -1.000000, d_min12 = 7.000000 d_min = 50.000000 #2
Runtime notice: ScalarField::getValue('{ state: { word: nobody number: 0 } action: { word: martinale number: 31 } time: 0 }', K_max: -1 d_max: 276.310211 < diameter: 7.000000 save: 0 size: 2 >= count: 2
Runtime notice: 	 ('{ word: mapy number: 15 }' -> -1.000000, '{ word: mama number: 10 }' -> 1.000000) => '{ word: mapy number: 15 }' -> -1.000000, d_min12 = 7.000000 d_min = 51.000000 #2
Runtime notice: ScalarField::getValue('{ state: { word: nobody number: 0 } action: { word: martinale number: 32 } time: 0 }', K_max: -1 d_max: 276.310211 < diameter: 7.000000 save: 0 size: 2 >= count: 2
Runtime notice: 	 ('{ word: mapy number: 15 }' -> -1.000000, '{ word: mama number: 10 }' -> 1.000000) => '{ word: mapy number: 15 }' -> -1.000000, d_min12 = 7.000000 d_min = 52.000000 #2
Runtime notice: 	 best_result: { state: { word: nobody number: 0 } action: { word: zpapy number: 20 } time: 0 reward: -1 }
Runtime notice: 	 expl_result: { state: { word: nobody number: 0 } action: { word: zpapy number: 20 } time: 0 reward: -1 }
Runtime notice: 	 best_expected_reward: -1.000000 current_result: 0.000000 => exploration
Runtime notice: doAction('{ state: { word: zpapy number: 20 } action: { word: zpapy number: 20 } time: 0 reward: -0.100000 }')
Runtime notice: t= 1 ------------------------------
Runtime notice: doNext(current: '{ state: { word: zpapy number: 20 } action: { word: zpapy number: 20 } time: 0 reward: -0.100000 }')
