Runtime notice: t= 1 ------------------------------
Runtime notice: > getNext(current='{ word: papy number: 20 }')
Runtime notice: 	> d/w(current, goal='{ word: mama number: 10 }') = 13.000000 d/w(current, obstacle='{ word: mamy number: 20 }') = 2.000000
Runtime notice: 	> Goal directing
Runtime notice: 		 but d(current='{ word: mapy number: 20 }', obstacle): 1.000000 <= step: 1.000000
Runtime notice: 	> Obstacle avoidance
Runtime notice: >> Next : '{ word: zmapy number: 20 }' V = 1.000000 / (d(next, goal) = 13.000000) + -2.000000 / (d(next, obstacle) = 2.000000) d(next, current) = 1.000000 nu_next = 1.000000 among 18 extrapolations in B('{ word: mapy number: 20 }', 3.000000 >= 3.000000)
Runtime notice: t= 2 ------------------------------
Runtime notice: > getNext(current='{ word: zmapy number: 20 }')
Runtime notice: 	> d/w(current, goal='{ word: mama number: 10 }') = 13.000000 d/w(current, obstacle='{ word: mamy number: 20 }') = 1.000000
Runtime notice: 	> Goal directing
Runtime notice: 		 but d(current='{ word: mapy number: 20 }', obstacle): 1.000000 <= step: 1.000000
Runtime notice: 	> Obstacle avoidance
Runtime notice: >> Next : '{ word: martapy number: 20 }' V = 1.000000 / (d(next, goal) = 14.000000) + -4.000000 / (d(next, obstacle) = 4.000000) d(next, current) = 3.000000 nu_next = 3.000000 among 18 extrapolations in B('{ word: mapy number: 20 }', 3.000000 >= 3.000000)
Runtime notice: t= 3 ------------------------------
Runtime notice: > getNext(current='{ word: martapy number: 20 }')
Runtime notice: 	> d/w(current, goal='{ word: mama number: 10 }') = 14.000000 d/w(current, obstacle='{ word: mamy number: 20 }') = 1.000000
Runtime notice: 	> Goal directing
Runtime notice: t= 4 ------------------------------
Runtime notice: > getNext(current='{ word: matapy number: 20 }')
Runtime notice: 	> d/w(current, goal='{ word: mama number: 10 }') = 13.000000 d/w(current, obstacle='{ word: mamy number: 20 }') = 0.750000
Runtime notice: 	> Goal directing
Runtime notice: t= 5 ------------------------------
Runtime notice: > getNext(current='{ word: mamapy number: 20 }')
Runtime notice: 	> d/w(current, goal='{ word: mama number: 10 }') = 12.000000 d/w(current, obstacle='{ word: mamy number: 20 }') = 0.500000
Runtime notice: 	> Goal directing
Runtime notice: 		 but d(current='{ word: mamay number: 20 }', obstacle): 1.000000 <= step: 1.000000
Runtime notice: 	> Obstacle avoidance
Runtime notice: >> Next : '{ word: zizay number: 20 }' V = 1.000000 / (d(next, goal) = 14.000000) + -8.000000 / (d(next, obstacle) = 4.000000) d(next, current) = 3.000000 nu_next = 3.000000 among 18 extrapolations in B('{ word: mamay number: 20 }', 3.000000 >= 3.000000)
Runtime notice: t= 6 ------------------------------
Runtime notice: > getNext(current='{ word: zizay number: 20 }')
Runtime notice: 	> d/w(current, goal='{ word: mama number: 10 }') = 14.000000 d/w(current, obstacle='{ word: mamy number: 20 }') = 0.500000
Runtime notice: 	> Goal directing
Runtime notice: t= 7 ------------------------------
Runtime notice: > getNext(current='{ word: mizay number: 20 }')
Runtime notice: 	> d/w(current, goal='{ word: mama number: 10 }') = 13.000000 d/w(current, obstacle='{ word: mamy number: 20 }') = 0.375000
Runtime notice: 	> Goal directing
Runtime notice: t= 8 ------------------------------
Runtime notice: > getNext(current='{ word: mazay number: 20 }')
Runtime notice: 	> d/w(current, goal='{ word: mama number: 10 }') = 12.000000 d/w(current, obstacle='{ word: mamy number: 20 }') = 0.250000
Runtime notice: 	> Goal directing
Runtime notice: 		 but d(current='{ word: mamay number: 20 }', obstacle): 1.000000 <= step: 1.000000
Runtime notice: 	> Obstacle avoidance
Runtime notice: >> Next : '{ word: albmay number: 20 }' V = 1.000000 / (d(next, goal) = 14.000000) + -16.000000 / (d(next, obstacle) = 4.000000) d(next, current) = 3.000000 nu_next = 3.000000 among 18 extrapolations in B('{ word: mamay number: 20 }', 3.000000 >= 3.000000)
Runtime notice: t= 9 ------------------------------
Runtime notice: > getNext(current='{ word: albmay number: 20 }')
Runtime notice: 	> d/w(current, goal='{ word: mama number: 10 }') = 14.000000 d/w(current, obstacle='{ word: mamy number: 20 }') = 0.250000
Runtime notice: 	> Goal directing
Runtime notice: t=10 ------------------------------
Runtime notice: > getNext(current='{ word: lbmay number: 20 }')
Runtime notice: 	> d/w(current, goal='{ word: mama number: 10 }') = 13.000000 d/w(current, obstacle='{ word: mamy number: 20 }') = 0.187500
Runtime notice: 	> Goal directing
Runtime notice: t=11 ------------------------------
Runtime notice: > getNext(current='{ word: mbmay number: 20 }')
Runtime notice: 	> d/w(current, goal='{ word: mama number: 10 }') = 12.000000 d/w(current, obstacle='{ word: mamy number: 20 }') = 0.125000
Runtime notice: 	> Goal directing
Runtime notice: 		 but d(current='{ word: mamay number: 20 }', obstacle): 1.000000 <= step: 1.000000
Runtime notice: 	> Obstacle avoidance
Runtime notice: >> Next : '{ word: martimay number: 20 }' V = 1.000000 / (d(next, goal) = 14.000000) + -32.000000 / (d(next, obstacle) = 4.000000) d(next, current) = 3.000000 nu_next = 3.000000 among 18 extrapolations in B('{ word: mamay number: 20 }', 3.000000 >= 3.000000)
Runtime notice: t=12 ------------------------------
Runtime notice: > getNext(current='{ word: martimay number: 20 }')
Runtime notice: 	> d/w(current, goal='{ word: mama number: 10 }') = 14.000000 d/w(current, obstacle='{ word: mamy number: 20 }') = 0.125000
Runtime notice: 	> Goal directing
Runtime notice: t=13 ------------------------------
Runtime notice: > getNext(current='{ word: matimay number: 20 }')
Runtime notice: 	> d/w(current, goal='{ word: mama number: 10 }') = 13.000000 d/w(current, obstacle='{ word: mamy number: 20 }') = 0.093750
Runtime notice: 	> Goal directing
Runtime notice: t=14 ------------------------------
Runtime notice: > getNext(current='{ word: maimay number: 20 }')
Runtime notice: 	> d/w(current, goal='{ word: mama number: 10 }') = 12.000000 d/w(current, obstacle='{ word: mamy number: 20 }') = 0.062500
Runtime notice: 	> Goal directing
Runtime notice: 		 but d(current='{ word: mamay number: 20 }', obstacle): 1.000000 <= step: 1.000000
Runtime notice: 	> Obstacle avoidance
Runtime notice: >> Next : '{ word: zimay number: 20 }' V = 1.000000 / (d(next, goal) = 13.000000) + -64.000000 / (d(next, obstacle) = 3.000000) d(next, current) = 2.000000 nu_next = 2.000000 among 18 extrapolations in B('{ word: mamay number: 20 }', 3.000000 >= 3.000000)
Runtime notice: t=15 ------------------------------
Runtime notice: > getNext(current='{ word: zimay number: 20 }')
Runtime notice: 	> d/w(current, goal='{ word: mama number: 10 }') = 13.000000 d/w(current, obstacle='{ word: mamy number: 20 }') = 0.046875
Runtime notice: 	> Goal directing
Runtime notice: t=16 ------------------------------
Runtime notice: > getNext(current='{ word: mimay number: 20 }')
Runtime notice: 	> d/w(current, goal='{ word: mama number: 10 }') = 12.000000 d/w(current, obstacle='{ word: mamy number: 20 }') = 0.031250
Runtime notice: 	> Goal directing
Runtime notice: 		 but d(current='{ word: mamay number: 20 }', obstacle): 1.000000 <= step: 1.000000
Runtime notice: 	> Obstacle avoidance
Runtime notice: >> Next : '{ word: alamay number: 20 }' V = 1.000000 / (d(next, goal) = 13.000000) + -128.000000 / (d(next, obstacle) = 3.000000) d(next, current) = 2.000000 nu_next = 2.000000 among 18 extrapolations in B('{ word: mamay number: 20 }', 3.000000 >= 3.000000)
Runtime notice: t=17 ------------------------------
Runtime notice: > getNext(current='{ word: alamay number: 20 }')
Runtime notice: 	> d/w(current, goal='{ word: mama number: 10 }') = 13.000000 d/w(current, obstacle='{ word: mamy number: 20 }') = 0.023438
Runtime notice: 	> Goal directing
Runtime notice: t=18 ------------------------------
Runtime notice: > getNext(current='{ word: lamay number: 20 }')
Runtime notice: 	> d/w(current, goal='{ word: mama number: 10 }') = 12.000000 d/w(current, obstacle='{ word: mamy number: 20 }') = 0.015625
Runtime notice: 	> Goal directing
Runtime notice: 		 but d(current='{ word: mamay number: 20 }', obstacle): 1.000000 <= step: 1.000000
Runtime notice: 	> Obstacle avoidance
Runtime notice: >> Next : '{ word: martmay number: 20 }' V = 1.000000 / (d(next, goal) = 13.000000) + -256.000000 / (d(next, obstacle) = 3.000000) d(next, current) = 2.000000 nu_next = 2.000000 among 18 extrapolations in B('{ word: mamay number: 20 }', 3.000000 >= 3.000000)
Runtime notice: t=19 ------------------------------
Runtime notice: > getNext(current='{ word: martmay number: 20 }')
Runtime notice: 	> d/w(current, goal='{ word: mama number: 10 }') = 13.000000 d/w(current, obstacle='{ word: mamy number: 20 }') = 0.011719
Runtime notice: 	> Goal directing
Runtime notice: t=20 ------------------------------
Runtime notice: > getNext(current='{ word: matmay number: 20 }')
Runtime notice: 	> d/w(current, goal='{ word: mama number: 10 }') = 12.000000 d/w(current, obstacle='{ word: mamy number: 20 }') = 0.007812
Runtime notice: 	> Goal directing
Runtime notice: 		 but d(current='{ word: mamay number: 20 }', obstacle): 1.000000 <= step: 1.000000
Runtime notice: 	> Obstacle avoidance
Runtime notice: >> Next : '{ word: zamay number: 20 }' V = 1.000000 / (d(next, goal) = 12.000000) + -512.000000 / (d(next, obstacle) = 2.000000) d(next, current) = 1.000000 nu_next = 1.000000 among 18 extrapolations in B('{ word: mamay number: 20 }', 3.000000 >= 3.000000)
Runtime notice: t=21 ------------------------------
Runtime notice: > getNext(current='{ word: zamay number: 20 }')
Runtime notice: 	> d/w(current, goal='{ word: mama number: 10 }') = 12.000000 d/w(current, obstacle='{ word: mamy number: 20 }') = 0.003906
Runtime notice: 	> Goal directing
Runtime notice: 		 but d(current='{ word: mamay number: 20 }', obstacle): 1.000000 <= step: 1.000000
Runtime notice: 	> Obstacle avoidance
Runtime notice: >> Next : '{ word: amamay number: 20 }' V = 1.000000 / (d(next, goal) = 12.000000) + -1024.000000 / (d(next, obstacle) = 2.000000) d(next, current) = 1.000000 nu_next = 1.000000 among 18 extrapolations in B('{ word: mamay number: 20 }', 3.000000 >= 3.000000)
Runtime notice: t=22 ------------------------------
Runtime notice: > getNext(current='{ word: amamay number: 20 }')
Runtime notice: 	> d/w(current, goal='{ word: mama number: 10 }') = 12.000000 d/w(current, obstacle='{ word: mamy number: 20 }') = 0.001953
Runtime notice: 	> Goal directing
Runtime notice: 		 but d(current='{ word: mamay number: 20 }', obstacle): 1.000000 <= step: 1.000000
Runtime notice: 	> Obstacle avoidance
Runtime notice: >> Next : '{ word: marmay number: 20 }' V = 1.000000 / (d(next, goal) = 12.000000) + -2048.000000 / (d(next, obstacle) = 2.000000) d(next, current) = 1.000000 nu_next = 1.000000 among 18 extrapolations in B('{ word: mamay number: 20 }', 3.000000 >= 3.000000)
Runtime notice: t=23 ------------------------------
Runtime notice: > getNext(current='{ word: marmay number: 20 }')
Runtime notice: 	> d/w(current, goal='{ word: mama number: 10 }') = 12.000000 d/w(current, obstacle='{ word: mamy number: 20 }') = 0.000977
Runtime notice: 	> Goal directing
Runtime notice: 		 but d(current='{ word: mamay number: 20 }', obstacle): 1.000000 <= step: 1.000000
Runtime notice: 	> Obstacle avoidance
Runtime notice: >> Next : '{ word: albeay number: 20 }' V = 1.000000 / (d(next, goal) = 15.000000) + -4096.000000 / (d(next, obstacle) = 5.000000) d(next, current) = 4.000000 nu_next = 4.000000 among 24 extrapolations in B('{ word: mamay number: 20 }', 4.242641 >= 3.000000)
Runtime notice: t=24 ------------------------------
Runtime notice: > getNext(current='{ word: albeay number: 20 }')
Runtime notice: 	> d/w(current, goal='{ word: mama number: 10 }') = 15.000000 d/w(current, obstacle='{ word: mamy number: 20 }') = 0.001221
Runtime notice: 	> Goal directing
Runtime notice: t=25 ------------------------------
Runtime notice: > getNext(current='{ word: lbeay number: 20 }')
Runtime notice: 	> d/w(current, goal='{ word: mama number: 10 }') = 14.000000 d/w(current, obstacle='{ word: mamy number: 20 }') = 0.000977
Runtime notice: 	> Goal directing
Runtime notice: t=26 ------------------------------
Runtime notice: > getNext(current='{ word: mbeay number: 20 }')
Runtime notice: 	> d/w(current, goal='{ word: mama number: 10 }') = 13.000000 d/w(current, obstacle='{ word: mamy number: 20 }') = 0.000732
Runtime notice: 	> Goal directing
Runtime notice: t=27 ------------------------------
Runtime notice: > getNext(current='{ word: maeay number: 20 }')
Runtime notice: 	> d/w(current, goal='{ word: mama number: 10 }') = 12.000000 d/w(current, obstacle='{ word: mamy number: 20 }') = 0.000488
Runtime notice: 	> Goal directing
Runtime notice: 		 but d(current='{ word: mamay number: 20 }', obstacle): 1.000000 <= step: 1.000000
Runtime notice: 	> Obstacle avoidance
Runtime notice: >> Next : '{ word: martinay number: 20 }' V = 1.000000 / (d(next, goal) = 15.000000) + -8192.000000 / (d(next, obstacle) = 5.000000) d(next, current) = 4.000000 nu_next = 4.000000 among 24 extrapolations in B('{ word: mamay number: 20 }', 4.242641 >= 3.000000)
Runtime notice: t=28 ------------------------------
Runtime notice: > getNext(current='{ word: martinay number: 20 }')
Runtime notice: 	> d/w(current, goal='{ word: mama number: 10 }') = 15.000000 d/w(current, obstacle='{ word: mamy number: 20 }') = 0.000610
Runtime notice: 	> Goal directing
Runtime notice: t=29 ------------------------------
Runtime notice: > getNext(current='{ word: matinay number: 20 }')
Runtime notice: 	> d/w(current, goal='{ word: mama number: 10 }') = 14.000000 d/w(current, obstacle='{ word: mamy number: 20 }') = 0.000488
Runtime notice: 	> Goal directing
Runtime notice: t=30 ------------------------------
Runtime notice: > getNext(current='{ word: mainay number: 20 }')
Runtime notice: 	> d/w(current, goal='{ word: mama number: 10 }') = 13.000000 d/w(current, obstacle='{ word: mamy number: 20 }') = 0.000366
Runtime notice: 	> Goal directing
Runtime notice: t=31 ------------------------------
Runtime notice: > getNext(current='{ word: manay number: 20 }')
Runtime notice: 	> d/w(current, goal='{ word: mama number: 10 }') = 12.000000 d/w(current, obstacle='{ word: mamy number: 20 }') = 0.000244
Runtime notice: 	> Goal directing
Runtime notice: 		 but d(current='{ word: mamay number: 20 }', obstacle): 1.000000 <= step: 1.000000
Runtime notice: 	> Obstacle avoidance
Runtime notice: >> Next : '{ word: zizoy number: 20 }' V = 1.000000 / (d(next, goal) = 15.000000) + -16384.000000 / (d(next, obstacle) = 4.000000) d(next, current) = 4.000000 nu_next = 4.000000 among 24 extrapolations in B('{ word: mamay number: 20 }', 4.242641 >= 3.000000)
Runtime notice: t=32 ------------------------------
Runtime notice: > getNext(current='{ word: zizoy number: 20 }')
Runtime notice: 	> d/w(current, goal='{ word: mama number: 10 }') = 15.000000 d/w(current, obstacle='{ word: mamy number: 20 }') = 0.000244
Runtime notice: 	> Goal directing
Runtime notice: t=33 ------------------------------
Runtime notice: > getNext(current='{ word: izoy number: 20 }')
Runtime notice: 	> d/w(current, goal='{ word: mama number: 10 }') = 14.000000 d/w(current, obstacle='{ word: mamy number: 20 }') = 0.000183
Runtime notice: 	> Goal directing
Runtime notice: t=34 ------------------------------
Runtime notice: > getNext(current='{ word: mzoy number: 20 }')
Runtime notice: 	> d/w(current, goal='{ word: mama number: 10 }') = 13.000000 d/w(current, obstacle='{ word: mamy number: 20 }') = 0.000122
Runtime notice: 	> Goal directing
Runtime notice: 		 but d(current='{ word: maoy number: 20 }', obstacle): 1.000000 <= step: 1.000000
Runtime notice: 	> Obstacle avoidance
Runtime notice: >> Next : '{ word: martaoy number: 20 }' V = 1.000000 / (d(next, goal) = 14.000000) + -32768.000000 / (d(next, obstacle) = 4.000000) d(next, current) = 3.000000 nu_next = 3.000000 among 18 extrapolations in B('{ word: maoy number: 20 }', 3.000000 >= 3.000000)
Runtime notice: t=35 ------------------------------
Runtime notice: > getNext(current='{ word: martaoy number: 20 }')
Runtime notice: 	> d/w(current, goal='{ word: mama number: 10 }') = 14.000000 d/w(current, obstacle='{ word: mamy number: 20 }') = 0.000122
Runtime notice: 	> Goal directing
Runtime notice: t=36 ------------------------------
Runtime notice: > getNext(current='{ word: mataoy number: 20 }')
Runtime notice: 	> d/w(current, goal='{ word: mama number: 10 }') = 13.000000 d/w(current, obstacle='{ word: mamy number: 20 }') = 0.000092
Runtime notice: 	> Goal directing
Runtime notice: t=37 ------------------------------
Runtime notice: > getNext(current='{ word: mamaoy number: 20 }')
Runtime notice: 	> d/w(current, goal='{ word: mama number: 10 }') = 12.000000 d/w(current, obstacle='{ word: mamy number: 20 }') = 0.000061
Runtime notice: 	> Goal directing
Runtime notice: 		 but d(current='{ word: mamay number: 20 }', obstacle): 1.000000 <= step: 1.000000
Runtime notice: 	> Obstacle avoidance
Runtime notice: >> Next : '{ word: martinale number: 20 }' V = 1.000000 / (d(next, goal) = 16.000000) + -65536.000000 / (d(next, obstacle) = 7.000000) d(next, current) = 6.000000 nu_next = 6.000000 among 36 extrapolations in B('{ word: mamay number: 20 }', 6.000000 >= 3.000000)
Runtime notice: t=38 ------------------------------
Runtime notice: > getNext(current='{ word: martinale number: 20 }')
Runtime notice: 	> d/w(current, goal='{ word: mama number: 10 }') = 16.000000 d/w(current, obstacle='{ word: mamy number: 20 }') = 0.000107
Runtime notice: 	> Goal directing
Runtime notice: t=39 ------------------------------
Runtime notice: > getNext(current='{ word: matinale number: 20 }')
Runtime notice: 	> d/w(current, goal='{ word: mama number: 10 }') = 15.000000 d/w(current, obstacle='{ word: mamy number: 20 }') = 0.000092
Runtime notice: 	> Goal directing
Runtime notice: t=40 ------------------------------
Runtime notice: > getNext(current='{ word: mainale number: 20 }')
Runtime notice: 	> d/w(current, goal='{ word: mama number: 10 }') = 14.000000 d/w(current, obstacle='{ word: mamy number: 20 }') = 0.000076
Runtime notice: 	> Goal directing
Runtime notice: t=41 ------------------------------
Runtime notice: > getNext(current='{ word: manale number: 20 }')
Runtime notice: 	> d/w(current, goal='{ word: mama number: 10 }') = 13.000000 d/w(current, obstacle='{ word: mamy number: 20 }') = 0.000061
Runtime notice: 	> Goal directing
Runtime notice: t=42 ------------------------------
Runtime notice: > getNext(current='{ word: mamale number: 20 }')
Runtime notice: 	> d/w(current, goal='{ word: mama number: 10 }') = 12.000000 d/w(current, obstacle='{ word: mamy number: 20 }') = 0.000046
Runtime notice: 	> Goal directing
Runtime notice: t=43 ------------------------------
Runtime notice: > getNext(current='{ word: mamae number: 20 }')
Runtime notice: 	> d/w(current, goal='{ word: mama number: 10 }') = 11.000000 d/w(current, obstacle='{ word: mamy number: 20 }') = 0.000031
Runtime notice: 	> Goal directing
Runtime notice: 		 but d(current='{ word: mama number: 20 }', obstacle): 1.000000 <= step: 1.000000
Runtime notice: 	> Obstacle avoidance
Runtime notice: >> Next : '{ word: zizma number: 20 }' V = 1.000000 / (d(next, goal) = 13.000000) + -131072.000000 / (d(next, obstacle) = 4.000000) d(next, current) = 3.000000 nu_next = 3.000000 among 18 extrapolations in B('{ word: mama number: 20 }', 3.000000 >= 3.000000)
Runtime notice: t=44 ------------------------------
Runtime notice: > getNext(current='{ word: zizma number: 20 }')
Runtime notice: 	> d/w(current, goal='{ word: mama number: 10 }') = 13.000000 d/w(current, obstacle='{ word: mamy number: 20 }') = 0.000031
Runtime notice: 	> Goal directing
Runtime notice: t=45 ------------------------------
Runtime notice: > getNext(current='{ word: izma number: 20 }')
Runtime notice: 	> d/w(current, goal='{ word: mama number: 10 }') = 12.000000 d/w(current, obstacle='{ word: mamy number: 20 }') = 0.000023
Runtime notice: 	> Goal directing
Runtime notice: t=46 ------------------------------
Runtime notice: > getNext(current='{ word: mzma number: 20 }')
Runtime notice: 	> d/w(current, goal='{ word: mama number: 10 }') = 11.000000 d/w(current, obstacle='{ word: mamy number: 20 }') = 0.000015
Runtime notice: 	> Goal directing
Runtime notice: 		 but d(current='{ word: mama number: 20 }', obstacle): 1.000000 <= step: 1.000000
Runtime notice: 	> Obstacle avoidance
Runtime notice: >> Next : '{ word: albama number: 20 }' V = 1.000000 / (d(next, goal) = 13.000000) + -262144.000000 / (d(next, obstacle) = 4.000000) d(next, current) = 3.000000 nu_next = 3.000000 among 18 extrapolations in B('{ word: mama number: 20 }', 3.000000 >= 3.000000)
Runtime notice: t=47 ------------------------------
Runtime notice: > getNext(current='{ word: albama number: 20 }')
Runtime notice: 	> d/w(current, goal='{ word: mama number: 10 }') = 13.000000 d/w(current, obstacle='{ word: mamy number: 20 }') = 0.000015
Runtime notice: 	> Goal directing
Runtime notice: t=48 ------------------------------
Runtime notice: > getNext(current='{ word: lbama number: 20 }')
Runtime notice: 	> d/w(current, goal='{ word: mama number: 10 }') = 12.000000 d/w(current, obstacle='{ word: mamy number: 20 }') = 0.000011
Runtime notice: 	> Goal directing
Runtime notice: t=49 ------------------------------
Runtime notice: > getNext(current='{ word: bama number: 20 }')
Runtime notice: 	> d/w(current, goal='{ word: mama number: 10 }') = 11.000000 d/w(current, obstacle='{ word: mamy number: 20 }') = 0.000008
Runtime notice: 	> Goal directing
Runtime notice: 		 but d(current='{ word: mama number: 20 }', obstacle): 1.000000 <= step: 1.000000
Runtime notice: 	> Obstacle avoidance
Runtime notice: >> Next : '{ word: martima number: 20 }' V = 1.000000 / (d(next, goal) = 13.000000) + -524288.000000 / (d(next, obstacle) = 4.000000) d(next, current) = 3.000000 nu_next = 3.000000 among 18 extrapolations in B('{ word: mama number: 20 }', 3.000000 >= 3.000000)
Runtime notice: t=50 ------------------------------
Runtime notice: > getNext(current='{ word: martima number: 20 }')
Runtime notice: 	> d/w(current, goal='{ word: mama number: 10 }') = 13.000000 d/w(current, obstacle='{ word: mamy number: 20 }') = 0.000008
Runtime notice: 	> Goal directing
Runtime notice: t=51 ------------------------------
Runtime notice: > getNext(current='{ word: matima number: 20 }')
Runtime notice: 	> d/w(current, goal='{ word: mama number: 10 }') = 12.000000 d/w(current, obstacle='{ word: mamy number: 20 }') = 0.000006
Runtime notice: 	> Goal directing
Runtime notice: t=52 ------------------------------
Runtime notice: > getNext(current='{ word: maima number: 20 }')
Runtime notice: 	> d/w(current, goal='{ word: mama number: 10 }') = 11.000000 d/w(current, obstacle='{ word: mamy number: 20 }') = 0.000004
Runtime notice: 	> Goal directing
Runtime notice: 		 but d(current='{ word: mama number: 20 }', obstacle): 1.000000 <= step: 1.000000
Runtime notice: 	> Obstacle avoidance
Runtime notice: >> Next : '{ word: ziama number: 20 }' V = 1.000000 / (d(next, goal) = 12.000000) + -1048576.000000 / (d(next, obstacle) = 3.000000) d(next, current) = 2.000000 nu_next = 2.000000 among 18 extrapolations in B('{ word: mama number: 20 }', 3.000000 >= 3.000000)
Runtime notice: t=53 ------------------------------
Runtime notice: > getNext(current='{ word: ziama number: 20 }')
Runtime notice: 	> d/w(current, goal='{ word: mama number: 10 }') = 12.000000 d/w(current, obstacle='{ word: mamy number: 20 }') = 0.000003
Runtime notice: 	> Goal directing
Runtime notice: t=54 ------------------------------
Runtime notice: > getNext(current='{ word: iama number: 20 }')
Runtime notice: 	> d/w(current, goal='{ word: mama number: 10 }') = 11.000000 d/w(current, obstacle='{ word: mamy number: 20 }') = 0.000002
Runtime notice: 	> Goal directing
Runtime notice: 		 but d(current='{ word: mama number: 20 }', obstacle): 1.000000 <= step: 1.000000
Runtime notice: 	> Obstacle avoidance
Runtime notice: >> Next : '{ word: almama number: 20 }' V = 1.000000 / (d(next, goal) = 12.000000) + -2097152.000000 / (d(next, obstacle) = 3.000000) d(next, current) = 2.000000 nu_next = 2.000000 among 18 extrapolations in B('{ word: mama number: 20 }', 3.000000 >= 3.000000)
Runtime notice: t=55 ------------------------------
Runtime notice: > getNext(current='{ word: almama number: 20 }')
Runtime notice: 	> d/w(current, goal='{ word: mama number: 10 }') = 12.000000 d/w(current, obstacle='{ word: mamy number: 20 }') = 0.000001
Runtime notice: 	> Goal directing
Runtime notice: t=56 ------------------------------
Runtime notice: > getNext(current='{ word: lmama number: 20 }')
Runtime notice: 	> d/w(current, goal='{ word: mama number: 10 }') = 11.000000 d/w(current, obstacle='{ word: mamy number: 20 }') = 0.000001
Runtime notice: 	> Goal directing
Runtime notice: 		 but d(current='{ word: mama number: 20 }', obstacle): 1.000000 <= step: 1.000000
Runtime notice: 	> Obstacle avoidance
Runtime notice: >> Next : '{ word: martma number: 20 }' V = 1.000000 / (d(next, goal) = 12.000000) + -4194304.000000 / (d(next, obstacle) = 3.000000) d(next, current) = 2.000000 nu_next = 2.000000 among 18 extrapolations in B('{ word: mama number: 20 }', 3.000000 >= 3.000000)
Runtime notice: t=57 ------------------------------
Runtime notice: > getNext(current='{ word: martma number: 20 }')
Runtime notice: 	> d/w(current, goal='{ word: mama number: 10 }') = 12.000000 d/w(current, obstacle='{ word: mamy number: 20 }') = 0.000001
Runtime notice: 	> Goal directing
Runtime notice: t=58 ------------------------------
Runtime notice: > getNext(current='{ word: matma number: 20 }')
Runtime notice: 	> d/w(current, goal='{ word: mama number: 10 }') = 11.000000 d/w(current, obstacle='{ word: mamy number: 20 }') = 0.000000
Runtime notice: 	> Goal directing
Runtime notice: 		 but d(current='{ word: mama number: 20 }', obstacle): 1.000000 <= step: 1.000000
Runtime notice: 	> Obstacle avoidance
Runtime notice: >> Next : '{ word: zmama number: 20 }' V = 1.000000 / (d(next, goal) = 11.000000) + -8388608.000000 / (d(next, obstacle) = 2.000000) d(next, current) = 1.000000 nu_next = 1.000000 among 18 extrapolations in B('{ word: mama number: 20 }', 3.000000 >= 3.000000)
Runtime notice: t=59 ------------------------------
Runtime notice: > getNext(current='{ word: zmama number: 20 }')
Runtime notice: 	> d/w(current, goal='{ word: mama number: 10 }') = 11.000000 d/w(current, obstacle='{ word: mamy number: 20 }') = 0.000000
Runtime notice: 	> Goal directing
Runtime notice: 		 but d(current='{ word: mama number: 20 }', obstacle): 1.000000 <= step: 1.000000
Runtime notice: 	> Obstacle avoidance
Runtime notice: >> Next : '{ word: amama number: 20 }' V = 1.000000 / (d(next, goal) = 11.000000) + -16777216.000000 / (d(next, obstacle) = 2.000000) d(next, current) = 1.000000 nu_next = 1.000000 among 18 extrapolations in B('{ word: mama number: 20 }', 3.000000 >= 3.000000)
Runtime notice: t=60 ------------------------------
Runtime notice: > getNext(current='{ word: amama number: 20 }')
Runtime notice: 	> d/w(current, goal='{ word: mama number: 10 }') = 11.000000 d/w(current, obstacle='{ word: mamy number: 20 }') = 0.000000
Runtime notice: 	> Goal directing
Runtime notice: 		 but d(current='{ word: mama number: 20 }', obstacle): 1.000000 <= step: 1.000000
Runtime notice: 	> Obstacle avoidance
Runtime notice: >> Next : '{ word: marma number: 20 }' V = 1.000000 / (d(next, goal) = 11.000000) + -33554432.000000 / (d(next, obstacle) = 2.000000) d(next, current) = 1.000000 nu_next = 1.000000 among 18 extrapolations in B('{ word: mama number: 20 }', 3.000000 >= 3.000000)
Runtime notice: t=61 ------------------------------
Runtime notice: > getNext(current='{ word: marma number: 20 }')
Runtime notice: 	> d/w(current, goal='{ word: mama number: 10 }') = 11.000000 d/w(current, obstacle='{ word: mamy number: 20 }') = 0.000000
Runtime notice: 	> Goal directing
Runtime notice: 		 but d(current='{ word: mama number: 20 }', obstacle): 1.000000 <= step: 1.000000
Runtime notice: 	> Obstacle avoidance
Runtime notice: >> Next : '{ word: zizoa number: 20 }' V = 1.000000 / (d(next, goal) = 14.000000) + -67108864.000000 / (d(next, obstacle) = 5.000000) d(next, current) = 4.000000 nu_next = 4.000000 among 24 extrapolations in B('{ word: mama number: 20 }', 4.242641 >= 3.000000)
Runtime notice: t=62 ------------------------------
Runtime notice: > getNext(current='{ word: zizoa number: 20 }')
Runtime notice: 	> d/w(current, goal='{ word: mama number: 10 }') = 14.000000 d/w(current, obstacle='{ word: mamy number: 20 }') = 0.000000
Runtime notice: 	> Goal directing
Runtime notice: t=63 ------------------------------
Runtime notice: > getNext(current='{ word: izoa number: 20 }')
Runtime notice: 	> d/w(current, goal='{ word: mama number: 10 }') = 13.000000 d/w(current, obstacle='{ word: mamy number: 20 }') = 0.000000
Runtime notice: 	> Goal directing
Runtime notice: t=64 ------------------------------
Runtime notice: > getNext(current='{ word: mzoa number: 20 }')
Runtime notice: 	> d/w(current, goal='{ word: mama number: 10 }') = 12.000000 d/w(current, obstacle='{ word: mamy number: 20 }') = 0.000000
Runtime notice: 	> Goal directing
Runtime notice: t=65 ------------------------------
Runtime notice: > getNext(current='{ word: maoa number: 20 }')
Runtime notice: 	> d/w(current, goal='{ word: mama number: 10 }') = 11.000000 d/w(current, obstacle='{ word: mamy number: 20 }') = 0.000000
Runtime notice: 	> Goal directing
Runtime notice: 		 but d(current='{ word: mama number: 20 }', obstacle): 1.000000 <= step: 1.000000
Runtime notice: 	> Obstacle avoidance
Runtime notice: >> Next : '{ word: albema number: 20 }' V = 1.000000 / (d(next, goal) = 14.000000) + -134217728.000000 / (d(next, obstacle) = 5.000000) d(next, current) = 4.000000 nu_next = 4.000000 among 24 extrapolations in B('{ word: mama number: 20 }', 4.242641 >= 3.000000)
Runtime notice: t=66 ------------------------------
Runtime notice: > getNext(current='{ word: albema number: 20 }')
Runtime notice: 	> d/w(current, goal='{ word: mama number: 10 }') = 14.000000 d/w(current, obstacle='{ word: mamy number: 20 }') = 0.000000
Runtime notice: 	> Goal directing
Runtime notice: t=67 ------------------------------
Runtime notice: > getNext(current='{ word: lbema number: 20 }')
Runtime notice: 	> d/w(current, goal='{ word: mama number: 10 }') = 13.000000 d/w(current, obstacle='{ word: mamy number: 20 }') = 0.000000
Runtime notice: 	> Goal directing
Runtime notice: t=68 ------------------------------
Runtime notice: > getNext(current='{ word: bema number: 20 }')
Runtime notice: 	> d/w(current, goal='{ word: mama number: 10 }') = 12.000000 d/w(current, obstacle='{ word: mamy number: 20 }') = 0.000000
Runtime notice: 	> Goal directing
Runtime notice: t=69 ------------------------------
Runtime notice: > getNext(current='{ word: mema number: 20 }')
Runtime notice: 	> d/w(current, goal='{ word: mama number: 10 }') = 11.000000 d/w(current, obstacle='{ word: mamy number: 20 }') = 0.000000
Runtime notice: 	> Goal directing
Runtime notice: 		 but d(current='{ word: mama number: 20 }', obstacle): 1.000000 <= step: 1.000000
Runtime notice: 	> Obstacle avoidance
Runtime notice: >> Next : '{ word: martina number: 20 }' V = 1.000000 / (d(next, goal) = 14.000000) + -268435456.000000 / (d(next, obstacle) = 5.000000) d(next, current) = 4.000000 nu_next = 4.000000 among 24 extrapolations in B('{ word: mama number: 20 }', 4.242641 >= 3.000000)
Runtime notice: t=70 ------------------------------
Runtime notice: > getNext(current='{ word: martina number: 20 }')
Runtime notice: 	> d/w(current, goal='{ word: mama number: 10 }') = 14.000000 d/w(current, obstacle='{ word: mamy number: 20 }') = 0.000000
Runtime notice: 	> Goal directing
Runtime notice: t=71 ------------------------------
Runtime notice: > getNext(current='{ word: matina number: 20 }')
Runtime notice: 	> d/w(current, goal='{ word: mama number: 10 }') = 13.000000 d/w(current, obstacle='{ word: mamy number: 20 }') = 0.000000
Runtime notice: 	> Goal directing
Runtime notice: t=72 ------------------------------
Runtime notice: > getNext(current='{ word: maina number: 20 }')
Runtime notice: 	> d/w(current, goal='{ word: mama number: 10 }') = 12.000000 d/w(current, obstacle='{ word: mamy number: 20 }') = 0.000000
Runtime notice: 	> Goal directing
Runtime notice: t=73 ------------------------------
Runtime notice: > getNext(current='{ word: mana number: 20 }')
Runtime notice: 	> d/w(current, goal='{ word: mama number: 10 }') = 11.000000 d/w(current, obstacle='{ word: mamy number: 20 }') = 0.000000
Runtime notice: 	> Goal directing
Runtime notice: 		 but d(current='{ word: mama number: 20 }', obstacle): 1.000000 <= step: 1.000000
Runtime notice: 	> Obstacle avoidance
Runtime notice: >> Next : '{ word: albera number: 20 }' V = 1.000000 / (d(next, goal) = 15.000000) + -536870912.000000 / (d(next, obstacle) = 6.000000) d(next, current) = 5.000000 nu_next = 5.000000 among 36 extrapolations in B('{ word: mama number: 20 }', 6.000000 >= 3.000000)
Runtime notice: t=74 ------------------------------
Runtime notice: > getNext(current='{ word: albera number: 20 }')
Runtime notice: 	> d/w(current, goal='{ word: mama number: 10 }') = 15.000000 d/w(current, obstacle='{ word: mamy number: 20 }') = 0.000000
Runtime notice: 	> Goal directing
Runtime notice: t=75 ------------------------------
Runtime notice: > getNext(current='{ word: lbera number: 20 }')
Runtime notice: 	> d/w(current, goal='{ word: mama number: 10 }') = 14.000000 d/w(current, obstacle='{ word: mamy number: 20 }') = 0.000000
Runtime notice: 	> Goal directing
Runtime notice: t=76 ------------------------------
Runtime notice: > getNext(current='{ word: bera number: 20 }')
Runtime notice: 	> d/w(current, goal='{ word: mama number: 10 }') = 13.000000 d/w(current, obstacle='{ word: mamy number: 20 }') = 0.000000
Runtime notice: 	> Goal directing
Runtime notice: t=77 ------------------------------
Runtime notice: > getNext(current='{ word: mera number: 20 }')
Runtime notice: 	> d/w(current, goal='{ word: mama number: 10 }') = 12.000000 d/w(current, obstacle='{ word: mamy number: 20 }') = 0.000000
Runtime notice: 	> Goal directing
Runtime notice: t=78 ------------------------------
Runtime notice: > getNext(current='{ word: mara number: 20 }')
Runtime notice: 	> d/w(current, goal='{ word: mama number: 10 }') = 11.000000 d/w(current, obstacle='{ word: mamy number: 20 }') = 0.000000
Runtime notice: 	> Goal directing
Runtime notice: 		 but d(current='{ word: mama number: 20 }', obstacle): 1.000000 <= step: 1.000000
Runtime notice: 	> Obstacle avoidance
Runtime notice: >> Next : '{ word: martinal number: 20 }' V = 1.000000 / (d(next, goal) = 15.000000) + -1073741824.000000 / (d(next, obstacle) = 6.000000) d(next, current) = 5.000000 nu_next = 5.000000 among 36 extrapolations in B('{ word: mama number: 20 }', 6.000000 >= 3.000000)
Runtime notice: t=79 ------------------------------
Runtime notice: > getNext(current='{ word: martinal number: 20 }')
Runtime notice: 	> d/w(current, goal='{ word: mama number: 10 }') = 15.000000 d/w(current, obstacle='{ word: mamy number: 20 }') = 0.000000
Runtime notice: 	> Goal directing
Runtime notice: t=80 ------------------------------
Runtime notice: > getNext(current='{ word: matinal number: 20 }')
Runtime notice: 	> d/w(current, goal='{ word: mama number: 10 }') = 14.000000 d/w(current, obstacle='{ word: mamy number: 20 }') = 0.000000
Runtime notice: 	> Goal directing
Runtime notice: t=81 ------------------------------
Runtime notice: > getNext(current='{ word: mainal number: 20 }')
Runtime notice: 	> d/w(current, goal='{ word: mama number: 10 }') = 13.000000 d/w(current, obstacle='{ word: mamy number: 20 }') = 0.000000
Runtime notice: 	> Goal directing
Runtime notice: t=82 ------------------------------
Runtime notice: > getNext(current='{ word: manal number: 20 }')
Runtime notice: 	> d/w(current, goal='{ word: mama number: 10 }') = 12.000000 d/w(current, obstacle='{ word: mamy number: 20 }') = 0.000000
Runtime notice: 	> Goal directing
Runtime notice: t=83 ------------------------------
Runtime notice: > getNext(current='{ word: mamal number: 20 }')
Runtime notice: 	> d/w(current, goal='{ word: mama number: 10 }') = 11.000000 d/w(current, obstacle='{ word: mamy number: 20 }') = 0.000000
Runtime notice: 	> Goal directing
Runtime notice: 		 but d(current='{ word: mama number: 20 }', obstacle): 1.000000 <= step: 1.000000
Runtime notice: 	> Obstacle avoidance
Runtime notice: >> Next : '{ word: zizou number: 19 }' V = 1.000000 / (d(next, goal) = 14.000000) + -2147483648.000000 / (d(next, obstacle) = 6.000000) d(next, current) = 6.000000 nu_next = 6.000000 among 36 extrapolations in B('{ word: mama number: 20 }', 6.000000 >= 3.000000)
Runtime notice: t=84 ------------------------------
Runtime notice: > getNext(current='{ word: zizou number: 19 }')
Runtime notice: 	> d/w(current, goal='{ word: mama number: 10 }') = 14.000000 d/w(current, obstacle='{ word: mamy number: 20 }') = 0.000000
Runtime notice: 	> Goal directing
Runtime notice: t=85 ------------------------------
Runtime notice: > getNext(current='{ word: izou number: 19 }')
Runtime notice: 	> d/w(current, goal='{ word: mama number: 10 }') = 13.000000 d/w(current, obstacle='{ word: mamy number: 20 }') = 0.000000
Runtime notice: 	> Goal directing
Runtime notice: t=86 ------------------------------
Runtime notice: > getNext(current='{ word: mzou number: 19 }')
Runtime notice: 	> d/w(current, goal='{ word: mama number: 10 }') = 12.000000 d/w(current, obstacle='{ word: mamy number: 20 }') = 0.000000
Runtime notice: 	> Goal directing
Runtime notice: t=87 ------------------------------
Runtime notice: > getNext(current='{ word: maou number: 19 }')
Runtime notice: 	> d/w(current, goal='{ word: mama number: 10 }') = 11.000000 d/w(current, obstacle='{ word: mamy number: 20 }') = 0.000000
Runtime notice: 	> Goal directing
Runtime notice: t=88 ------------------------------
Runtime notice: > getNext(current='{ word: mamu number: 19 }')
Runtime notice: 	> d/w(current, goal='{ word: mama number: 10 }') = 10.000000 d/w(current, obstacle='{ word: mamy number: 20 }') = 0.000000
Runtime notice: 	> Goal directing
Runtime notice: t=89 ------------------------------
Runtime notice: > getNext(current='{ word: mama number: 19 }')
Runtime notice: 	> d/w(current, goal='{ word: mama number: 10 }') = 9.000000 d/w(current, obstacle='{ word: mamy number: 20 }') = 0.000000
Runtime notice: 	> Goal directing
Runtime notice: t=90 ------------------------------
Runtime notice: > getNext(current='{ word: mama number: 18 }')
Runtime notice: 	> d/w(current, goal='{ word: mama number: 10 }') = 8.000000 d/w(current, obstacle='{ word: mamy number: 20 }') = 0.000000
Runtime notice: 	> Goal directing
Runtime notice: t=91 ------------------------------
Runtime notice: > getNext(current='{ word: mama number: 17 }')
Runtime notice: 	> d/w(current, goal='{ word: mama number: 10 }') = 7.000000 d/w(current, obstacle='{ word: mamy number: 20 }') = 0.000000
Runtime notice: 	> Goal directing
Runtime notice: t=92 ------------------------------
Runtime notice: > getNext(current='{ word: mama number: 16 }')
Runtime notice: 	> d/w(current, goal='{ word: mama number: 10 }') = 6.000000 d/w(current, obstacle='{ word: mamy number: 20 }') = 0.000000
Runtime notice: 	> Goal directing
Runtime notice: t=93 ------------------------------
Runtime notice: > getNext(current='{ word: mama number: 15 }')
Runtime notice: 	> d/w(current, goal='{ word: mama number: 10 }') = 5.000000 d/w(current, obstacle='{ word: mamy number: 20 }') = 0.000000
Runtime notice: 	> Goal directing
Runtime notice: t=94 ------------------------------
Runtime notice: > getNext(current='{ word: mama number: 14 }')
Runtime notice: 	> d/w(current, goal='{ word: mama number: 10 }') = 4.000000 d/w(current, obstacle='{ word: mamy number: 20 }') = 0.000000
Runtime notice: 	> Goal directing
Runtime notice: t=95 ------------------------------
Runtime notice: > getNext(current='{ word: mama number: 13 }')
Runtime notice: 	> d/w(current, goal='{ word: mama number: 10 }') = 3.000000 d/w(current, obstacle='{ word: mamy number: 20 }') = 0.000000
Runtime notice: 	> Goal directing
Runtime notice: t=96 ------------------------------
Runtime notice: > getNext(current='{ word: mama number: 12 }')
Runtime notice: 	> d/w(current, goal='{ word: mama number: 10 }') = 2.000000 d/w(current, obstacle='{ word: mamy number: 20 }') = 0.000000
Runtime notice: 	> Goal directing
Runtime notice: t=97 ------------------------------
Runtime notice: > getNext(current='{ word: mama number: 11 }')
Runtime notice: 	> d/w(current, goal='{ word: mama number: 10 }') = 1.000000 d/w(current, obstacle='{ word: mamy number: 20 }') = 0.000000
Runtime notice: 	> Goal directing
