{
  "header": {
    "keySignatures": [
      {
        "key": "F",
        "scale": "major",
        "ticks": 0
      }
    ],
    "meta": [
      {
        "text": "Created by Rosegarden",
        "ticks": 0,
        "type": "cuePoint"
      },
      {
        "text": "http://www.rosegardenmusic.com/",
        "ticks": 0,
        "type": "cuePoint"
      }
    ],
    "ppq": 480,
    "tempos": [
      {
        "bpm": 115.00024916720653,
        "ticks": 0
      },
      {
        "bpm": 110.00011000011,
        "ticks": 30720
      }
    ],
    "timeSignatures": [
      {
        "ticks": 0,
        "timeSignature": [
          4,
          4
        ],
        "measures": 0
      },
      {
        "ticks": 32640,
        "timeSignature": [
          8,
          4
        ],
        "measures": 17
      }
    ]
  },
  "tracks": [
    {
      "channel": 0,
      "controlChanges": {
        "7": [
          {
            "number": 7,
            "ticks": 0,
            "time": 0,
            "value": 0.7480314960629921
          },
          {
            "number": 7,
            "ticks": 0,
            "time": 0,
            "value": 0.7480314960629921
          }
        ],
        "10": [
          {
            "number": 10,
            "ticks": 0,
            "time": 0,
            "value": 0.49606299212598426
          },
          {
            "number": 10,
            "ticks": 0,
            "time": 0,
            "value": 0.49606299212598426
          }
        ],
        "91": [
          {
            "number": 91,
            "ticks": 0,
            "time": 0,
            "value": 0
          },
          {
            "number": 91,
            "ticks": 0,
            "time": 0,
            "value": 0
          }
        ],
        "93": [
          {
            "number": 93,
            "ticks": 0,
            "time": 0,
            "value": 0
          },
          {
            "number": 93,
            "ticks": 0,
            "time": 0,
            "value": 0
          }
        ],
        "64": [
          {
            "number": 64,
            "ticks": 0,
            "time": 0,
            "value": 0
          },
          {
            "number": 64,
            "ticks": 0,
            "time": 0,
            "value": 0
          }
        ]
      },
      "pitchBends": [
      ],
      "instrument": {
        "family": "piano",
        "number": 0,
        "name": "acoustic grand piano"
      },
      "name": "Piano",
      "notes": [
        {
          "durationTicks": 240,
          "midi": 60,
          "name": "C4",
          "ticks": 0,
          "time": 0,
          "velocity": 0.7086614173228346
        },
        {
          "duration": 0.5,
          "durationTicks": 240,
          "midi": 60,
          "name": "C4",
          "ticks": 240,
          "time": 0.5,
          "velocity": 0.7086614173228346
        },
        {
          "duration": 0.5,
          "durationTicks": 240,
          "midi": 60,
          "name": "C4",
          "ticks": 480,
          "time": 1,
          "velocity": 0.7086614173228346
        },
        {
          "duration": 0.5,
          "durationTicks": 240,
          "midi": 62,
          "name": "D4",
          "ticks": 720,
          "time": 1.5,
          "velocity": 0.7086614173228346
        },
        {
          "duration": 1,
          "durationTicks": 480,
          "midi": 64,
          "name": "E4",
          "ticks": 960,
          "time": 2,
          "velocity": 0.7086614173228346
        },
        {
          "duration": 1,
          "durationTicks": 480,
          "midi": 62,
          "name": "D4",
          "ticks": 1440,
          "time": 3,
          "velocity": 0.7086614173228346
        },
        {
          "duration": 0.5,
          "durationTicks": 240,
          "midi": 60,
          "name": "C4",
          "ticks": 1920,
          "time": 4,
          "velocity": 0.7086614173228346
        },
        {
          "duration": 0.5,
          "durationTicks": 240,
          "midi": 64,
          "name": "E4",
          "ticks": 2160,
          "time": 4.5,
          "velocity": 0.7086614173228346
        },
        {
          "duration": 0.5,
          "durationTicks": 240,
          "midi": 62,
          "name": "D4",
          "ticks": 2400,
          "time": 5,
          "velocity": 0.7086614173228346
        },
        {
          "duration": 0.5,
          "durationTicks": 240,
          "midi": 62,
          "name": "D4",
          "ticks": 2640,
          "time": 5.5,
          "velocity": 0.7086614173228346
        },
        {
          "duration": 2,
          "durationTicks": 960,
          "midi": 60,
          "name": "C4",
          "ticks": 2880,
          "time": 6,
          "velocity": 0.7086614173228346
        }
      ],
      "endOfTrackTicks": 5760
    }
  ]
}
