[
  {
    input: {
      state: {
        word: arziapy
        number: 20
      }
      action: {
        word: arziapy
        number: 20
      }
      time: 0
      reward: -0.201889
    }
    output: -0.212316
  }
  {
    input: {
      state: {
        word: marziapy
        number: 20
      }
      action: {
        word: marziapy
        number: 20
      }
      time: 0
      reward: -0.197755
    }
    output: -0.210991
  }
  {
    input: {
      state: {
        word: maziapy
        number: 20
      }
      action: {
        word: maziapy
        number: 20
      }
      time: 0
      reward: -0.135802
    }
    output: -0.218494
  }
  {
    input: {
      state: {
        word: zizpy
        number: 20
      }
      action: {
        word: zizpy
        number: 20
      }
      time: 0
      reward: -0.165981
    }
    output: -0.187774
  }
  {
    input: {
      state: {
        word: aziapy
        number: 20
      }
      action: {
        word: aziapy
        number: 20
      }
      time: 0
      reward: -0.165981
    }
    output: -0.228322
  }
  {
    input: {
      state: {
        word: ziapy
        number: 20
      }
      action: {
        word: ziapy
        number: 20
      }
      time: 0
      reward: -0.160494
    }
    output: -0.206743
  }
  {
    input: {
      state: {
        word: maziapy
        number: 20
      }
      action: {
        word: maziapy
        number: 20
      }
      time: 0
      reward: -0.182579
    }
    output: -0.231263
  }
  {
    input: {
      state: {
        word: azizpy
        number: 20
      }
      action: {
        word: azizpy
        number: 20
      }
      time: 0
      reward: -0.221308
    }
    output: -0.237469
  }
  {
    input: {
      state: {
        word: marziapy
        number: 20
      }
      action: {
        word: marziapy
        number: 20
      }
      time: 0
      reward: -0.186831
    }
    output: -0.230338
  }
  {
    input: {
      state: {
        word: aziapy
        number: 20
      }
      action: {
        word: aziapy
        number: 20
      }
      time: 0
      reward: -0.175084
    }
    output: -0.218739
  }
  {
    input: {
      state: {
        word: arziapy
        number: 20
      }
      action: {
        word: arziapy
        number: 20
      }
      time: 0
      reward: -0.190055
    }
    output: -0.232520
  }
  {
    input: {
      word: mapy
      number: 15
    }
    output: -1
  }
  {
    input: {
      state: {
        word: aziapy
        number: 20
      }
      action: {
        word: aziapy
        number: 20
      }
      time: 0
      reward: -0.207382
    }
    output: -0.230200
  }
  {
    input: {
      state: {
        word: ziapy
        number: 20
      }
      action: {
        word: ziapy
        number: 20
      }
      time: 0
      reward: -0.197755
    }
    output: -0.213358
  }
  {
    input: {
      state: {
        word: zpapy
        number: 20
      }
      action: {
        word: zpapy
        number: 20
      }
      time: 0
      reward: -0.100000
    }
    output: -0.173293
  }
  {
    input: {
      state: {
        word: ziapy
        number: 20
      }
      action: {
        word: ziapy
        number: 20
      }
      time: 0
      reward: -0.111111
    }
    output: -0.192134
  }
  {
    input: {
      state: {
        word: marziapy
        number: 20
      }
      action: {
        word: marziapy
        number: 20
      }
      time: 0
      reward: -0.148148
    }
    output: -0.217844
  }
  {
    input: {
      state: {
        word: maziapy
        number: 20
      }
      action: {
        word: maziapy
        number: 20
      }
      time: 0
      reward: -0.192593
    }
    output: -0.223350
  }
  {
    input: {
      state: {
        word: mziapy
        number: 20
      }
      action: {
        word: mziapy
        number: 20
      }
      time: 0
      reward: -0.123457
    }
    output: -0.192739
  }
  {
    input: {
      state: {
        word: arziapy
        number: 20
      }
      action: {
        word: arziapy
        number: 20
      }
      time: 0
      reward: -0.160494
    }
    output: -0.206331
  }
  {
    input: {
      state: {
        word: mzizpy
        number: 20
      }
      action: {
        word: mzizpy
        number: 20
      }
      time: 0
      reward: -0.184423
    }
    output: -0.204171
  }
  {
    input: {
      word: mama
      number: 10
    }
    output: 1
  }
  {
    input: {
      state: {
        word: mazizpy
        number: 20
      }
      action: {
        word: mazizpy
        number: 20
      }
      time: 0
      reward: -0.202865
    }
    output: -0.222227
  }
]
