<?xml version="1.0" encoding="utf-8"?>
<svg viewBox="0 0 500 500">

<ellipse style="stroke: rgb(0,0,0);  fill: none; " cx="254.049521" cy="227.228096" rx="115.04952" ry="107.91348">



</ellipse>
<circle style="stroke: rgb(0,0,0);  fill: none; " cx="201.418" cy="181.218" r="20.395">



</circle>
<circle style="stroke: rgb(0,0,0);  fill: none; " cx="318.934" cy="200.447" r="20.947">



</circle>
<ellipse style="stroke: rgb(0,0,0);  fill: rgb(255,255,0); " cx="258.39514023000004" cy="214.691466989" rx="7.046180025" ry="28.412512895">



</ellipse>
<path style="stroke: rgb(0,0,0);  fill: rgb(216,216,216); " d="M 214 305 L 307 305">



</path>

</svg>
