[
  {
    "tag": "ellipse",
    "attr": {
      "style": {
        "stroke": {
          "r": 0,
          "g": 0,
          "b": 0,
          "a": 255
        },
        "fill": {
          "r": 0,
          "g": 0,
          "b": 0,
          "a": 0
        }
      },
      "cx": 254.049521,
      "cy": 227.228096,
      "rx": 115.04952,
      "ry": 107.91348
    }
  },
  {
    "tag": "circle",
    "attr": {
      "style": {
        "stroke": {
          "r": 0,
          "g": 0,
          "b": 0,
          "a": 255
        },
        "fill": {
          "r": 0,
          "g": 0,
          "b": 0,
          "a": 0
        }
      },
      "cx": 201.418,
      "cy": 181.218,
      "r": 20.395
    }
  },
  {
    "tag": "circle",
    "attr": {
      "style": {
        "stroke": {
          "r": 0,
          "g": 0,
          "b": 0,
          "a": 255
        },
        "fill": {
          "r": 0,
          "g": 0,
          "b": 0,
          "a": 0
        }
      },
      "cx": 318.934,
      "cy": 200.447,
      "r": 20.947
    }
  },
  {
    "tag": "ellipse",
    "attr": {
      "style": {
        "stroke": {
          "r": 0,
          "g": 0,
          "b": 0,
          "a": 255
        },
        "fill": {
          "r": 216,
          "g": 216,
          "b": 216,
          "a": 255
        }
      },
      "cx": 254.834,
      "cy": 223.59400358700003,
      "rx": 9.895,
      "ry": 16.661032785
    }
  },
  {
    "tag": "path",
    "attr": {
      "style": {
        "stroke": {
          "r": 0,
          "g": 0,
          "b": 0,
          "a": 255
        },
        "fill": {
          "r": 0,
          "g": 0,
          "b": 0,
          "a": 0
        }
      },
      "d": [
        {
          "type": "M",
          "segment": [
            189
          ]
        },
        {
          "type": "M",
          "segment": [
            214,
            305
          ]
        },
        {
          "type": "L",
          "segment": [
            307,
            305
          ]
        }
      ]
    }
  }
]
