<?xml version="1.0" encoding="utf-8"?>
<svg viewBox="0 0 500 500" xmlns="http://www.w3.org/2000/svg">
    <circle style="stroke: rgb(0, 0, 0); fill: none;" cx="225" cy="250" r="60" transform="matrix(1.917492, 0, 0, 1.798558, -177.386179, -222.411404)"/>
    <circle style="stroke: rgb(0, 0, 0); fill: none;" cx="201.418" cy="181.218" r="20.395"/>
    <circle style="stroke: rgb(0, 0, 0); fill: none;" cx="318.934" cy="200.447" r="20.947"/>
    <path style="stroke: rgb(0, 0, 0); fill: none;" d="M 189.311 270.244 L 259.107 303.006 L 323.206 270.244"/>
    <circle style="stroke: rgb(0, 0, 0); fill: rgb(216, 216, 216);" cx="254.834" cy="220.389" r="9.895" transform="matrix(1, 0, 0, 1.683783, 0, -147.493248)"/>
</svg>