{
  type: data
  NaN
  verbose
  points : [
    {
      input: {
        word: mama
        number: 10
      }
    }
    {
      input: {
        word: momu
        number: 5
      }
    }
    {
      input: {
        word: momy
        number: 7
      }
    }
    {
      input: {
        word: mamy
        number: 20
      }
    }
    {
      input: {
        word: mamon
        number: 18
      }
    }
    {
      input: {
        word: memee
        number: 14
      }
    }
    {
      input: {
        word: pupi
        number: 16
      }
    }
    {
      input: {
        word: plum
        number: 8
      }
    }
  ]
}

