{
	channel: master-forward
	count: 200
	min: 0.0124573
	max: 0.998716
	mean: 0.746947
	stdev: 0.320529
	skew: -1.23074
	kurt: 0.12179
	gamma-degree: 5.43057
	gamma-rate: 0.137545
	uniform-entropy: 0.151008
	normal-entropy: 1.22636
	median: 0.907313
	lower-quartile: 0.657195
	upper-quartile: 0.98251
	inter-quartile-range: 0.325316 
	hsize_from_standard_deviation: 5
	hsize_from_inter_quartile_range: 9
	hsize: 5
	hscale: 4.05573
	mode: 0.864986
	median_: 0.809492
	lower-quartile_: 0.517328
	upper-quartile_: 0.905059
	inter-quartile-range_: 0.387732
	entropy: -0.493764
	uniform-divergence: 0.545412
	normal-divergence: 1.14278
	gamma-1-divergence: 4.41339
	gamma-2-divergence: 3.12979
	gamma-5-divergence: 2.79656
	gamma-10-divergence: 3.42272
	best-model: -1
}