591724369f8a23dade8016c4cd8f17e582a5df6e01f673330b
617f9d6fabfdfb6377a1b34adc3625035b587ca7f8ebe64228
10b2af652390e988685eae1a900460faf7ca6a76b52f9fb4bb
751a1e5c83862cbcd59511e13e538201e15922df23e40a673c
fb3d6e1b650f592ccb3b04a8d29361f4e38c927fac4ed0b863
9796ba0aa485124fc3eabdab9eaf9fe530b7856587bbecd523
0b3f37710b420a93dfb3ba3a11448e39f687100d634686ba04
b2a859f045890388cd4f23e6646a02656fad6021e65a854e71
bb637a5f4b3467266b7f9032c73e4d9a0b80170058aea1ae31
71eeb203185fe11371e8b10652d24592a91ccba64164813b93
cb36baa74687cce0de2edc63cabbb93e8fcf101c43cbeb09a1
fa9bfdc55f2df6548cfbdaacd8296bd035d352cc5bd8a8ebb7
c41187e5a67802aebaea3036b6b81a53803d1c47fd557f464d
9e51f27d892b38e98bf26351cd035fa7d34aaa0e09672d341e
f02430e573e58493d7e65fb59932fd05e6dd4d74440f0b091a
4578acd7ac4f805760c335de876e04392830b7d7abb1379b2f
1a7b417959b0663e7e9d7400eddd8e847a78c2d332c273e81c
bdc20a0e94ee31b01829ae019108d36d836636c80679b26d5e
c052fe45e6ae5e04de88cfe05b8f3d51d61b53aace412dfe8b
8f78b08735c13c395cc161b108330c69a59738216802c4557f
524b33fea559c43c01a43fd5d0a2367fb9d4a9015bba0718fb
ef33f14bd92cf43d739e5150d3a9d1c55eace84ae172c397a3
3e643cb92bddac4cbe00a041da686013365e695e222d35890a
848e32628d5bb8238d47a795c2091b3ade89cf883a7572ae43
86c96271ed19cf40de3db76c98480eafd294c6d711f35147f6
7eaebbef4ef3be07eefad67287d54cbec802a1ad0504eb5475
582f0ebb5b311000ae5287647a6d18e654747aac6372d3c249
d649b6c272061cb34bbc6cfc78ce077fb4f816f905adcb7f32
cb45dd12eb1d08f21aaf7cb653d69540e012afbcc10f03fa6c
1ce70e8209ad728c8e15559d0a031b8352d1630526ddf029f0
dd46d6644296775222f21ef58459c87d288bf9f1928e17540a
96d9c332d46b5f8805bc5c5f24f93ce37c63ac24cbd29e2c7c
a275bf011c9ca42ba43ecb7677777e6ecce6f6543eec92786a
ff63676b56fd1efe9503f2aad40973c1e396cde64f1bbcd3a0
215ac0d9c7032974a9970b67bb809ca937a43e3d8dd37e34b0
de386401e94ab02e3745a8f5d7072be5c6096aafe77ec37579
01db088629c45392d9bf6f75eb6c1a15e2a613d99fe49a451b
f9ead1cb120d556b234c7ff98a06d6c45fe86cccca5e14a83c
f3b570547748d7df00536b269bb713b7f5b7ac8395f9c5adcf
b4434a0cd3a0434fa6835e440d555724ae45661d7234827eec
