02c13153441f085a3c7a42caedf967822ea50dfd94a9e4c8c7
cfaf35a6791966e629ff540238267b0e17f97e92058c08eb12
aa5d765688d4039b7d9dae5dcb8d74d04f7ef1fe759b600bcf
763e0a541eb86580aa0ca0d6b9f446894bd43dbf2458f308b1
2f090047d34345f91f747e67d08de83e1adac9984c8e335cc2
4a25f8d5087799760922c6735d60bf9679468a95de796fc65a
8a2ca0bcb3cd28745d91a0af012ac3aa5c878706abff43ceee
94ff33a1692eee2fd7526e2ce71b51852471f4799956ad0c3f
bdd5b2c9890ce1059ed8d4b29959476dfc1edb1458bd9b1e89
45484ee6b28d5d835c0c7c591bac353003731b5c3290ec5496
21bb086541af6c21c54c4efa616c1fd90ff6d777727fff013a
e040714cbc7e6776bff0d891986dbd94cff03ddf7784ef4a62
82886c569964e4b54b07d0d5af4b6cb3b5a6c76d03b10b77f7
5a01c9be1493ac48ffa2ad589746c2f1af6d368fd603691f46
674ea2e18e2e06347cd11c00f77fd506788bd8192a11637275
33a391aefd32284888e46267a38a36ab42bd82659434088757
df679b8a8f298c3a0dc655e10ec55eebfc5dce9087d1097272
082630c0c3fe1110a62ea4ca0aba0d4fe193e65b6b7207d804
e230c5229614c3171f4f8d21f4c4c9af2dcb93a455c3ad69ef
84fd2e5cabbfe606a180e39871da1f5ef97fea69f1a68840fa
644f1496efc0cafccb4c475a4ca316647cb408e7c040c3aa69
161033327a3c98e0022bdb389c47cf09c983fcb6ebc98dd96f
8bfcd1d033b610290f16cf607ae0dff88b1b3768d1467dd27a
30934dcc82f47cd816df7545d82069970a94f86a3debbf3d13
4168520420558ea1bf8869a83682bf2cf87528b565a73b83b1
cf14438121216c1cffd3462a8fd0d016ce950d81a06da86709
ac572b2493fc77bd5e523a4bc43235bec5797dd7278d9b6d67
dbb68672ddac9e6ae44cd17565dce82e10b8224aaed7c91ba5
e7458b6adb9af7092de25cd3eba2156baa75774de1c1bdfe5c
166a910f7b8712818b6cd1829e26ebd098bf12d415607d0c03
ce35bbc5d673a28cedee9306bf1a96719c1c3043514fc453bf
2dc9489afc45e72330204358f43205ac166d284c3548e6f1c1
71e3cb4bb558b62a5cd74e5c89c2b69e0aba25c288056346aa
a800a95b183ef5f717dd9224811ca97981b24ca847dc5a614e
3dd7aa83be6a89cbf3f5c26ef6fc826bdd6d163304a03b7ec3
403c5d24c4361813217a75498c80b6488a8b292f114fa85025
7899c6c99b4b88fcf932ad06f491250032cdfc5334b6d58c54
b1abb301f3c22a652f0a07a1b7b4fc103d21d1925bac92a65a
5cd65ca5942774e668da0b459bae43055e265b8adb45edf10e
53ad574883829ef4043ca6d8ac4e4346ffd965e83992bcd24c
