24bb2d1bb5e848662b5c26479c1fa2e7a6e671ebf8c5d7d03f
64fe24d307f3f5eab1ef05cf182e88839bc97ecaf14c58d908
f0a5cdadbfd93bbc0bbd1cc484a510d85c7e8ea903973eb231
2d5b062794240c56d43d625b9fd540a61bace7e5fa879f4c0e
50a651366e367b71b6deb1ff892049db9e6c41908d540e703f
35c0f27a0aeadbeded636326451ae6eb5f7d7744ec003921e8
313b0286893d007a93784c0e301d5c5749e610338c29306df8
fcf1e9a645f0eaaf993f2a59ca61e4bedc5a580aaa97665bb8
5f11e38d9f6ea0565109b5a922e23a81bd5ae787fc156206d7
76ddec5a2c4ee937df3d8fb2f62a1ba9c65c626fe4330283d9
f6c4bcca155b023ebd2b874b5e8ad6611580cc6e63ac935e67
bade5ff8bf253f76836628d21dd8bfcd80e10bf7168ee63448
dbc601bccd0c46a8a153b6e2bd5b1259f335fecf091b597976
296fd51c91dc71e2a916b6aff705729746ab9c43b1e277b0e6
1f0569a8c80cc915a6203aa80c1e95654b770dc2dda879d945
82ddb4ab17ae338d53b0f346f430247b20eff45e306ed159e8
9813b188cf0283cf752a71f161915615a28dcaf5836b14915f
34f926c772ca9c35bd086c35d75954f77563a4a5b2c7bd2cb0
f0b12e5c887b71ed58cff336994650f87c364ad246b654070a
82f2b0b6f9c2107dd2a0f1526ebaba12cec25e34098741185c
83ff2279d7fcf1f470adb082f0566b386878ca528c4c3adbc0
242a48a32105166f22d9acc3b4ff08f7b5ec9dbd724b7d522e
c81324204a612996b29b93f4d8916ed55e49e1662b9a2e638a
8d7d1a302cf626999e953a186ef7c63e1b770de66adf85e422
0ae9245c277b47251546d4352db80122263206fa1db283e73b
5fe8321504c7f7e6ea28958cb5f4c93a673f3912ffa0e20cc8
0d34506e3441f4e8c4e4921476c669bcdd02f0735d12612fcc
a412fc9527578b3336cec5c90407e39469a18c246d761a9fcb
6113d618920356019e0a0c06914dbcbe96eb052af65acff653
aaded5d61c6b90e55fff95e8b12bdad177da972c72a47baa79
2ea085cf936d75bf62e194e320f28bbcdf237750f73328bede
80584149df120a976fda09c312edf1ee5ac08e3f5a947a2b9b
f2c1187295924209ca568e3c4f65720cd42c96c276c18054e1
fae712f77cc2f26d7067bc101cd57f8e403c19a849e8e2bbde
06ed7fedc70c85839470843aae8a9ad3743c8976bc3523834a
c0501d1a6b3e7b6df11c3dbaba18f8c07876392c191ce85443
bf040875b654648c0f255cf44b34406fca47de5bbdaffaf9a4
0ea6d0bd15fa7749c9640975e93349620c0095782b43319b56
b42482d6dd8f86b8febe6f0e96c647c979965009a1bb3fca19
e80da93d3f1a97b3a551ff49a9d19bef0287ae8cf3eead5b7b
