a1a114708f7ec27ee3354df08a42dc4c46641f1f18d054556e
9d7ede15fa6d9b8b4a5e65295c55303a74b229f6128f4855e6
47af72cff1f75c885676304a647fe2cd97180f5b62ce6fdf59
68aafcb499e808f426bc33cf2de8cb20852b85434d659341f2
879c3788aa15bd6fcd096a5a13088ece037f5756d02f8523a7
fc9e030f7618e9719b8fad813e47f6d01c2db7cf279ef9de0a
bd65463dbef02f869315b72569ea11acac09a9fe2cfe98e9d4
57a5e1dfa3f136369e32579c50237863aff732a88860bca0b6
88600308aeb014161bfaa1dbffd28f4e4a4e3c69ef487520ac
c84ef5fb01e51774db54823fba26b24519c40007bda07ba11c
50f7fe6a74ef7f6b07c698b376c0fb668e70333fdb6880ac11
8edc6034b21a97bfa57e6ea5d2599ef1ccfbaf54fd4297c668
bfe67b0601f28a7c65f0d5c03665e71f769f157b95825d83db
9245c820de4daa8e53619cf40ec1c1af0cc900f29f0ce49b0a
c013e46a7ddb4508c7774d06ae710ba593ac3b6a07920a37b9
cde6bf2a8b13c4c8d9c8fc42cd8f8af30d19fc1d67058b4480
589a43fc5ac62b9a5c7e67d5b290f1bf6dedcab3dcb6919d0f
a421b1f3b65cea3451f39773119b45cea3fc9d5a88fd31e5c8
4e5bf8bdcf04ba5779b316d290d25a892c414b6f81f6ce7467
70bc49949ca09e7953765687dff0206987c42eb4b70e741ee5
e3e0b9c013815056fc5ebcb4f6510a2914c5dd6a4b716e8ac9
f317287dea06c60d61a9edc99df51d08dae6b863cab90d3971
bc5d02294ea020543982dd316ae7feb665e4679a719089fdce
3597694f1a366172c89ce2fc9afd4e8b1aa6cfd43e0d9bfb18
72e91d3b70598415b8635c6a324918d18902c2ff99eda4d9f3
940573308822c3d3bf12a277178accdfd66ef641b49772eccd
9fbba1367400bc7f7156c05df44f2a5d5ad62cedc4309ddda2
e89222bae4dd3cb8d125b6761c72765688558f3c4ccf9ecd05
389a267947525991272f3709efbea01e158756e458eacd1bb7
f86f329c9207281579907998965f4bc49ad38f060707fca008
e452a2ca762a674642702134a36e7b63024aeca0d060573ae9
3f05341af74004570f0aa0b03b224781057c0f1716701f64bb
3b49ba4bd8251d8fb7b3f4c1f255b233b8c1a6de71c4b26e79
3bded68896010ba2311c915c083fa2f44e7f52fa233e8a7626
f1609cd6c494f527c866638ad0e9c19159b9e5625f49190647
89427027d59f82c38c3500d17698e6ae5604636b77bb030d91
e72302a692519a4102e7103f8ecf1e6c28a280f14e6867fef7
96a60d11245e0abd90bd20116863070c46660d3d98b2476d4d
de1cb42557bee538a43eddb9ab6816df19e5da0de98b9f89c9
10360a8e1bfdf19fada01ddcc66bbce6a935fdd6c087aca5b8
