evolution$generation,evolution$evaluated,closing_threshold,closing_time,objective$sum_cont,objective$hour_school_missed,evolution$samples,hour_school_missed,sum_cont
1500,1500,952,20,53842.0,274992.0,33,"[297435,281844,235672,251815,276384,244915,238757,195529,335653,473088,289352,364040,269736,234248,145189,239320,272383,113204,236592,416394,374327,260124,290686,521346,240371,291875,321419,508151,69796,246938,275933,274992,342995]","[53828,54479,54348,54019,53842,53544,54491,57000,53941,53437,52788,53656,53887,53356,57404,53043,54073,57732,52333,53832,52920,53293,53152,54418,53721,53333,52906,53993,56145,53903,54139,54382,53779]"
1500,1500,740,3,56885.0,108736.0,1,"[108736]","[56885]"
1500,1500,25,17,47655.5,781872.5,2,"[740357,823388]","[47531,47780]"
1500,1500,31,25,47850.0,824608.0,13,"[784145,787126,824608,773717,858925,776000,771795,856501,902193,839594,1022456,881772,814578]","[47686,47850,47949,47768,47765,47810,48028,47911,47251,47887,48379,47825,48755]"
1500,1500,911,3,57126.0,120762.0,15,"[92130,107019,115886,102156,195573,135284,116038,185579,308729,265027,105181,358274,152443,120762,114980]","[56876,56926,57126,57513,57035,56971,56617,56954,57276,57211,57183,57128,56763,57585,57131]"
1500,1500,995,4,56770.0,116599.0,1,"[116599]","[56770]"
1500,1500,23,11,47900.0,680338.0,1,"[680338]","[47900]"
1500,1500,95,17,48659.0,582209.0,21,"[547987,537888,552732,621643,523741,555549,857540,597730,592390,868862,913673,517288,653982,749137,611301,551590,582209,587800,545017,556285,520366]","[47959,48892,48046,48662,48659,48598,48821,48073,48934,48993,48557,48674,48488,49404,48775,49266,48421,48615,48664,48216,48084]"
1500,1500,75,17,48628.0,520771.0,1,"[520771]","[48628]"
1500,1500,23,12,47685.0,725753.0,1,"[725753]","[47685]"
1500,1500,879,5,57108.0,167223.0,11,"[151012,120170,122653,167223,151505,201714,215532,342968,236606,119863,187047]","[56757,56563,56800,57248,57385,57108,57122,57039,57313,57153,56326]"
1500,1500,159,12,50528.5,413311.5,12,"[394030,409576,531320,460968,382021,449567,515021,409478,443806,373018,417047,367500]","[49735,50254,50985,50609,50307,50843,51103,50492,50565,49646,50861,50359]"
1500,1500,23,23,47863.5,748308.5,6,"[726385,795279,723873,716064,770232,810821]","[47856,47871,48106,48281,47772,47611]"
1500,1500,800,24,52267.5,330496.0,22,"[285549,280339,283453,317636,331223,280281,329769,556771,319027,377433,376813,501867,300039,400464,347831,364091,366246,414486,279940,375182,279370,288987]","[52757,52028,51853,51904,52543,51487,52733,52463,52275,52014,52821,52705,52010,53237,54488,52814,52062,51925,52260,52935,52251,52163]"
1500,1500,740,7,56693.0,134415.0,1,"[134415]","[56693]"
1500,1500,47,20,47983.0,647812.0,9,"[681113,694874,606000,722619,621681,608611,680868,647812,608072]","[47670,47853,47983,48647,48155,48076,47753,47879,48855]"
1500,1500,808,23,50955.0,340465.0,1,"[340465]","[50955]"
1500,1500,280,16,50878.0,389529.0,9,"[357340,408849,355196,365640,555933,389529,364891,594073,626254]","[50711,51851,50770,50101,50545,50878,50970,51255,51260]"
1500,1500,95,15,48593.0,597353.0,1,"[597353]","[48593]"
1500,1500,740,25,52207.0,362774.0,11,"[331086,323133,435074,313593,365065,295924,362774,576593,644481,313778,495655]","[50739,52027,51971,53405,51987,51280,52488,53480,52556,52207,52614]"
1500,1500,75,23,48708.5,506061.0,18,"[487036,498552,622639,863318,537609,478737,477201,512776,485394,499346,483567,568788,1161045,788782,514447,481760,499335,574158]","[48706,48706,48838,47501,49674,48437,48989,48994,48711,48797,48846,49217,47936,47696,48439,48216,48588,48916]"
1500,1500,95,5,50392.0,451119.5,14,"[368627,383414,370645,367796,580646,491313,342549,517601,508550,530650,497261,444657,457582,429790]","[50783,50229,51529,50494,50587,50268,50873,50511,50230,50314,50470,50296,49709,49819]"
1500,1500,137,21,49240.0,470456.0,3,"[470456,434805,541095]","[48444,49240,49516]"
1500,1500,23,16,48040.0,740947.0,15,"[780198,746251,740947,916916,800044,717588,722065,672404,670626,668961,804435,713333,708355,1095259,742697]","[48028,48040,48211,47254,47894,47696,47412,48182,48146,47974,48383,48238,47652,48430,48266]"
1500,1500,208,23,49247.0,495200.0,15,"[493616,476114,817753,499563,513988,350958,298807,495200,497835,298606,575388,350429,558045,356652,525771]","[48563,48839,49247,48457,48613,53920,53368,49045,48862,53261,49261,53846,48996,53768,49615]"
1500,1500,759,15,53795.5,230847.5,2,"[259486,202209]","[52815,54776]"
1500,1500,144,20,49569.0,431028.0,7,"[423016,452211,425923,457067,619218,431028,426369]","[49569,49294,49328,49418,50116,50395,49781]"
1500,1500,50,23,48429.0,615671.0,1,"[615671]","[48429]"
1500,1500,69,13,48557.0,610705.0,15,"[524293,525832,611900,602504,523801,610705,635953,779032,504390,833402,677734,565227,741917,511012,634502]","[48486,48442,48727,48587,48494,49494,48292,46646,48388,48756,49182,49299,48377,49164,48557]"
1500,1500,240,15,51977.0,379367.0,9,"[330688,333616,395907,379367,480204,373442,462333,407494,333053]","[50805,51224,51946,52611,52827,51977,52043,51334,52173]"
1500,1500,56,3,50405.0,367279.0,1,"[367279]","[50405]"
1500,1500,47,14,48169.0,629649.0,11,"[565131,629649,570307,650772,628215,563985,697996,563329,695154,857706,713259]","[48509,47872,48522,48207,47628,48169,47292,47973,48643,49017,47598]"
1500,1500,549,4,56966.0,179531.0,16,"[171466,127950,317697,135111,127346,592386,373402,147814,223838,185045,242820,214236,164432,174017,172167,236313]","[56421,56869,56818,57248,57000,57470,56834,56932,57214,57298,57362,56321,56704,57260,56362,57082]"
1500,1500,95,21,49119.5,473994.5,2,"[466963,481026]","[48638,49601]"
1500,1500,31,9,47957.0,636070.0,1,"[636070]","[47957]"
1500,1500,813,3,56932.0,132175.0,9,"[127044,112875,117442,199694,132175,111766,198553,175036,180433]","[56692,56932,57117,56824,56718,56758,57608,57253,57365]"
1500,1500,501,6,55944.0,186867.0,1,"[186867]","[55944]"
1500,1500,57,20,48105.0,645849.0,12,"[620701,642482,605949,622989,781491,597796,701787,649216,656137,661101,616724,705329]","[48135,48078,48202,48025,48107,49389,47876,48103,48296,48111,48026,48075]"
1500,1500,95,14,49377.0,484216.5,22,"[471488,564384,468369,492186,472736,473804,437216,482209,469508,490592,585967,472624,501632,442292,486224,473678,473652,602699,573431,562200,534178,510171]","[49450,48951,50028,49961,48236,48968,49752,48850,49862,49426,49984,48382,48922,49742,48827,49643,49328,48847,49743,49271,48545,49634]"
1500,1500,829,23,53049.0,273289.0,5,"[271142,307156,272277,349423,273289]","[52182,51523,53049,53285,53749]"
1500,1500,494,9,55518.5,193703.5,2,"[160203,227204]","[56747,54290]"
1500,1500,159,2,53679.0,222038.0,1,"[222038]","[53679]"
1500,1500,952,17,53583.0,264045.0,5,"[230455,229218,264045,546241,294168]","[53271,53583,54756,54644,53040]"
1500,1500,327,15,51340.0,331989.0,1,"[331989]","[51340]"
1500,1500,171,20,48684.0,484044.5,2,"[438202,529887]","[48544,48824]"
1500,1500,227,17,50393.5,384217.5,2,"[383394,385041]","[50061,50726]"
1500,1500,938,15,55277.5,208056.0,2,"[209098,207014]","[54984,55571]"
1500,1500,983,16,54722.0,213565.0,1,"[213565]","[54722]"
1500,1500,759,24,52171.0,288866.5,6,"[282978,282505,276646,418896,294755,397246]","[52261,51941,51597,52737,52921,52081]"
1500,1500,751,15,54932.0,201191.0,1,"[201191]","[54932]"
1500,1500,578,24,51428.0,275848.0,1,"[275848]","[51428]"
1500,1500,740,9,56769.0,181282.5,12,"[128492,162317,158073,266366,330871,162232,295413,200243,212985,272429,162322,153121]","[55056,56663,56717,56852,56888,56898,56814,56724,56874,57297,56458,56654]"
1500,1500,895,13,55766.0,220023.5,8,"[196749,184367,262004,190825,289792,194289,243298,267352]","[55410,56010,54500,55834,55871,55277,55876,55698]"
1500,1500,795,23,52538.5,287136.5,4,"[268572,305701,261893,358920]","[52709,52368,50828,52967]"
1500,1500,39,15,48038.0,632037.0,3,"[623739,632037,712403]","[48169,48038,47907]"
1500,1500,727,15,55203.0,210795.0,7,"[204458,205280,245458,210795,201721,252071,347125]","[55400,55557,55203,55102,54588,54455,55896]"
1500,1500,740,20,53757.5,247798.5,12,"[246267,243825,235407,232632,239556,249330,295682,326017,427882,422428,310314,240294]","[53850,53522,53454,52911,54256,53482,52877,55201,53665,54014,53867,54867]"
1500,1500,891,21,52828.0,247200.0,1,"[247200]","[52828]"
1500,1500,673,5,56903.0,197449.0,14,"[125080,117334,278041,149152,171246,212547,330867,227217,187351,207547,270825,170895,239044,118161]","[56532,56829,57079,57425,56487,56494,57125,56629,57717,56050,56835,56971,57447,57341]"
1500,1500,960,13,56100.0,198289.0,4,"[180856,133236,249439,215722]","[56161,56670,55710,56039]"
1500,1500,544,15,55481.0,200494.0,1,"[200494]","[55481]"
1500,1500,494,13,56200.5,263349.0,14,"[199961,237439,379959,233386,251497,206928,257317,279408,304599,276059,269381,327243,334171,194086]","[56357,56333,56766,56591,55992,55732,56145,56319,57143,56026,55315,56256,52919,55760]"
1500,1500,767,16,54819.0,220311.0,12,"[215895,213669,219013,260482,293068,214853,262474,249135,214787,209926,261176,221609]","[54928,54880,54626,54758,55650,55079,55121,54525,54925,53355,53942,54468]"
