evolution$generation,evolution$evaluated,incidence_threshold,lockdown_duration,objective$sum_cont,objective$sum_lockdown_day,evolution$samples,sum_lockdown_day,sum_cont
1500,1500,34,7,61914.5,70.0,42,"[63,70,63,70,77,63,70,70,70,70,77,70,77,77,77,70,70,70,70,70,63,70,63,70,77,63,70,77,70,70,70,70,63,70,70,77,70,77,70,70,70,70]","[61798,62647,61416,62088,63836,61420,61333,61881,62206,62855,61169,61397,61338,62764,62175,61475,61867,62110,62721,61026,62045,61764,62827,63077,61109,60437,59919,60884,62126,63327,62021,61908,61665,62792,62258,60905,62556,61321,60493,62092,61963,61921]"
1500,1500,1192,25,92401.0,0.0,1,"[0]","[92401]"
1500,1500,1243,5,90810.0,5.0,42,"[5,0,5,5,5,5,5,5,5,0,5,0,5,0,0,5,5,5,5,0,5,5,5,5,5,0,0,5,5,5,0,5,5,0,0,5,0,5,5,5,0,0]","[89752,92412,91172,90377,90823,90818,90695,89317,90999,93213,88992,92662,91459,92589,92546,90103,90162,90302,90134,92685,90066,91057,90368,90094,90193,92660,92706,90676,90751,90679,93054,90934,90374,92873,92683,90386,92696,90630,90802,90729,92724,92741]"
1500,1500,1209,7,88752.0,7.0,1,"[7]","[88752]"
1500,1500,96,13,65919.0,52.0,2,"[52,52]","[66320,65518]"
1500,1500,435,17,78520.5,34.0,18,"[34,34,34,34,34,34,17,34,34,17,17,34,34,34,34,17,34,34]","[76610,77635,81563,77422,75440,78086,84992,79565,77589,85952,86069,76316,75645,78955,81105,86895,81720,74639]"
1500,1500,868,23,81747.0,23.0,4,"[23,23,23,23]","[80210,82869,80625,84915]"
1500,1500,224,23,70628.0,46.0,20,"[46,46,46,46,46,46,46,46,46,46,46,46,46,46,46,46,46,46,46,46]","[69167,70408,71310,69837,72038,72639,70665,70591,71873,71412,72611,69176,69144,73053,72041,70156,70134,72445,69581,70210]"
1500,1500,245,22,72009.0,44.0,12,"[44,44,44,44,44,44,44,44,44,44,44,44]","[66918,71315,74442,73735,69864,73030,71589,72808,75246,71635,71540,72383]"
1500,1500,1243,14,87403.0,14.0,1,"[14]","[87403]"
1500,1500,1192,18,85033.0,18.0,23,"[18,18,18,18,18,0,0,18,18,0,0,18,18,0,18,0,18,0,18,18,18,18,0]","[83842,83211,83041,83911,86131,92746,92773,85033,82912,92525,92947,82479,86494,92568,84842,92663,85111,92618,83080,82954,82298,84906,92646]"
1500,1500,299,23,68551.0,46.0,1,"[46]","[68551]"
1500,1500,429,17,77994.0,34.0,2,"[34,34]","[76226,79762]"
1500,1500,198,19,75902.0,38.0,39,"[38,38,38,57,38,57,38,57,38,57,38,38,57,38,57,38,38,38,38,57,38,38,38,57,38,38,38,38,57,38,57,38,57,57,38,38,38,57,38]","[76636,78866,72256,73847,75274,73999,77855,66808,78667,74049,79066,75940,65357,78624,74729,75692,79739,75902,75303,76039,77691,74751,79067,74996,77795,78485,76353,75075,75317,77624,72936,76799,71041,74537,75388,78141,78149,75838,78204]"
1500,1500,34,21,63066.0,63.0,1,"[63]","[63066]"
1500,1500,224,24,68731.5,48.0,8,"[48,48,48,48,48,48,48,48]","[68595,67448,67207,70508,68868,73698,70491,66342]"
1500,1500,1144,7,89503.0,7.0,13,"[7,7,7,7,7,0,7,7,7,0,7,7,7]","[88795,89014,88360,89930,89543,92734,88498,89068,90313,93066,89503,88917,90222]"
1500,1500,163,22,73602.0,44.0,39,"[44,66,66,44,44,44,44,66,44,44,66,44,44,44,44,44,66,44,44,66,44,44,44,66,44,44,44,44,44,44,66,44,66,66,44,44,44,44,44]","[73736,71304,63772,74611,74253,74333,72561,63916,70684,73175,73737,75859,76203,75925,72845,73602,74917,75674,70552,72498,75385,73195,73619,73037,74087,71334,70851,75870,71106,75946,71920,72477,73049,73784,73529,72312,73758,75333,74424]"
1500,1500,1435,19,82900.0,19.0,1,"[19]","[82900]"
1500,1500,163,21,75408.5,42.0,12,"[42,42,42,63,42,42,42,63,63,42,42,42]","[74026,74390,76199,73419,76663,74719,77357,76586,74054,75904,74913,77914]"
1500,1500,108,19,64504.0,57.0,3,"[57,57,57]","[64301,65990,64504]"
1500,1500,266,20,74009.5,40.0,2,"[40,40]","[72186,75833]"
1500,1500,1324,16,83826.0,16.0,1,"[16]","[83826]"
1500,1500,96,19,64066.0,57.0,1,"[57]","[64066]"
1500,1500,961,9,87943.0,9.0,1,"[9]","[87943]"
1500,1500,1192,15,84547.0,15.0,1,"[15]","[84547]"
1500,1500,89,22,61973.0,66.0,1,"[66]","[61973]"
1500,1500,1342,22,81931.0,22.0,5,"[22,22,0,0,22]","[81708,81931,92764,92609,81541]"
1500,1500,1009,10,88609.0,10.0,21,"[10,10,10,10,10,10,10,10,10,10,10,10,10,10,10,10,10,10,10,10,10]","[88609,89745,88448,86376,88660,88454,86920,89126,88212,88937,87242,89262,86410,88899,87248,87064,89312,89116,88537,89113,89740]"
1500,1500,1324,7,92429.0,0.0,42,"[0,7,7,7,7,0,0,0,0,0,0,0,7,7,7,7,7,0,0,0,7,7,7,7,0,0,0,0,0,0,0,0,0,7,0,0,0,7,7,0,7,7]","[92456,88232,89936,89013,88688,92754,92891,92437,92694,92667,92463,93259,89292,89081,88937,89991,89604,93008,92574,92421,89519,89558,88647,88818,92561,92773,92869,92679,92869,92931,92332,92556,92818,89413,92350,93242,92872,88984,89315,92879,88651,90070]"
