evolution$generation,evolution$evaluated,incidence_threshold,lockdown_duration,objective$sum_cont,objective$sum_lockdown_day,evolution$samples,sum_lockdown_day,sum_cont
1500,1500,20,7,66880.5,77.0,34,"[77,77,70,70,70,77,77,63,77,77,77,77,77,70,70,77,70,77,77,63,77,77,63,77,84,70,70,63,77,77,70,77,77,70]","[66499,67391,66686,67520,67767,65649,67765,66679,66570,66853,66300,67102,67242,66908,66571,67028,66521,67506,66733,68081,66279,66392,67758,67541,66758,65592,67254,67373,66983,65087,66638,66682,67584,67373]"
1500,1500,20,13,67933.0,78.0,42,"[78,78,65,78,78,78,78,78,78,78,78,78,65,78,78,78,78,78,78,78,65,91,78,78,65,78,65,78,65,78,78,78,78,65,65,78,65,78,78,78,78,65]","[68626,67985,66963,67944,67622,65113,68092,68072,66979,67277,67580,68197,69490,68660,68089,67070,68195,68183,67140,67922,67534,66231,67473,68331,69081,68050,67794,67417,68466,69149,68398,69258,66548,67264,67319,67760,68094,67219,66477,68542,67616,68083]"
1500,1500,1445,22,95301.5,0.0,22,"[0,0,22,0,22,0,0,0,22,22,0,0,22,0,0,22,0,0,22,0,0,0]","[95249,95432,85626,95369,87864,95087,95354,95672,86577,88494,95527,95601,88852,95157,95767,88142,95486,95087,85459,95448,95646,95379]"
1500,1500,99,14,71114.5,56.0,42,"[56,56,56,56,56,56,56,56,56,56,56,56,56,56,56,56,56,56,56,56,56,56,56,56,56,56,56,56,56,56,56,56,56,56,56,56,56,56,56,56,56,56]","[71083,75141,73160,72451,71239,70553,71442,75598,75953,71785,74209,71778,74192,70070,70917,70366,70551,70792,70186,69109,71483,70037,71098,70151,69970,73187,74340,70698,75099,74168,74793,70807,69603,71131,74052,70788,70733,71586,70497,70626,70363,74803]"
1500,1500,1019,28,85032.0,28.0,1,"[28]","[85032]"
1500,1500,271,22,78570.0,44.0,31,"[44,44,44,44,44,44,44,44,44,44,44,44,44,44,44,44,44,44,44,44,44,44,44,44,44,44,44,44,44,44,44]","[78085,80240,82593,77826,78088,80532,79747,78548,79897,78552,77045,77251,78570,78275,79017,77163,78899,79607,77734,78113,78086,77029,79021,79229,79364,78812,79908,78296,78721,76925,80625]"
1500,1500,282,24,76346.5,48.0,18,"[48,48,48,48,48,48,48,48,48,48,48,48,48,48,48,48,48,48]","[75241,75867,75914,77407,76845,75717,74712,77989,75863,76442,78250,76251,76622,74354,76824,77111,75922,77376]"
1500,1500,209,7,83550.5,35.0,12,"[35,35,35,35,35,35,42,35,35,42,42,42]","[83814,84396,83990,84182,84196,83287,82675,82491,84123,81482,81244,82720]"
1500,1500,1123,5,93451.0,5.0,1,"[5]","[93451]"
1500,1500,987,22,88283.5,22.0,10,"[22,22,22,22,22,22,22,22,22,22]","[87608,86667,88282,88752,88365,88285,88734,86357,88625,88084]"
1500,1500,928,22,86219.0,22.0,1,"[22]","[86219]"
1500,1500,99,10,73771.5,50.0,16,"[50,50,50,50,50,60,50,50,50,60,50,50,50,50,60,60]","[73661,74051,76173,73106,73407,74214,73417,76021,74846,74861,73664,73588,75680,73879,73648,73300]"
1500,1500,198,21,79866.0,42.0,7,"[42,42,42,42,42,42,42]","[80733,80728,80136,79338,79734,79866,79852]"
1500,1500,267,26,74814.0,52.0,38,"[52,52,52,52,52,52,52,52,52,52,52,52,52,52,52,52,52,52,52,52,52,52,52,52,52,52,52,52,52,52,52,52,52,52,52,52,52,52]","[75661,73889,74042,74885,73637,73643,75498,75481,76863,73672,75339,74846,74621,73874,76019,74533,82038,75030,78549,73203,74782,74593,74959,82196,75266,76084,78834,74679,73722,74556,73635,75722,73429,74291,74429,74548,76360,75650]"
1500,1500,853,26,87432.0,26.0,4,"[26,26,26,26]","[85516,87674,87252,87612]"
1500,1500,20,23,69410.0,69.0,33,"[69,69,69,69,92,69,69,69,69,69,69,69,69,69,92,69,69,92,69,69,69,92,92,69,69,69,69,69,69,69,69,69,69]","[68532,68607,69410,70527,69057,68773,69298,68919,69320,68945,70592,69778,70662,70835,69264,69017,71336,69782,70586,69275,71539,69287,69365,69603,70251,69790,69056,69240,70224,69781,69813,69715,69163]"
1500,1500,990,8,92668.5,8.0,2,"[8,8]","[92650,92687]"
1500,1500,377,19,82345.0,38.0,9,"[38,38,38,38,38,38,38,38,38]","[82536,81863,82345,82920,80675,82485,82941,82054,80595]"
1500,1500,1045,16,89618.5,16.0,2,"[16,16]","[89085,90152]"
1500,1500,1231,9,91513.5,9.0,2,"[9,9]","[91183,91844]"
1500,1500,304,20,80726.0,40.0,2,"[40,40]","[80614,80838]"
1500,1500,106,20,70204.0,60.0,19,"[60,60,60,60,60,60,60,60,60,60,60,60,60,60,60,60,60,60,60]","[70745,69856,72221,70131,69739,70398,70950,70808,69894,69805,76047,69521,70378,69560,70204,69646,70029,70462,71921]"
1500,1500,97,18,72656.0,54.0,17,"[54,54,54,54,54,54,54,54,54,72,72,54,54,54,54,54,54]","[72620,73660,74077,73028,72809,71163,71650,70509,71659,72719,73741,72534,73670,71770,71456,73499,72656]"
1500,1500,282,20,81626.0,40.0,9,"[40,40,40,40,40,40,40,40,40]","[81626,81470,82711,81731,83039,81218,80961,81849,80669]"
1500,1500,73,18,72109.0,54.0,1,"[54]","[72109]"
1500,1500,209,16,75860.0,48.0,3,"[48,48,48]","[75860,75564,80515]"
1500,1500,26,16,68220.0,64.0,7,"[64,64,80,64,64,80,64]","[68709,67375,68220,67023,68018,69527,68865]"
1500,1500,990,13,90897.0,13.0,4,"[13,13,13,13]","[89814,90969,90825,91095]"
1500,1500,1445,13,90161.0,13.0,1,"[13]","[90161]"
1500,1500,1297,30,85249.5,30.0,16,"[30,30,30,30,30,0,30,30,30,30,30,0,30,30,0,30]","[84789,85732,86134,83135,84744,95716,85864,83108,84504,82692,85710,95401,83160,83814,95442,87149]"
