{
  "_pkglts": {
    "auto_install": true,
    "install_front_end": "stdout",
    "use_prompts": false,
    "version": 13
  },
  "base": {
    "authors": [
      [
        "moi",
        "moi@email.com"
      ]
    ],
    "namespace": null,
    "pkgname": "gnomon_package_tissuemesh",
    "url": null
  },
  "coverage": {},
  "doc": {
    "description": "belle petite description",
    "fmt": "rst",
    "keywords": []
  },
  "git": {},
  "license": {
    "name": "cecill-c",
    "organization": "organization",
    "project": "{{ base.pkgname }}",
    "year": 2019
  },
  "pysetup": {
    "intended_versions": [
      "36"
    ]
  },
  "reqs": {
    "require": []
  },
  "src": {
    "namespace_method": "pkg_util"
  },
  "test": {
    "suite_name": "nose"
  },
  "version": {
    "major": 0,
    "minor": 2,
    "post": 0
  }
}
