{
  "base": "5.1.1",
  "coverage": "5.1.1",
  "doc": "5.1.1",
  "git": "5.1.1",
  "license": "5.1.1",
  "pysetup": "5.1.1",
  "reqs": "5.1.1",
  "src": "5.1.1",
  "test": "5.1.1",
  "version": "5.1.1"
}