OFF
10 8 0
0 0 -2 
-0.41145 0 -0.566312 
-1.454746 0 -1.295641 
-0.66574 0 0.216312 
-2.604352 0 1.618034 
0 0 0.7 
2.604352 0 1.618034 
0.665739 0 0.216312 
1.454746 0 -1.295641 
0.411449 0 -0.566312 
3 3 2 1 
3 3 1 7 
3 3 7 6 
3 3 6 5 
3 3 5 4 
3 9 8 7 
3 9 7 1 
3 9 1 0 
