OFF
15 26 0
-0.450429 0.187622 0.63579 
-0.488062 0.951677 0.433174 
-0.38033 0.078292 -0.376309 
-0.469708 0.885493 -0.757416 
0.527478 0.187622 0.63579 
0.496323 0.951677 0.433174 
0.47238 0.078292 -0.376309 
0.47797 0.885493 -0.757416 
-2.646506 -0.967673 -1 
-1.204004 -0.967673 0.572415 
3.170303 -0.5977607 -1.027947 
1.292495 -0.967673 0.572415 
0.004131 0.885493 -0.757416 
0.038525 0.187622 0.63579 
0.044243 -0.967673 -1 
3 0 1 3 
3 0 3 2 
3 3 1 12 
3 7 12 5 
3 5 4 7 
3 6 7 4 
3 6 2 12 
3 9 11 13 
3 9 13 0 
3 10 4 11 
3 3 12 2 
3 7 6 12 
3 2 14 8 
3 5 13 4 
3 9 8 14 
3 11 14 10 
3 0 2 8 
3 13 11 4 
3 6 4 10 
3 10 14 6 
3 8 9 0 
3 1 13 5 
3 2 6 14 
3 12 1 5 
3 13 1 0 
3 14 11 9 
