OFF
98 192 0
-2.147062 -1.787245 2.147062 
-2.147062 10.34232 2.14707 
-2.147062 -1.787244 -2.147062 
-2.147062 10.34232 -2.147054 
2.147062 -1.787245 2.147062 
2.147062 10.34232 2.14707 
2.147062 -1.787244 -2.147062 
2.147062 10.34232 -2.147054 
-2.147062 4.277539 2.147066 
-2.147062 -1.787245 -0 
-2.147062 4.277539 4e-06 
0 4.277539 2.147066 
2.147062 4.277539 2.147066 
2.147062 4.27754 4e-06 
0 10.34232 -2.147054 
2.147062 10.34232 8e-06 
2.147062 4.27754 -2.147058 
0 -1.787245 2.147062 
-2.147062 10.34232 8e-06 
-2.147062 4.27754 -2.147058 
0 10.34232 2.14707 
0 -1.787245 -0 
0 10.34232 8e-06 
0 -1.787244 -2.147062 
0 4.27754 -2.147058 
2.147062 -1.787245 -0 
-2.147062 7.309931 2.147068 
-2.147062 -1.787244 -1.073531 
-2.147062 7.309931 -1.073525 
1.073531 1.245147 2.147064 
2.147062 7.309931 2.147068 
2.147062 1.245148 -1.073529 
1.073531 10.34232 -2.147054 
2.147062 10.34232 -1.073523 
2.147062 7.309932 -2.147056 
1.073531 -1.787245 2.147062 
-2.147062 10.34232 -1.073523 
-2.147062 7.309932 -2.147056 
1.073531 10.34232 2.14707 
1.073531 -1.787245 1.073531 
1.073531 10.34232 -1.073523 
1.073531 -1.787244 -2.147062 
1.073531 7.309932 -2.147056 
2.147062 -1.787244 -1.073531 
-2.147062 1.245147 2.147064 
-2.147062 -1.787245 1.073531 
-2.147062 1.245147 1.073533 
-1.073531 7.309931 2.147068 
2.147062 1.245147 2.147064 
2.147062 7.309932 1.073537 
-1.073531 10.34232 -2.147054 
2.147062 10.34232 1.073539 
2.147062 1.245148 -2.14706 
-1.073531 -1.787245 2.147062 
-2.147062 10.34232 1.073539 
-2.147062 1.245148 -2.14706 
-1.073531 10.34232 2.14707 
-1.073531 -1.787244 -1.073531 
-1.073531 10.34232 1.073539 
-1.073531 -1.787244 -2.147062 
-1.073531 1.245148 -2.14706 
2.147062 -1.787245 1.073531 
-2.147062 4.277539 -1.073527 
-2.147062 1.245147 2e-06 
-2.147062 1.245148 -1.073529 
1.073531 10.34232 1.073539 
0 10.34232 1.073539 
1.073531 10.34232 8e-06 
0 -1.787244 -1.073531 
1.073531 -1.787245 -0 
1.073531 -1.787244 -1.073531 
0 10.34232 -1.073523 
-1.073531 10.34232 8e-06 
-1.073531 10.34232 -1.073523 
1.073531 7.309931 2.147068 
1.073531 4.277539 2.147066 
0 7.309931 2.147068 
2.147062 7.309932 -1.073525 
2.147062 7.309932 6e-06 
2.147062 4.27754 -1.073527 
-1.073531 -1.787245 1.073531 
0 -1.787245 1.073531 
-1.073531 -1.787245 -0 
0 1.245148 -2.14706 
1.073531 4.27754 -2.147058 
1.073531 1.245148 -2.14706 
-1.073531 7.309932 -2.147056 
0 7.309932 -2.147056 
-1.073531 4.27754 -2.147058 
-1.073531 4.277539 2.147066 
0 1.245147 2.147064 
-1.073531 1.245147 2.147064 
-2.147062 7.309931 1.073537 
-2.147062 4.277539 1.073535 
-2.147062 7.309931 6e-06 
2.147062 1.245148 2e-06 
2.147062 4.277539 1.073535 
2.147062 1.245147 1.073533 
3 5 30 49 
3 0 44 46 
3 35 4 29 
3 7 42 32 
3 7 34 42 
3 4 35 39 
3 5 49 51 
3 48 29 4 
3 58 54 1 
3 39 61 4 
3 1 56 58 
3 46 45 0 
3 28 62 10 
3 62 63 10 
3 64 27 9 
3 20 38 65 
3 65 66 20 
3 40 22 67 
3 57 68 21 
3 68 69 21 
3 43 25 70 
3 22 40 71 
3 71 72 22 
3 73 36 18 
3 30 74 12 
3 74 75 12 
3 47 11 76 
3 15 77 33 
3 15 78 77 
3 13 31 79 
3 17 53 80 
3 80 81 17 
3 21 82 57 
3 24 83 60 
3 24 84 83 
3 16 52 85 
3 14 86 50 
3 14 87 86 
3 24 60 88 
3 89 11 47 
3 90 11 89 
3 53 17 91 
3 8 26 92 
3 92 93 8 
3 10 94 28 
3 13 95 31 
3 13 96 95 
3 12 48 97 
3 97 61 25 
3 97 48 61 
3 48 4 61 
3 95 97 25 
3 95 96 97 
3 96 12 97 
3 31 43 6 
3 31 95 43 
3 95 25 43 
3 94 18 36 
3 36 28 94 
3 36 3 28 
3 92 18 94 
3 93 92 94 
3 93 94 10 
3 26 1 54 
3 54 92 26 
3 54 18 92 
3 91 8 44 
3 53 91 44 
3 53 44 0 
3 91 89 8 
3 90 89 91 
3 91 17 90 
3 47 1 26 
3 89 47 26 
3 89 26 8 
3 88 55 19 
3 88 60 55 
3 60 2 55 
3 86 88 19 
3 86 87 88 
3 87 24 88 
3 50 37 3 
3 50 86 37 
3 86 19 37 
3 85 41 23 
3 85 52 41 
3 52 6 41 
3 83 85 23 
3 83 84 85 
3 84 16 85 
3 60 59 2 
3 60 83 59 
3 83 23 59 
3 82 9 27 
3 27 57 82 
3 27 2 57 
3 80 9 82 
3 81 80 82 
3 81 82 21 
3 53 0 45 
3 45 80 53 
3 45 9 80 
3 79 52 16 
3 79 31 52 
3 31 6 52 
3 77 79 16 
3 77 78 79 
3 78 13 79 
3 33 34 7 
3 33 77 34 
3 77 16 34 
3 76 20 56 
3 47 76 56 
3 47 56 1 
3 76 74 20 
3 75 74 76 
3 11 75 76 
3 5 38 30 
3 74 30 38 
3 74 38 20 
3 73 14 50 
3 36 73 50 
3 36 50 3 
3 73 71 14 
3 72 71 73 
3 73 18 72 
3 7 32 40 
3 32 71 40 
3 32 14 71 
3 23 41 70 
3 41 43 70 
3 6 43 41 
3 70 68 23 
3 69 68 70 
3 70 25 69 
3 57 2 59 
3 68 57 59 
3 23 68 59 
3 33 67 15 
3 67 33 40 
3 40 33 7 
3 65 15 67 
3 66 65 67 
3 66 67 22 
3 38 5 51 
3 51 65 38 
3 51 15 65 
3 64 19 55 
3 27 64 55 
3 27 55 2 
3 64 62 19 
3 63 62 64 
3 64 9 63 
3 28 3 37 
3 62 28 37 
3 62 37 19 
3 46 10 63 
3 45 46 63 
3 45 63 9 
3 56 20 66 
3 66 58 56 
3 66 22 58 
3 39 21 69 
3 61 39 69 
3 25 61 69 
3 58 22 72 
3 54 58 72 
3 54 72 18 
3 48 12 75 
3 75 29 48 
3 75 11 29 
3 51 78 15 
3 51 49 78 
3 49 13 78 
3 35 17 81 
3 81 39 35 
3 81 21 39 
3 42 84 24 
3 42 34 84 
3 34 16 84 
3 32 87 14 
3 32 42 87 
3 42 24 87 
3 11 90 29 
3 90 35 29 
3 17 35 90 
3 44 8 93 
3 93 46 44 
3 93 10 46 
3 49 96 13 
3 49 30 96 
3 30 12 96 
