# vtk DataFile Version 2.0
Unstructured Grid
ASCII
DATASET UNSTRUCTURED_GRID
POINTS 14 double
1 -1 -1
1 -1 1
-1 -1 1
-1 -1 -1
1 1 -0.99999899999999997
0.99999899999999997 1 1.0000009999999999
-1 1 1
-1 1 -1
0 -1 0
-2.4999999999999999e-07 1 4.9999999999999998e-07
0.99999979999999999 0 4.9999999999999998e-07
-2.4999999999999999e-07 0 1
-1 0 0
0 0 -0.99999979999999999

CELLS 24 120
4     9    5   10    4
4    13    3    0    8
4     7   12    9    6
4    11    9    5   10
4     1   11    5   10
4    12    7    9   13
4    12    6    2   11
4    12    9    6   11
4     9    6   11    5
4    10   13    0    8
4    12    3    7   13
4     1   10    0    8
4     9    7    4   13
4    10    9    4   13
4    12    9   11   13
4    11    9   10   13
4     4   10   13    0
4    12    3   13    8
4     3   12    2    8
4     2   11    1    8
4     1   11   10    8
4    10   11   13    8
4     2   12   11    8
4    11   12   13    8

CELL_TYPES 24
10
10
10
10
10
10
10
10
10
10
10
10
10
10
10
10
10
10
10
10
10
10
10
10

