OFF
24 44 0
-1.005179 -0.234784 0.11437 
-1.005179 0.037725 0.097951 
-1.005179 -0.234721 -0.016716 
-1.005179 -0.079434 -0.03971 
1.010668 -0.234784 0.11437 
1.010668 0.037725 0.097951 
1.010668 -0.234721 -0.016716 
1.010668 -0.079434 -0.03971 
-1.002514 0.082713 -0.192403 
-1.005179 -0.033205 -0.273331 
1.010668 -0.033205 -0.273331 
1.013333 0.082713 -0.192403 
-1.005179 0.034814 -0.322596 
-1.005179 -0.016929 -0.373608 
1.010668 -0.016929 -0.373608 
1.010668 0.034814 -0.322596 
-1.005179 -0.234785 -0.268281 
1.010668 -0.234785 -0.268281 
-1.005179 -0.234678 -0.381251 
1.010668 -0.234678 -0.381251 
1.013333 0.325326 -0.257319 
-1.002514 0.325326 -0.257319 
1.010668 0.307958 -0.367027 
-1.005179 0.307958 -0.367027 
3 1 3 2 
3 1 2 0 
3 3 7 6 
3 3 6 2 
3 7 5 4 
3 7 4 6 
3 5 1 0 
3 5 0 4 
3 0 2 6 
3 0 6 4 
3 7 3 9 
3 7 9 10 
3 8 11 20 
3 8 20 21 
3 5 7 10 
3 5 10 11 
3 3 1 8 
3 3 8 9 
3 1 5 11 
3 1 11 8 
3 15 14 13 
3 15 13 12 
3 9 13 18 
3 9 18 16 
3 11 10 14 
3 11 14 15 
3 9 8 12 
3 9 12 13 
3 17 16 18 
3 17 18 19 
3 10 9 16 
3 10 16 17 
3 14 10 17 
3 14 17 19 
3 13 14 19 
3 13 19 18 
3 21 20 22 
3 21 22 23 
3 11 15 22 
3 11 22 20 
3 12 8 21 
3 12 21 23 
3 15 12 23 
3 15 23 22 
