OFF
152 300 0
0.141843 -0.114657 -0.228583 
0.115187 -0.042017 -0.240659 
0.109564 -0.038448 -0.063128 
0.144443 -0.084635 -0.068397 
-0.134404 -0.084438 -0.065558 
-0.114015 -0.042612 -0.070143 
-0.098005 -0.044358 -0.239657 
-0.126519 -0.122924 -0.235066 
0.000253 -0.128786 -0.047529 
0.002968 -0.167913 -0.247684 
0.040314 -0.216791 -0.168666 
0.027639 -0.186653 -0.03745 
0.149688 -0.19963 -0.184568 
0.160189 -0.144047 -0.044954 
-0.037204 -0.184082 -0.027403 
-0.036484 -0.226793 -0.163747 
-0.146512 -0.197504 -0.183315 
-0.154684 -0.141159 -0.044196 
-0.166279 -0.255934 -0.133317 
-0.181765 -0.257249 -0.029524 
-0.066672 -0.283849 -0.016184 
-0.054501 -0.267477 -0.125582 
-0.079084 -0.31193 -0.017647 
-0.065351 -0.309257 -0.156784 
-0.174692 -0.281624 -0.153784 
-0.195785 -0.283928 -0.03331 
-0.181626 -0.305026 -0.171927 
-0.204897 -0.319151 -0.042728 
-0.089976 -0.335177 -0.026467 
-0.072173 -0.330193 -0.16854 
-0.135534 -0.507448 -0.106685 
-0.116648 -0.506247 -0.223578 
-0.209951 -0.489896 -0.229597 
-0.232584 -0.484425 -0.123277 
-0.226527 -0.573064 -0.253051 
-0.261983 -0.575998 -0.148737 
-0.128921 -0.580581 -0.237269 
-0.139533 -0.588788 -0.12258 
-0.168167 -0.535928 0.002463 
-0.164868 -0.581158 0.009726 
-0.254113 -0.575901 -0.006442 
-0.23862 -0.526178 -0.009897 
0.181416 -0.256571 -0.011192 
0.174528 -0.24829 -0.135762 
0.052884 -0.268205 -0.009573 
0.067707 -0.257332 -0.133292 
0.19162 -0.32032 -0.170074 
0.206189 -0.316445 -0.036332 
0.231327 -0.49257 -0.117568 
0.194874 -0.494764 -0.223133 
0.072495 -0.336777 -0.028557 
0.113204 -0.508374 -0.108437 
0.077053 -0.327585 -0.178378 
0.111427 -0.504972 -0.225293 
0.117275 -0.578814 -0.240298 
0.107017 -0.604985 -0.14971 
0.202055 -0.560109 -0.250981 
0.246866 -0.580033 -0.139574 
0.261481 -0.521668 0.004264 
0.263334 -0.57853 0.003541 
0.157248 -0.587858 0.016765 
0.15106 -0.532294 0.015071 
-0.112896 0.011013 -0.05146 
-0.105512 0.016428 -0.219407 
0.108774 0.021028 -0.215737 
0.110682 0.015176 -0.044445 
0.136684 0.103386 -0.188146 
0.134351 0.042426 0.012073 
-0.150595 0.055365 0.00023 
-0.143688 0.10021 -0.181724 
0.175482 0.23216 -0.150969 
0.092737 0.205942 0.039096 
0.192228 0.172201 0.03152 
0.240835 0.181985 -0.066562 
0.181327 0.050232 -0.000498 
0.229696 0.0793 -0.106597 
0.306727 0.044627 -0.078695 
0.260472 0.019308 0.009403 
0.328716 0.158258 -0.031905 
0.263987 0.147825 0.038957 
0.322902 0.112834 0.075565 
0.374397 0.124259 0.016402 
0.316542 0.013577 0.053155 
0.363672 0.028512 -0.015129 
0.395511 0.025904 0.025911 
0.35229 -0.00384 0.085662 
0.409077 0.09714 0.049837 
0.363324 0.082235 0.106355 
0.412891 0.049901 0.149591 
0.45051 0.068913 0.084291 
0.452608 0.002684 0.064674 
0.406893 -0.011653 0.135256 
0.522631 -0.046703 0.125785 
0.463153 -0.054441 0.197238 
0.520234 0.007749 0.139764 
0.464618 -0.004722 0.20422 
0.101083 0.294643 -0.118272 
0.073685 0.248714 0.063245 
-0.152698 0.241853 -0.149075 
-0.088707 0.221372 0.005327 
-0.079471 0.249703 0.073407 
-0.060292 0.304875 -0.13019 
-0.003126 0.057049 0.03298 
0.002247 0.117676 -0.233485 
0.011026 0.230455 -0.202019 
-0.006324 0.165998 0.059396 
-0.239826 0.18513 -0.079287 
-0.211528 0.161381 0.030302 
-0.208207 0.051646 0.012337 
-0.238709 0.081628 -0.111202 
-0.265577 0.028059 0.018255 
-0.303669 0.037539 -0.08266 
-0.33869 0.150269 -0.04478 
-0.285593 0.13841 0.045377 
-0.400555 0.113454 0.036893 
-0.372737 0.102467 0.1087 
-0.344728 0.006068 0.092513 
-0.384824 0.019191 0.013706 
-0.398389 -0.023868 0.129984 
-0.442633 -0.019706 0.059234 
-0.4631 0.072211 0.080624 
-0.420084 0.053185 0.151218 
-0.534294 0.001624 0.137101 
-0.47424 -0.000923 0.213244 
-0.463104 -0.046085 0.207811 
-0.520323 -0.051186 0.124865 
-0.012609 0.182104 0.123651 
-0.011464 0.26049 0.131321 
-0.078751 0.291058 0.086133 
0.063222 0.283566 0.089227 
-0.066831 0.3208 -0.045359 
0.066833 0.311199 -0.035156 
0.044888 0.345326 0.067898 
-0.009951 0.356779 0.085654 
-0.056536 0.33881 0.067859 
-0.010053 0.358324 -0.009897 
0.385256 -0.020316 0.167751 
0.381956 -0.046691 0.159094 
0.352581 -0.042623 0.145407 
0.358392 -0.005689 0.15746 
-0.384701 -0.050618 0.150045 
-0.385838 -0.018914 0.171651 
-0.360108 0.004191 0.157664 
-0.358086 -0.037144 0.135122 
0.07238 -0.292458 -0.155835 
0.062689 -0.302491 -0.019065 
0.182714 -0.286588 -0.16363 
0.193803 -0.286508 -0.023762 
0.008591 -0.043187 -0.240158 
0.002869 0.020057 -0.22256 
-0.00283 -0.041509 -0.060142 
-0.000783 0.005896 -0.039241 
3 0 1 2 
3 0 2 3 
3 4 5 6 
3 4 6 7 
3 4 8 5 
3 8 3 2 
3 0 9 1 
3 9 7 6 
3 8 9 10 
3 8 10 11 
3 9 0 12 
3 9 12 10 
3 3 8 11 
3 3 11 13 
3 0 3 13 
3 0 13 12 
3 9 8 14 
3 9 14 15 
3 7 9 15 
3 7 15 16 
3 8 4 17 
3 8 17 14 
3 4 7 16 
3 4 16 17 
3 17 16 18 
3 17 18 19 
3 14 17 19 
3 14 19 20 
3 16 15 21 
3 16 21 18 
3 15 14 20 
3 15 20 21 
3 21 20 22 
3 21 22 23 
3 18 21 23 
3 18 23 24 
3 20 19 25 
3 20 25 22 
3 19 18 24 
3 19 24 25 
3 25 24 26 
3 25 26 27 
3 22 25 27 
3 22 27 28 
3 24 23 29 
3 24 29 26 
3 23 22 28 
3 23 28 29 
3 29 28 30 
3 29 30 31 
3 26 29 31 
3 26 31 32 
3 28 27 33 
3 28 33 30 
3 27 26 32 
3 27 32 33 
3 33 32 34 
3 33 34 35 
3 32 31 36 
3 32 36 34 
3 31 30 37 
3 31 37 36 
3 37 35 34 
3 37 34 36 
3 37 30 38 
3 37 38 39 
3 35 37 39 
3 35 39 40 
3 33 35 40 
3 33 40 41 
3 30 33 41 
3 30 41 38 
3 38 41 40 
3 38 40 39 
3 12 13 42 
3 12 42 43 
3 13 11 44 
3 13 44 42 
3 10 12 43 
3 10 43 45 
3 11 10 45 
3 11 45 44 
3 46 47 48 
3 46 48 49 
3 47 50 51 
3 47 51 48 
3 52 46 49 
3 52 49 53 
3 50 52 53 
3 50 53 51 
3 51 53 54 
3 51 54 55 
3 53 49 56 
3 53 56 54 
3 49 48 57 
3 49 57 56 
3 57 55 54 
3 57 54 56 
3 57 48 58 
3 57 58 59 
3 55 57 59 
3 55 59 60 
3 51 55 60 
3 51 60 61 
3 48 51 61 
3 48 61 58 
3 58 61 60 
3 58 60 59 
3 6 5 62 
3 6 62 63 
3 2 1 64 
3 2 64 65 
3 65 64 66 
3 65 66 67 
3 63 62 68 
3 63 68 69 
3 70 71 72 
3 70 72 73 
3 71 67 74 
3 71 74 72 
3 66 70 73 
3 66 73 75 
3 67 66 75 
3 67 75 74 
3 74 75 76 
3 74 76 77 
3 75 73 78 
3 75 78 76 
3 72 74 77 
3 72 77 79 
3 73 72 79 
3 73 79 78 
3 78 79 80 
3 78 80 81 
3 79 77 82 
3 79 82 80 
3 76 78 81 
3 76 81 83 
3 77 76 83 
3 77 83 82 
3 82 83 84 
3 82 84 85 
3 83 81 86 
3 83 86 84 
3 80 82 85 
3 80 85 87 
3 81 80 87 
3 81 87 86 
3 86 87 88 
3 86 88 89 
3 84 86 89 
3 84 89 90 
3 85 84 90 
3 85 90 91 
3 91 90 92 
3 91 92 93 
3 90 89 94 
3 90 94 92 
3 88 91 93 
3 88 93 95 
3 89 88 95 
3 89 95 94 
3 93 92 94 
3 93 94 95 
3 71 70 96 
3 71 96 97 
3 98 99 100 
3 98 100 101 
3 67 102 65 
3 102 68 62 
3 69 103 63 
3 103 66 64 
3 66 103 104 
3 66 104 70 
3 103 69 98 
3 103 98 104 
3 68 102 105 
3 68 105 99 
3 102 67 71 
3 102 71 105 
3 99 105 100 
3 105 71 97 
3 104 101 96 
3 70 104 96 
3 104 98 101 
3 99 98 106 
3 99 106 107 
3 68 99 107 
3 68 107 108 
3 98 69 109 
3 98 109 106 
3 69 68 108 
3 69 108 109 
3 109 108 110 
3 109 110 111 
3 106 109 111 
3 106 111 112 
3 108 107 113 
3 108 113 110 
3 107 106 112 
3 107 112 113 
3 113 112 114 
3 113 114 115 
3 110 113 115 
3 110 115 116 
3 112 111 117 
3 112 117 114 
3 111 110 116 
3 111 116 117 
3 117 116 118 
3 117 118 119 
3 114 117 119 
3 114 119 120 
3 115 114 120 
3 115 120 121 
3 121 120 122 
3 121 122 123 
3 118 121 123 
3 118 123 124 
3 120 119 125 
3 120 125 122 
3 119 118 124 
3 119 124 125 
3 125 124 123 
3 125 123 122 
3 97 126 105 
3 126 100 105 
3 100 126 127 
3 100 127 128 
3 126 97 129 
3 126 129 127 
3 96 101 130 
3 96 130 131 
3 101 100 128 
3 101 128 130 
3 97 96 131 
3 97 131 129 
3 127 129 132 
3 127 132 133 
3 128 127 133 
3 128 133 134 
3 135 131 130 
3 130 128 134 
3 130 134 135 
3 129 131 132 
3 131 135 132 
3 133 132 135 
3 135 134 133 
3 91 88 136 
3 91 136 137 
3 85 91 137 
3 85 137 138 
3 88 87 139 
3 88 139 136 
3 87 85 138 
3 87 138 139 
3 139 138 137 
3 139 137 136 
3 121 118 140 
3 121 140 141 
3 115 121 141 
3 115 141 142 
3 118 116 143 
3 118 143 140 
3 116 115 142 
3 116 142 143 
3 143 142 141 
3 143 141 140 
3 45 144 145 
3 45 145 44 
3 144 52 50 
3 144 50 145 
3 43 146 144 
3 43 144 45 
3 146 46 52 
3 146 52 144 
3 44 145 147 
3 44 147 42 
3 145 50 47 
3 145 47 147 
3 42 147 146 
3 42 146 43 
3 147 47 46 
3 147 46 146 
3 6 148 9 
3 148 1 9 
3 1 148 149 
3 1 149 64 
3 148 6 63 
3 148 63 149 
3 64 149 103 
3 149 63 103 
3 2 150 8 
3 150 5 8 
3 5 150 151 
3 5 151 62 
3 150 2 65 
3 150 65 151 
3 62 151 102 
3 151 65 102 
