OFF
8 12 0
-2.147062 -1.787245 2.147062 
-2.147062 10.34232 2.147064 
-2.147062 -1.787244 -2.147062 
-2.147062 10.34232 -2.14706 
2.147062 -1.787245 2.147062 
2.147062 10.34232 2.147064 
2.147062 -1.787244 -2.147062 
2.147062 10.34232 -2.14706 
3 0 1 3 
3 0 3 2 
3 2 3 7 
3 2 7 6 
3 6 7 5 
3 6 5 4 
3 4 5 1 
3 4 1 0 
3 2 6 4 
3 2 4 0 
3 7 3 1 
3 7 1 5 
