OFF
10 8 0
-1.191407 -0.018777 -0.079577 
0.671139 0 1.2627 
-0.671139 0 1.2627 
0 0 0.678907 
0 0 -0.915978 
-0.260927 0 -0.079577 
1.131896 0.000486 -0.074004 
0.351856 0 0.34827 
-0.390305 -0.012547 0.347089 
0.242046 0 -0.079577 
3 8 0 5 
3 3 2 8 
3 5 4 9 
3 9 6 7 
3 7 1 3 
3 3 8 7 
3 9 7 5 
3 7 8 5 
