OFF
118 232 0
0.707858 6.47066 2.7147 
3.87379 9.07391 -1.60809 
0.086881 12.0778 5.63023 
-1.1961 9.8866 6.40421 
2.93637 6.67251 -1.98605 
-4.44344 8.19817 -0.527852 
-5.70765 12.6351 2.03718 
-1.88477 10.7735 -5.38214 
-0.703838 8.05546 -4.79158 
-5.33304 11.1151 3.558 
5.5158 24.569 2.2291 
6.61883 18.899 4.92703 
5.96051 19.636 0.261005 
6.19072 25.1908 0.246807 
-4.69627 24.4429 2.59969 
-6.4497 25.1558 0.115884 
-6.35594 20.2301 0.725306 
-5.54964 19.1028 5.26435 
4.81103 26.1818 -4.74199 
5.61693 25.6404 -5.58516 
5.46643 19.4761 -5.31954 
4.81415 19.2119 -6.91627 
-6.04601 26.0361 -4.36928 
-5.99909 19.2123 -5.73337 
-6.58698 19.9297 -3.70637 
-6.85937 25.7622 -3.9208 
1.98936 14.4062 -0.089612 
1.79818 14.3704 -2.34649 
1.54348 14.3105 2.01866 
-2.19491 14.3265 0.88461 
-1.39956 14.3125 1.96035 
-2.16838 14.474 -2.17027 
-5.51439 18.7134 -0.980305 
4.87814 18.4487 -1.92247 
0.210815 27.3445 -3.6992 
4.72228 26.3758 0.184593 
-3.86323 27.0061 2.17254 
-0.287145 26.4571 5.42166 
5.85416 32.7462 -1.20823 
2.80824 33.3923 -3.97188 
-5.257862 34.2386 1.847726 
2.14855 34.6074 5.18205 
-3.40241 6.29288 -1.22985 
1.37235 4.90715 1.76692 
-0.991113 5.87984 -4.15096 
2.57457 4.97598 -1.89159 
-3.39598 0.784003 -0.284216 
-6.29314 4.25141 -0.606693 
-7.78156 3.59389 -1.07329 
-5.07983 -1.0084 -0.241848 
-5.02301 4.10685 -4.28809 
-6.77745 3.23242 -4.79241 
-2.92445 0.842767 -4.68226 
-4.57662 -0.6878 -4.63994 
-1.51822 0.199416 -3.40219 
-1.62029 -1.70167 -3.43065 
-1.70498 -2.02568 -0.522609 
-1.78007 -0.105496 -0.100606 
-0.10947 5.87555 4.38346 
-4.97251 6.85498 1.78295 
-5.86919 9.02661 4.64969 
-2.13897 8.09411 7.14356 
-6.04725 7.59551 4.09949 
-4.46609 7.62488 7.1348 
-1.65293 5.06063 5.73712 
-3.64729 4.66957 2.27356 
-3.24684 4.3359 7.74245 
-4.76861 3.10025 3.31038 
-7.32168 5.85178 4.26637 
-7.06447 5.9295 8.30571 
-8.50968 3.69387 5.21939 
-7.81434 3.59209 8.59315 
-5.77375 1.94624 4.35501 
-3.97299 2.80458 8.24201 
-2.67215 5.10294 11.0902 
-3.33947 3.24717 11.6966 
-6.67589 3.84788 11.9632 
-5.74796 6.28204 11.4737 
-1.36548 2.25536 -2.25805 
-3.09667 5.19397 -4.11689 
-2.39085 3.01166 0.684672 
-4.81829 6.15959 -1.1715 
6.72609 28.9674 -0.21559 
1.50476 30.0375 6.71148 
-4.74132 31.2476 1.25104 
0.860171 30.0629 -5.15399 
-9.79172 20.244 0.555334 
-10.4415 18.8729 -3.19142 
-9.02465 24.3477 -0.741282 
-9.85096 22.924 -4.68664 
-14.9155 21.5687 0.43297 
-13.6987 24.4207 -2.6622 
-10.3243 25.1578 0.294122 
-11.384 22.5606 2.80996 
-11.29553 29.50439 0.7406288 
-13.73144 24.80891 5.628464 
-15.1864 28.0924 -0.041959 
-15.9709 25.6719 3.17814 
-14.64074 32.1384 7.151634 
-20.79603 32.64854 3.166966 
-19.35527 36.16817 -0.3871249 
-13.4986 33.46285 4.291831 
11.3491 19.7471 -3.74241 
9.46908 20.2912 -0.115154 
11.4903 23.336 -6.04703 
9.51096 24.518 -1.99283 
10.8468 21.3203 0.150178 
10.8608 24.5725 -1.78507 
12.1628 22.5689 -6.19999 
12.8877 19.3431 -3.51006 
15.481 20.7541 1.73064 
11.209 22.8446 2.07697 
16.8203 23.6822 -1.59903 
12.7753 25.1817 -1.22185 
12.3423 25.8112 6.87584 
14.1931 28.7855 3.49361 
18.675 26.2081 2.36939 
17.0746 23.0406 5.49549 
3 0 1 2 
3 3 0 2 
3 0 4 1 
3 5 6 7 
3 8 5 7 
3 5 9 6 
3 10 11 12 
3 12 13 10 
3 14 15 16 
3 16 17 14 
3 18 19 20 
3 20 21 18 
3 22 23 24 
3 24 25 22 
3 26 1 7 
3 27 26 7 
3 26 28 1 
3 29 6 2 
3 30 29 2 
3 29 31 6 
3 32 16 24 
3 23 32 24 
3 32 17 16 
3 33 20 12 
3 11 33 12 
3 33 21 20 
3 8 7 1 
3 8 1 4 
3 1 28 30 
3 1 30 2 
3 3 2 6 
3 3 6 9 
3 27 7 6 
3 27 6 31 
3 27 31 23 
3 27 23 21 
3 30 28 11 
3 30 11 17 
3 17 11 10 
3 17 10 14 
3 21 23 22 
3 21 22 18 
3 18 22 34 
3 18 34 35 
3 22 14 36 
3 22 36 34 
3 14 10 37 
3 14 37 36 
3 10 18 35 
3 10 35 37 
3 38 39 40 
3 38 40 41 
3 0 5 42 
3 0 42 43 
3 5 8 44 
3 5 44 42 
3 4 0 43 
3 4 43 45 
3 8 4 45 
3 8 45 44 
3 46 47 48 
3 46 48 49 
3 47 50 51 
3 47 51 48 
3 50 52 53 
3 50 53 51 
3 53 49 48 
3 53 48 51 
3 53 52 54 
3 53 54 55 
3 49 53 55 
3 49 55 56 
3 46 49 56 
3 46 56 57 
3 52 46 57 
3 52 57 54 
3 54 57 56 
3 54 56 55 
3 5 0 58 
3 5 58 59 
3 9 5 59 
3 9 59 60 
3 0 3 61 
3 0 61 58 
3 3 9 60 
3 3 60 61 
3 61 60 62 
3 61 62 63 
3 58 61 63 
3 58 63 64 
3 60 59 65 
3 60 65 62 
3 59 58 64 
3 59 64 65 
3 65 64 66 
3 65 66 67 
3 62 65 67 
3 62 67 68 
3 64 63 69 
3 64 69 66 
3 63 62 68 
3 63 68 69 
3 69 68 70 
3 69 70 71 
3 68 67 72 
3 68 72 70 
3 67 66 73 
3 67 73 72 
3 73 71 70 
3 73 70 72 
3 73 66 74 
3 73 74 75 
3 71 73 75 
3 71 75 76 
3 69 71 76 
3 69 76 77 
3 66 69 77 
3 66 77 74 
3 74 77 76 
3 74 76 75 
3 45 78 79 
3 45 79 44 
3 78 52 50 
3 78 50 79 
3 43 80 78 
3 43 78 45 
3 80 46 52 
3 80 52 78 
3 44 79 81 
3 44 81 42 
3 79 50 47 
3 79 47 81 
3 42 81 80 
3 42 80 43 
3 81 47 46 
3 81 46 80 
3 35 82 83 
3 35 83 37 
3 82 38 41 
3 82 41 83 
3 37 83 84 
3 37 84 36 
3 83 41 40 
3 83 40 84 
3 36 84 85 
3 36 85 34 
3 84 40 39 
3 84 39 85 
3 34 85 82 
3 34 82 35 
3 85 39 38 
3 85 38 82 
3 14 22 25 
3 14 25 15 
3 24 16 86 
3 24 86 87 
3 16 15 88 
3 16 88 86 
3 15 25 89 
3 15 89 88 
3 25 24 87 
3 25 87 89 
3 89 87 90 
3 89 90 91 
3 88 89 91 
3 88 91 92 
3 86 88 92 
3 86 92 93 
3 87 86 93 
3 87 93 90 
3 90 93 94 
3 90 94 95 
3 93 92 96 
3 93 96 94 
3 92 91 97 
3 92 97 96 
3 91 90 95 
3 91 95 97 
3 97 95 98 
3 97 98 99 
3 96 97 99 
3 96 99 100 
3 94 96 100 
3 94 100 101 
3 95 94 101 
3 95 101 98 
3 98 101 100 
3 98 100 99 
3 18 10 13 
3 18 13 19 
3 12 20 102 
3 12 102 103 
3 20 19 104 
3 20 104 102 
3 19 13 105 
3 19 105 104 
3 13 12 103 
3 13 103 105 
3 105 103 106 
3 105 106 107 
3 104 105 107 
3 104 107 108 
3 102 104 108 
3 102 108 109 
3 103 102 109 
3 103 109 106 
3 106 109 110 
3 106 110 111 
3 109 108 112 
3 109 112 110 
3 108 107 113 
3 108 113 112 
3 107 106 111 
3 107 111 113 
3 113 111 114 
3 113 114 115 
3 112 113 115 
3 112 115 116 
3 110 112 116 
3 110 116 117 
3 111 110 117 
3 111 117 114 
3 114 117 116 
3 114 116 115 
3 31 29 32 
3 31 32 23 
3 29 30 17 
3 29 17 32 
3 28 26 33 
3 28 33 11 
3 26 27 21 
3 26 21 33 
