# vtk DataFile Version 2.0
Unstructured Grid
ASCII
DATASET UNSTRUCTURED_GRID
POINTS 127 double
0.48167700000000002 7.6819300000000004 2.5933790000000001
4.3771800000000001 11.988799999999999 3.9401799999999998
-4.3189099999999998 11.6212 3.94014
-4.6619900000000003 9.1858000000000004 1.9623820000000001
5.2078100000000003 9.7478599999999993 1.688272
0.333735 7.8470209999999998 -3.9282789999999999
-4.4047700000000001 11.68 -4.9274079999999998
4.4151600000000002 12.194000000000001 -5.0186679999999999
5.4645000000000001 10.117900000000001 -3.0899969999999999
-4.5205500000000001 9.2279610000000005 -3.205079
5.5157999999999996 24.568999999999999 2.5311159999999999
3.9760300000000002 17.952999999999999 3.6636850000000001
5.9605100000000002 19.635999999999999 0.26100800000000002
6.1907199999999998 26.03443 0.34450399999999998
-4.6962700000000002 24.647220000000001 2.9017059999999999
-6.4497039999999997 25.360119999999998 0.864452
-6.3559400000000004 20.2301 1.4738739999999999
-3.9273500000000001 18.0854 3.8827750000000001
4.8110299999999997 26.181799999999999 -4.7419849999999997
5.6169289999999998 25.64038 -5.7760280000000002
5.4664299999999999 19.476099999999999 -5.510408
4.8141499999999997 19.2119 -6.9162650000000001
-6.0460099999999999 26.24042 -5.01023
-6.1626890000000003 19.212299999999999 -5.7333660000000002
-6.7505790000000001 19.9297 -4.347321
-6.8593650000000004 25.96651 -4.56175
3.8731300000000002 14.4018 -0.26892300000000002
3.5785399999999998 14.418200000000001 -4.4566280000000003
2.9548700000000001 14.259499999999999 3.8638509999999999
-3.8504299999999998 14.315 -0.292265
-2.6701600000000001 14.2735 3.8477610000000002
-4.1746990000000004 14.5322 -4.0070480000000002
-5.6779890000000002 18.7134 -0.98030200000000001
4.8781400000000001 18.448699999999999 -1.922466
-3.40266 27.030999999999999 -2.0283250000000002
2.6155300000000001 26.883099999999999 -2.396055
-2.2547700000000002 24.8811 4.6984849999999998
2.6062599999999998 24.952200000000001 4.5896049999999997
1.51953 32.883600000000001 -0.674875
-2.2183299999999999 33.008299999999998 -0.59649099999999999
-1.91103 32.228299999999997 3.8556460000000001
1.62036 32.159999999999997 3.7165659999999998
2.0774599999999999 6.7130599999999996 -2.9900790000000002
2.1392500000000001 6.7540690000000003 2.8145509999999998
5.6502800000000004 7.9274209999999998 -2.4626890000000001
5.6285800000000004 8.07029 1.8518110000000001
5.3220499999999999 2.8971200000000001 2.3652310000000001
3.2900499999999999 1.9173 -1.5630500000000001
3.88612 0.16614100000000001 -2.0510700000000002
6.1325900000000004 0.38343300000000002 2.8558500000000002
6.5023900000000001 3.6721499999999998 -2.9002889999999999
7.2247199999999996 1.5996699999999999 -3.3813
8.9152199999999997 4.1738499999999998 0.122975
9.5793900000000001 1.8019689999999999 0.44618099999999999
9.3430099999999996 3.94855 2.7194310000000002
10.152900000000001 2.0658289999999999 3.2519100000000001
7.9839399999999996 1.243479 5.0374600000000003
6.7794100000000004 2.9815990000000001 4.6048900000000001
-0.86041599999999996 6.4712699999999996 2.9745189999999999
-1.1297759999999999 5.9488209999999997 -2.8192789999999999
-4.8437299999999999 6.9201800000000002 -2.5641690000000001
-4.9786900000000003 7.05375 2.0148510000000002
-4.8659299999999996 5.2523 -2.8408989999999998
-5.6528520000000002 5.3710599999999999 0.71160100000000004
-1.6961660000000001 4.3854889999999997 1.6867490000000001
-0.78151700000000002 3.8524379999999998 -2.4107409999999998
-3.5816699999999999 2.8040099999999999 2.0758809999999999
-1.6811100000000001 1.8174300000000001 -2.1173099999999998
-5.1221699999999997 3.14975 -3.2950300000000001
-6.8852500000000001 3.7759 -0.28480499999999997
-5.6296799999999996 0.32671600000000001 -3.0373199999999998
-7.4937100000000001 1.142239 -0.120574
-2.5299 -0.041735000000000001 -1.79542
-4.3624200000000002 0.98595900000000003 2.2606099999999998
-5.4371700000000001 3.9897089999999999 4.7734699999999997
-6.2262399999999998 1.874269 5.1360609999999998
-8.9153500000000001 1.924509 3.05525
-8.0456299999999992 4.6629100000000001 2.8393709999999999
6.3029000000000002 5.6995800000000001 1.1956009999999999
5.9476699999999996 5.8079400000000003 -2.6708889999999998
3.3674599999999999 4.5667400000000002 1.814371
2.81569 4.152901 -2.518249
3.28051 29.9771 -3.085804
3.6003400000000001 28.925699999999999 4.606986
-3.3272499999999998 29.002600000000001 5.0151060000000003
-4.11477 29.9878 -2.6504840000000001
-9.7917199999999998 20.244 1.3039019999999999
-10.4415 18.872900000000001 -3.8323710000000002
-9.0246469999999999 24.347740000000002 0.0072859999999999999
-9.8509600000000006 22.923999999999999 -5.3275899999999998
-11.9293 18.9437 -2.2061359999999999
-10.849220000000001 22.371659999999999 -5.2245699999999999
-10.07286 24.243259999999999 -1.1547190000000001
-10.875500000000001 21.179099999999998 1.399084
-14.4574 23.9925 3.3263449999999999
-16.651800000000001 21.4864 0.063454999999999998
-13.733610000000001 26.483070000000001 0.552755
-15.7005 24.108499999999999 -2.6689310000000002
-21.318999999999999 24.296299999999999 2.3083149999999999
-20.465900000000001 26.5291 -0.0033349999999999999
-16.423999999999999 29.179600000000001 2.9365260000000002
-17.9161 26.404599999999999 5.6692150000000003
8.4788700000000006 18.750900000000001 -4.8749089999999997
8.6288900000000002 20.121829999999999 -0.951623
8.6200500000000009 22.3398 -7.1795280000000004
8.6707739999999998 24.348569999999999 -2.8292929999999998
9.76816 21.167729999999999 -0.69375399999999998
9.3470399999999998 23.5763 -3.6252450000000001
9.2925199999999997 21.572700000000001 -7.141616
10.0175 18.346900000000002 -4.4516859999999996
15.424099999999999 19.863199999999999 -3.0915159999999999
13.606 22.591899999999999 0.37092199999999997
14.7651 23.173200000000001 -6.2638550000000004
12.934699999999999 25.287800000000001 -2.957605
18.646000000000001 24.0913 2.7085949999999999
18.285799999999998 27.359999999999999 -0.88271100000000002
19.533300000000001 24.307400000000001 -5.0202349999999996
19.810099999999998 20.866 -1.7879959999999999
-4.4190905113267425 25.499926243900418 -1.3563420373570219
-6.281980779831386 3.2645870523716534 3.059865709466322
4.9677168475063294 4.3153233242493529 0.56159846039309858
-10.453858656090425 22.044904997793452 -3.2374778189885083
-2.5105127912446914 5.4432080381307077 -0.98461446081027593
-0.84046614094571814 7.1781361469471454 0.29115034956341729
-8.2209588810806355 22.856071861147328 -2.5924630885504465
-12.837509569818343 22.718709408049204 0.23677509019028906
-4.9248185018497619 4.0455842212247388 -0.32658297595721258

CELLS 292 1460
4     2   30    1    0
4   103   20  107  102
4     4    0    5   42
4    18   10   35   12
4   107  102   20  104
4    23  118   35   34
4    34   85   38   82
4    95   98  101   94
4    57   53   54   55
4    16  118   14   32
4     2    3   30    0
4    17   32   16   14
4    43   45   80   42
4    46   55   49   53
4     4   45   42   44
4     8    4    5   42
4    67  122  126   66
4    42  120   81   44
4    44  120   81   79
4     4    7    8    5
4    68  122   67   62
4     3  122  123   61
4     4    7    1    8
4    97   98   96   99
4    98  100  101   94
4   121   93   90   87
4    71  119   76   75
4   102  107  108  104
4    99   96  100   94
4    97  121   92  125
4   124   16   86   24
4    21  118   23   20
4    28   29    0   30
4     3    6   29    9
4    28    1    0   26
4   124   16   15   88
4    55   54   57   56
4   121   97   95  125
4   122   67   62   65
4    98  100   94   99
4    69   68   63  126
4    37  118   10   14
4   124  118   24   22
4    97  125   92   96
4    16  124   86   88
4    93   96  125   94
4     0    7    1    4
4   118   23   22   34
4    22   36  118   34
4    98   97   96   95
4    64   69  126   66
4    97  125   96   95
4    72  126   73   67
4    96   98   95   94
4    72  126   67   68
4    34   39   85   36
4    19   33   20  105
4    29   17   30   11
4    34   39   38   85
4    36   84   37   83
4   126  122   62   63
4     9  122   60   59
4    64   69   63  126
4    50  120   79   47
4     3   29   30    0
4    64  123   59  122
4    61  122   63   62
4   123    9   60    3
4   121  124   87   89
4   118   12   14   33
4   118   17   33   14
4    13   12  105  103
4    31   32   29   33
4    15   89   25  124
4    26  123    5    0
4   126   73   66   69
4    67  126   73   66
4   126   72   70   68
4    22  124   25   24
4    52   57   46   53
4     3   29    2   30
4    51   46   47   48
4    80   52   46  120
4    66   77   69  119
4    35   36   41   38
4    38   84   40   39
4    52   57   53   54
4    20  103  107  105
4   113  114  111  116
4    43   78   80   45
4     8   45    4   44
4    30   28    1    0
4    50  120   53   52
4   119   71   69   73
4    29   28   11   30
4    10  118   12   14
4   121   95   91   90
4    28   29   11   33
4    36   35   83   37
4    28   29   26    0
4    83   40   41   36
4    45   43    4   42
4    27   33   29   26
4    46   51   47  120
4    93   96   92  125
4    64  123   58   59
4    26   21   27   33
4    88   91   89  121
4    19   12   33  105
4   108  113  107  112
4    96   98   94   99
4    18   10   12   13
4    32  124   24   16
4   121   97   92   91
4    83   40   36   84
4   121   86  124   88
4    34   38   35   82
4   125  121   90   95
4    38   40   36   41
4    36   39   85   84
4    82   41   38   35
4    12   18   33   35
4     8    4   42   44
4   110  113  116  112
4    45  120   79   78
4    20  103  105   12
4   105  106  103  107
4    25  118   22   14
4    34   39   36   38
4   104  105   20  107
4    67  122   66   65
4    68  122  126   67
4    66  122   64   65
4    12   20   33  105
4    31   23   32   33
4    27   23   33   21
4    32   17   29   33
4    29   17   11   33
4    12   17   33   11
4    19   13   12  105
4    50  120   52   78
4    13   19   12   18
4     9  122   59  123
4    38   84   39   36
4   118   17   32   33
4    12   17   11   10
4    14  124   15   25
4    21   34   23   35
4    21   34   35   18
4    66   77  119   74
4    14   12   17   33
4   118   23   33   32
4    20  118   23   33
4   118   12   33   35
4    76   69   77  119
4   107  111  110  113
4   107  102  108  109
4   123    9    5   59
4   122   61   63   58
4   114  111  116  117
4    71  126   73   70
4    70  126   68   69
4    72  126   70   73
4    19   33   18   20
4    19   12   18   33
4    18   33   35   20
4    21   18   35   20
4    21  118   35   23
4    21   23   33   20
4    20  118   33   35
4    46   51  120   53
4     5   58    0  123
4    51  120   53   50
4    43    0    4   42
4   110  106  107  109
4   107  108  112  109
4   110  107  112  109
4   113  114  116  115
4   111  110  113  116
4   110  111  117  116
4   110  107  113  112
4   113  115  116  112
4    33   27   29   31
4   106  103  107  109
4   107  103  102  109
4    27    6    7    5
4    42  120   45   80
4    21   34   22   23
4     5   44    8   42
4   119   71   76   69
4    26   27    7    5
4     9    6   29    5
4    46   55   53   57
4    10  118   35   12
4   118  124   16   14
4     7    0   26    5
4    46   55   57   56
4    31    6   27    5
4     6   31   29    5
4    29   31   27    5
4    26   29   27    5
4   123   29    3    0
4    26  123   29    5
4    14   12   10   17
4    14  124   16   15
4   107  111  106  110
4    42  120   80   81
4   120   42   45   44
4    51  120   50   47
4    37  118   35   10
4    21  118   20   35
4    35   36   83   41
4    27   23   31   33
4   120   79   47   81
4    38   84   36   40
4    53  120   46   52
4     0    7    4    5
4    49   51   48   46
4    49   51   46   53
4    49   51   53   48
4    86  121   93   92
4     0    7   26    1
4    82   41   35   83
4    34   21   22   18
4    28   29   33   26
4   104  105   19   20
4    86  121  124   87
4    59   65   64  122
4    60   65  122   62
4    71  126   69   73
4   118   37   36   14
4    61  123    3    0
4   123   61   58    0
4    44  120   79   45
4     9  123   29    3
4    55   46   49   56
4   118  124   32   16
4     2    6   29    3
4    38   35   36   34
4    36   34   35  118
4    37  118   36   35
4   118   17   14   32
4    23  118   22   24
4   118   23   32   24
4    22   36   14  118
4   118  124   24   32
4    74   76   77  119
4    20  103   12  102
4    76   74   75  119
4   119   71   73   75
4    74   73   75  119
4    66   73   74  119
4    66   69   73  119
4   120   50   79   78
4    81   46   47  120
4    80   52  120   78
4    45  120   78   80
4    46   81   80  120
4    90   89   91  121
4    86  121   87   93
4    89   90   87  121
4   121   86   88   92
4    88   91  121   92
4   121  124   89   88
4    64  123  122   58
4   122   63   64   58
4   122   61   60   62
4    60   65   59  122
4    61  122  123   58
4     3  122   61   60
4     5   58  123   59
4     3  122   60  123
4     9  122  123   60
4   121   93  125   90
4    26  123    0   29
4   123    9   29    5
4    87   25   89  124
4   124   86   87   24
4    25   87   24  124
4   124  118   22   25
4    15   89  124   88
4   118  124   14   25
4    95   96   94  125
4   121   97   91   95
4    94   90   95  125
4    93  121  125   92
4    90   94   93  125
4    71  126   70   69
4    68   62   63  126
4    68  122   62  126
4   126  122   63   64
4    66  122  126   64

CELL_TYPES 292
10
10
10
10
10
10
10
10
10
10
10
10
10
10
10
10
10
10
10
10
10
10
10
10
10
10
10
10
10
10
10
10
10
10
10
10
10
10
10
10
10
10
10
10
10
10
10
10
10
10
10
10
10
10
10
10
10
10
10
10
10
10
10
10
10
10
10
10
10
10
10
10
10
10
10
10
10
10
10
10
10
10
10
10
10
10
10
10
10
10
10
10
10
10
10
10
10
10
10
10
10
10
10
10
10
10
10
10
10
10
10
10
10
10
10
10
10
10
10
10
10
10
10
10
10
10
10
10
10
10
10
10
10
10
10
10
10
10
10
10
10
10
10
10
10
10
10
10
10
10
10
10
10
10
10
10
10
10
10
10
10
10
10
10
10
10
10
10
10
10
10
10
10
10
10
10
10
10
10
10
10
10
10
10
10
10
10
10
10
10
10
10
10
10
10
10
10
10
10
10
10
10
10
10
10
10
10
10
10
10
10
10
10
10
10
10
10
10
10
10
10
10
10
10
10
10
10
10
10
10
10
10
10
10
10
10
10
10
10
10
10
10
10
10
10
10
10
10
10
10
10
10
10
10
10
10
10
10
10
10
10
10
10
10
10
10
10
10
10
10
10
10
10
10
10
10
10
10
10
10
10
10
10
10
10
10
10
10
10
10
10
10

