OFF
49 94 0
-1.768774 -2.893647 1.768695 
-1.768774 -2.317631 1.768695 
-1.768774 -2.893647 -1.772503 
-1.768774 -2.317631 -1.772503 
1.772424 -2.893647 1.768695 
1.772424 -2.317631 1.768695 
1.772424 -2.893647 -1.772503 
1.772424 -2.317631 -1.772503 
-1.105877 -2.138322 1.105798 
-1.105877 -2.138322 -1.109607 
1.109527 -2.138322 -1.109607 
1.109527 -2.138322 1.105798 
-1.105877 0.409809 1.543714 
-1.105877 0.409809 -1.547523 
1.109527 0.409809 -1.547523 
1.109527 0.409809 1.543714 
-1.310974 3.067363 1.543715 
-1.310974 3.067363 -1.547523 
1.314625 3.067363 -1.547523 
1.314625 3.067363 1.543715 
-0.257254 4.785367 0.2167 
-0.257254 4.785367 -0.220507 
0.260905 4.785367 -0.220507 
0.260905 4.785367 0.2167 
-1.925807 0.409809 1.543714 
-1.925807 0.409809 -1.547523 
1.929457 0.409809 -1.547523 
1.929457 0.409809 1.543714 
-1.925807 3.067363 1.543715 
-1.925807 3.067363 -1.547523 
1.929457 3.067363 -1.547523 
1.929457 3.067363 1.543715 
-1.105877 0.533003 -2.631746 
1.109527 0.533003 -2.631746 
1.109527 0.533003 2.627937 
-1.105877 0.533003 2.627937 
-1.105877 3.067364 -2.631746 
1.109527 3.067364 -2.631746 
1.109527 3.067363 2.627938 
-1.105877 3.067363 2.627938 
-5.441402 -0.431622 2.522457 
-5.441402 -0.431621 -2.526266 
5.445052 -0.431621 -2.526266 
5.445052 -0.431622 2.522457 
-5.441402 3.908793 2.522457 
-5.441402 3.908794 -2.526265 
5.445052 3.908794 -2.526265 
5.445052 3.908793 2.522457 
0.001825 8.224065 -0.001904 
3 0 1 3 
3 0 3 2 
3 6 2 3 
3 3 7 6 
3 6 7 5 
3 6 5 4 
3 4 5 1 
3 4 1 0 
3 2 6 4 
3 2 4 0 
3 5 7 10 
3 5 10 11 
3 8 11 15 
3 8 15 12 
3 3 1 8 
3 3 8 9 
3 1 5 11 
3 1 11 8 
3 9 10 3 
3 7 3 10 
3 16 17 29 
3 16 29 28 
3 14 10 9 
3 14 9 13 
3 11 10 14 
3 11 14 15 
3 9 8 12 
3 9 12 13 
3 19 18 22 
3 19 22 23 
3 18 19 31 
3 18 31 30 
3 15 19 38 
3 15 38 34 
3 13 17 36 
3 13 36 32 
3 21 20 48 
3 22 21 48 
3 17 16 20 
3 17 20 21 
3 16 19 23 
3 16 23 20 
3 21 22 17 
3 18 17 22 
3 29 25 41 
3 29 41 45 
3 25 24 40 
3 25 40 41 
3 17 13 25 
3 17 25 29 
3 19 15 27 
3 19 27 31 
3 15 14 26 
3 15 26 27 
3 13 12 24 
3 13 24 25 
3 12 16 28 
3 12 28 24 
3 18 26 14 
3 30 26 18 
3 35 34 38 
3 35 38 39 
3 33 32 37 
3 36 37 32 
3 19 16 39 
3 19 39 38 
3 36 17 18 
3 18 37 36 
3 16 12 35 
3 16 35 39 
3 12 15 34 
3 12 34 35 
3 18 14 37 
3 33 37 14 
3 14 13 32 
3 14 32 33 
3 43 42 46 
3 43 46 47 
3 41 40 44 
3 41 44 45 
3 31 27 43 
3 31 43 47 
3 30 31 47 
3 30 47 46 
3 27 26 42 
3 27 42 43 
3 24 28 44 
3 24 44 40 
3 28 29 45 
3 28 45 44 
3 42 26 30 
3 46 42 30 
3 23 48 20 
3 23 22 48 
