<?xml version="1.0" encoding="UTF-8"?>
<!DOCTYPE schema[
    <!ENTITY ch_adr_common_part_1_XACMLAuthzDecisionQuery SYSTEM "common_parts/ch_adr_common_part_1_XACMLAuthzDecisionQuery.txt">
    <!ENTITY ch_adr_common_part_2_XACMLAuthzDecisionQuery_Request SYSTEM "common_parts/ch_adr_common_part_2_XACMLAuthzDecisionQuery_Request.txt">
    <!ENTITY ch_adr_common_part_3_XACMLAuthzDecisionQuery_Request_Subject SYSTEM "common_parts/ch_adr_common_part_3_XACMLAuthzDecisionQuery_Request_Subject.txt">
    <!ENTITY ch_adr_common_part_4_XACMLAuthzDecisionQuery_Request_Action SYSTEM "common_parts/ch_adr_common_part_4_XACMLAuthzDecisionQuery_Request_Action.txt">
    <!ENTITY ch_adr_common_part_5_XACMLAuthzDecisionQuery_Request_Environment SYSTEM "common_parts/ch_adr_common_part_5_XACMLAuthzDecisionQuery_Request_Environment.txt">
]>
<sch:schema xmlns:sch="http://purl.oclc.org/dsdl/schematron" queryBinding="xslt2"
            xmlns:sqf="http://www.schematron-quickfix.com/validator/process"
            xmlns:xsl="http://www.w3.org/1999/XSL/Transform">



            <!-- Namespaces -->
            <sch:ns uri="http://www.w3.org/2001/XMLSchema-instance" prefix="xsi"/>
            <sch:ns uri="urn:e-health-suisse:2015:policy-administration" prefix="epr"/>
            <sch:ns uri="urn:oasis:names:tc:SAML:2.0:assertion" prefix="saml"/>
            <sch:ns uri="http://www.w3.org/2003/05/soap-envelope" prefix="soap"/>
            <sch:ns uri="urn:oasis:names:tc:xacml:2.0:policy:schema:os" prefix="xacml"/>
            <sch:ns uri="urn:oasis:xacml:2.0:saml:assertion:schema:os" prefix="xacml-saml" />
            <sch:ns uri="urn:oasis:names:tc:xacml:2.0:profile:saml2.0:v2:schema:protocol" prefix="xacml-samlp"/>
            <sch:ns uri="urn:oasis:names:tc:xacml:2.0:context:schema:os" prefix="xacml-context"/>
            <sch:ns uri="urn:oasis:names:tc:SAML:2.0:protocol" prefix="samlp" />
            <sch:ns uri="urn:hl7-org:v3" prefix="hl7"/>

    <!-- Rules for the general structure of an ADR due to PPQ request
         @author d.zandes -->
    <sch:pattern>
        
        <!-- Variables declared for further use -->
        <sch:let name="regex_oid" value="string('^(\d+\.)*\d+$')" />
        <sch:let name="regex_urn_oid" value="string('^urn:oid:(\d+\.)*\d+$')" />
        <sch:let name="regex_purpOfUse_oid" value="string('^(\d+\.)*(\d|[x]*)+$')" />
        <sch:let name="regex_urn" value="string('^urn:(([a-zA-Z0-9_.-])+:)*([a-zA-Z0-9])+$')" />
        
        <sch:let name="role_patient" value="string('^Patient\(in\)+$')" />
        <sch:let name="role_behande" value="string('^Behandelnde\(r\)+$')" />
        <sch:let name="role_hilfspe" value="string('^Hilfsperson+$')" />
        <sch:let name="role_stellve" value="string('^Stellvertreter\(in\)+$')" />
        
        <!-- Rule 1: XACMLAuthzDecisionQuery -->
        &ch_adr_common_part_1_XACMLAuthzDecisionQuery;
        
        <!-- Rule 2: XACMLAuthzDecisionQuery/Request -->
        <sch:rule context="/xacml-samlp:XACMLAuthzDecisionQuery/xacml-context:Request">
            &ch_adr_common_part_2_XACMLAuthzDecisionQuery_Request;
        </sch:rule>
        
        <!-- Rule 3: XACMLAuthzDecisionQuery/Request/Subject -->
        &ch_adr_common_part_3_XACMLAuthzDecisionQuery_Request_Subject;
             
        <!-- Rule 4: XACMLAuthzDecisionQuery/Request/Resource -->
        <sch:rule context="/xacml-samlp:XACMLAuthzDecisionQuery/xacml-context:Request/xacml-context:Resource">
            
            <!-- CH-ADR-31 -->
            <sch:assert test="count(*[@AttributeId='urn:oasis:names:tc:xacml:1.0:resource:resource-id']) = 1">
                Error : The Resource element shall contain an Attribute child element with AttributeId equal to urn:oasis:names:tc:xacml:1.0:resource:resource-id
            </sch:assert>
            <sch:report test="count(*[@AttributeId='urn:oasis:names:tc:xacml:1.0:resource:resource-id']) = 1">
                Success : The Resource element shall contain an Attribute child element with AttributeId equal to urn:oasis:names:tc:xacml:1.0:resource:resource-id
            </sch:report>
            
            <sch:assert test="count(*[@AttributeId='urn:e-health-suisse:2015:epr-spid']) = 1">
                Error : The Resource element shall contain an Attribute child element with AttributeId equal to urn:e-health-suisse:2015:epr-spid
            </sch:assert>
            <sch:report test="count(*[@AttributeId='urn:e-health-suisse:2015:epr-spid']) = 1">
                Success : The Resource element shall contain an Attribute child element with AttributeId equal to urn:e-health-suisse:2015:epr-spid
            </sch:report>
            
            <sch:assert test="count(*[@AttributeId='urn:e-health-suisse:2015:policy-attributes:referenced-policy-set']) = 1">
                Error : The Resource element shall contain an Attribute child element with AttributeId equal to urn:ihe:iti:xds-b:2007:confidentiality-code (when ADR due to XDS)
                        or urn:e-health-suisse:2015:policy-attributes:referenced-policy-set (when ADR due to PPQ)
            </sch:assert>
            <sch:report test="count(*[@AttributeId='urn:e-health-suisse:2015:policy-attributes:referenced-policy-set']) = 1">
                Success : The Resource element shall contain an Attribute child element with AttributeId equal to urn:ihe:iti:xds-b:2007:confidentiality-code (when ADR due to XDS)
                        or urn:e-health-suisse:2015:policy-attributes:referenced-policy-set (when ADR due to PPQ)
            </sch:report>
            
            <!-- DataType check -->  
            <sch:assert test="every $i in *[@AttributeId='urn:oasis:names:tc:xacml:1.0:resource:resource-id'] satisfies matches($i/@DataType, '(.*:)?anyURI')">
                Error : The DataType of Resource's Attribute child element with AttributeId equal to urn:oasis:names:tc:xacml:1.0:resource:resource-id shall be considered a URI and - as a result - set to http://www.w3.org/2001/XMLSchema#anyURI
            </sch:assert>
            <sch:report test="every $i in *[@AttributeId='urn:oasis:names:tc:xacml:1.0:resource:resource-id'] satisfies matches($i/@DataType, '(.*:)?anyURI')">
                Success : The DataType of Resource's Attribute child element with AttributeId equal to urn:oasis:names:tc:xacml:1.0:resource:resource-id shall be considered a URI and - as a result - set to http://www.w3.org/2001/XMLSchema#anyURI
            </sch:report>
            
            <sch:assert test="every $i in *[@AttributeId='urn:e-health-suisse:2015:epr-spid'] satisfies matches($i/@DataType, '(.*:)?II')">
                Error : The DataType of Resource's Attribute child element with AttributeId equal to urn:e-health-suisse:2015:epr-spid shall be considered a II (InstanceIdentifier) and - as a result - set to urn:hl7-org:v3#II
            </sch:assert>
            <sch:report test="every $i in *[@AttributeId='urn:e-health-suisse:2015:epr-spid'] satisfies matches($i/@DataType, '(.*:)?II')">
                Success : The DataType of Resource's Attribute child element with AttributeId equal to urn:e-health-suisse:2015:epr-spid shall be considered a II (InstanceIdentifier) and - as a result - set to urn:hl7-org:v3#II
            </sch:report>
            
            <sch:assert test="every $i in *[@AttributeId='urn:e-health-suisse:2015:policy-attributes:referenced-policy-set'] satisfies matches($i/@DataType, '(.*:)?anyURI')">
                Error : In case of ADR due to XDS, the DataType of Resource's Attribute child element with AttributeId equal to urn:ihe:iti:xds-b:2007:confidentiality-code shall be considered a CV (CodedValue) and 
                    - as a result - set to urn:hl7-org:v3#CV. 
                    In case of ADR due to PPQ, the DataType of Resource's Attribute child element with AttributeId equal to urn:e-health-suisse:2015:policy-attributes:referenced-policy-set shall be considered a URI and 
                    - as a result - set to http://www.w3.org/2001/XMLSchema#anyURI
            </sch:assert>
            <sch:report test="every $i in *[@AttributeId='urn:e-health-suisse:2015:policy-attributes:referenced-policy-set'] satisfies matches($i/@DataType, '(.*:)?anyURI')">
                Success : In case of ADR due to XDS, the DataType of Resource's Attribute child element with AttributeId equal to urn:ihe:iti:xds-b:2007:confidentiality-code shall be considered a CV (CodedValue) and 
                    - as a result - set to urn:hl7-org:v3#CV. 
                    In case of ADR due to PPQ, the DataType of Resource's Attribute child element with AttributeId equal to urn:e-health-suisse:2015:policy-attributes:referenced-policy-set shall be considered a URI and 
                    - as a result - set to http://www.w3.org/2001/XMLSchema#anyURI
            </sch:report>
            
            <!-- Check if Attribute/AttributeValues are empty -->
            <sch:assert test="*[@AttributeId='urn:oasis:names:tc:xacml:1.0:resource:resource-id']/normalize-space(*)">
                Error : The AttributeValue for Resource's Attribute child element with AttributeId equal to urn:oasis:names:tc:xacml:1.0:resource:resource-id shall not be empty 
            </sch:assert>
             <sch:report test="*[@AttributeId='urn:oasis:names:tc:xacml:1.0:resource:resource-id']/normalize-space(*)">
                Success : The AttributeValue for Resource's Attribute child element with AttributeId equal to urn:oasis:names:tc:xacml:1.0:resource:resource-id shall not be empty 
            </sch:report>
            
            <sch:assert test="*[@AttributeId='urn:e-health-suisse:2015:policy-attributes:referenced-policy-set']/normalize-space(*)">
                Error : The AttributeValue for Resource's Attribute child element with AttributeId equal to urn:e-health-suisse:2015:policy-attributes:referenced-policy-set shall not be empty 
            </sch:assert>
             <sch:report test="*[@AttributeId='urn:e-health-suisse:2015:policy-attributes:referenced-policy-set']/normalize-space(*)">
                Success : The AttributeValue for Resource's Attribute child element with AttributeId equal to urn:e-health-suisse:2015:policy-attributes:referenced-policy-set shall not be empty 
            </sch:report>
            
            <!-- Check if Attribute/AttributeValues follow their data type -->
            <sch:assert test="*[@AttributeId='urn:e-health-suisse:2015:epr-spid']/xacml-context:AttributeValue/hl7:InstanceIdentifier">
                Error : The AttributeValue for Resource's Attribute child element with AttributeId equal to urn:e-health-suisse:2015:epr-spid shall convey the patient's national identifier as an hl7:InstanceIdentifier element
            </sch:assert>
            <sch:report test="*[@AttributeId='urn:e-health-suisse:2015:epr-spid']/xacml-context:AttributeValue/hl7:InstanceIdentifier">
                Success : The AttributeValue for Resource's Attribute child element with AttributeId equal to urn:e-health-suisse:2015:epr-spid shall convey the patient's national identifier as an hl7:InstanceIdentifier element
            </sch:report>
            
            <sch:assert test="*[@AttributeId='urn:e-health-suisse:2015:epr-spid']/xacml-context:AttributeValue/hl7:InstanceIdentifier/@root != ''">
                Error : The hl7:CodedValue element conveyed within the AttributeValue of the Resource's Attribute child element with AttributeId equal to urn:e-health-suisse:2015:epr-spid shall contain a 
                    non-empty root attribute
            </sch:assert>
            <sch:report test="*[@AttributeId='urn:e-health-suisse:2015:epr-spid']/xacml-context:AttributeValue/hl7:InstanceIdentifier/@root != ''">
                Success : The hl7:CodedValue element conveyed within the AttributeValue of the Resource's Attribute child element with AttributeId equal to urn:e-health-suisse:2015:epr-spid shall contain a 
                    non-empty root attribute
            </sch:report>
            
            <sch:assert test="matches(*[@AttributeId='urn:e-health-suisse:2015:epr-spid']/xacml-context:AttributeValue/hl7:InstanceIdentifier/@root, $regex_oid)">
                Error : The hl7:InstanceIdentifier element conveyed within the AttributeValue of the Resource's Attribute child element with AttributeId equal to urn:e-health-suisse:2015:epr-spid shall contain a 
                    non-empty root attribute that follows OID syntax
            </sch:assert>
            <sch:report test="matches(*[@AttributeId='urn:e-health-suisse:2015:epr-spid']/xacml-context:AttributeValue/hl7:InstanceIdentifier/@root, $regex_oid)">
                Success : The hl7:InstanceIdentifier element conveyed within the AttributeValue of the Resource's Attribute child element with AttributeId equal to urn:e-health-suisse:2015:epr-spid shall contain a 
                    non-empty root attribute that follows OID syntax
            </sch:report>
            
            <sch:assert test="*[@AttributeId='urn:e-health-suisse:2015:epr-spid']/xacml-context:AttributeValue/hl7:InstanceIdentifier/@extension != ''">
                Error : The hl7:CodedValue element conveyed within the AttributeValue of the Resource's Attribute child element with AttributeId equal to urn:e-health-suisse:2015:epr-spid shall contain a 
                    non-empty extension attribute
            </sch:assert>
            <sch:report test="*[@AttributeId='urn:e-health-suisse:2015:epr-spid']/xacml-context:AttributeValue/hl7:InstanceIdentifier/@extension != ''">
                Success : The hl7:CodedValue element conveyed within the AttributeValue of the Resource's Attribute child element with AttributeId equal to urn:e-health-suisse:2015:epr-spid shall contain a 
                    non-empty extension attribute
            </sch:report>
            
            <!-- Similar check as above (that will check CH-ADR-32, 33) will be done for Attribute with AttributeId equal to urn:e-health-suisse:2015:policy-attributes:referenced-policy-set
                by the time it becomes clear whether it should convey a CodedValue element or just a URN (Jira issue created for it) -->
                  
        </sch:rule>
        
        <!-- Rule 5: XACMLAuthzDecisionQuery/Request/Action -->
        &ch_adr_common_part_4_XACMLAuthzDecisionQuery_Request_Action;
        
        <!-- Rule 6: XACMLAuthzDecisionQuery/Request/Action/Attribute -->
        <sch:rule context="/xacml-samlp:XACMLAuthzDecisionQuery/xacml-context:Request/xacml-context:Action/xacml-context:Attribute">
            
            <!-- CH-ADR-36, CH-ADR-37 -->
            <sch:assert test="count(*) = 1 and count(xacml-context:AttributeValue) = 1">
                Error : The Action's Attribute child element shall contain only one child element, namely AttributeValue
            </sch:assert>
            <sch:report test="count(*) = 1 and count(xacml-context:AttributeValue) = 1">
                Success : The Action's Attribute child element shall contain only one child element, namely AttributeValue
            </sch:report>
            
            <sch:assert test="*[1]='urn:e-health-suisse:2015:policy-administration:PolicyQuery'
                            or *[1]='urn:e-health-suisse:2015:policy-administration:AddPolicy'
                            or *[1]='urn:e-health-suisse:2015:policy-administration:UpdatePolicy'
                            or *[1]='urn:e-health-suisse:2015:policy-administration:DeletePolicy'">
                Error : The AttributeValue of the Action's Attribute child element shall have one of the following values, i.e. urn:e-health-suisse:2015:policy-administration:PolicyQuery, urn:e-health-suisse:2015:policy-administration:AddPolicy, 
                    urn:e-health-suisse:2015:policy-administration:UpdatePolicy or urn:e-health-suisse:2015:policy-administration:DeletePolicy
            </sch:assert>
            <sch:report test="*[1]='urn:e-health-suisse:2015:policy-administration:PolicyQuery'
                            or *[1]='urn:e-health-suisse:2015:policy-administration:AddPolicy'
                            or *[1]='urn:e-health-suisse:2015:policy-administration:UpdatePolicy'
                            or *[1]='urn:e-health-suisse:2015:policy-administration:DeletePolicy'">
                Success : The AttributeValue of the Action's Attribute child element shall have one of the following values, i.e. urn:e-health-suisse:2015:policy-administration:PolicyQuery, urn:e-health-suisse:2015:policy-administration:AddPolicy, 
                    urn:e-health-suisse:2015:policy-administration:UpdatePolicy or urn:e-health-suisse:2015:policy-administration:DeletePolicy
            </sch:report>
            
        </sch:rule>
        
        <!-- Rule 7: XACMLAuthzDecisionQuery/Request/Environment -->
        &ch_adr_common_part_5_XACMLAuthzDecisionQuery_Request_Environment;
    
    </sch:pattern>

</sch:schema>
