{
  "apiVersion" : "1",
  "basePath" : "PatientManager/rest",
  "apis" : [ {
    "path" : "/automaton/RunAutomaton",
    "description" : "",
    "operations" : [ {
      "httpMethod" : "GET",
      "nickname" : "runAutomaton",
      "responseClass" : "Response",
      "parameters" : [ {
        "paramType" : "query",
        "name" : "graphmlID",
        "description" : "Identifier of the graph to execute",
        "dataType" : "int",
        "required" : false
      }, {
        "paramType" : "query",
        "name" : "fullmovementcoverage",
        "description" : "Indicates whether or not you want the graph to cover all the movements (default: only covers all statuses)",
        "dataType" : "boolean",
        "required" : false,
        "allowableValues" : {
          "values" : [ "false", "true" ],
          "valueType" : "List"
        }
      }, {
        "paramType" : "query",
        "name" : "validatetransactioninstance",
        "description" : "Indicates whether or not messages are validated on the fly (default is false)",
        "dataType" : "boolean",
        "required" : false,
        "allowableValues" : {
          "values" : [ "false", "true" ],
          "valueType" : "List"
        }
      }, {
        "paramType" : "query",
        "name" : "startwithanA28",
        "description" : "Indicates whether or not the tool first sends a A28 message (default is false)",
        "dataType" : "boolean",
        "required" : false,
        "allowableValues" : {
          "values" : [ "false", "true" ],
          "valueType" : "List"
        }
      }, {
        "paramType" : "query",
        "name" : "systemundertest",
        "description" : "Name of the system under test registered in the tool to which send messages",
        "dataType" : "string",
        "required" : false
      }, {
        "paramType" : "query",
        "name" : "country",
        "description" : "Country code for the generated patient (default: random)",
        "dataType" : "string",
        "required" : false
      }, {
        "paramType" : "query",
        "name" : "BP6Mode",
        "description" : "Use true to send messages compliant with PAM-FR (default is false)",
        "dataType" : "boolean",
        "required" : false,
        "allowableValues" : {
          "values" : [ "false", "true" ],
          "valueType" : "List"
        }
      } ],
      "summary" : "Execute the automaton remotely",
      "notes" : "Execute a test automaton with a patient randomly generated"
    } ]
  }, {
    "path" : "/automaton/RunAutomatonWithExistingPatient",
    "description" : "",
    "operations" : [ {
      "httpMethod" : "GET",
      "nickname" : "runAutomatonWithExistingPatient",
      "responseClass" : "Response",
      "parameters" : [ {
        "paramType" : "query",
        "name" : "graphmlID",
        "description" : "Identifier of the graph to execute",
        "dataType" : "int",
        "required" : false
      }, {
        "paramType" : "query",
        "name" : "fullmovementcoverage",
        "description" : "Indicates whether or not you want the graph to cover all the movements (default: only covers all statuses)",
        "dataType" : "boolean",
        "required" : false,
        "allowableValues" : {
          "values" : [ "false", "true" ],
          "valueType" : "List"
        }
      }, {
        "paramType" : "query",
        "name" : "validatetransactioninstance",
        "description" : "Indicates whether or not messages are validated on the fly (default is false)",
        "dataType" : "boolean",
        "required" : false,
        "allowableValues" : {
          "values" : [ "false", "true" ],
          "valueType" : "List"
        }
      }, {
        "paramType" : "query",
        "name" : "startwithanA28",
        "description" : "Indicates whether or not the tool first sends a A28 message (default is false)",
        "dataType" : "boolean",
        "required" : false,
        "allowableValues" : {
          "values" : [ "false", "true" ],
          "valueType" : "List"
        }
      }, {
        "paramType" : "query",
        "name" : "systemundertest",
        "description" : "Name of the system under test registered in the tool to which send messages",
        "dataType" : "string",
        "required" : false
      }, {
        "paramType" : "query",
        "name" : "patientID",
        "description" : "DB identifier of the patient to use",
        "dataType" : "int",
        "required" : false
      }, {
        "paramType" : "query",
        "name" : "BP6Mode",
        "description" : "Use true to send messages compliant with PAM-FR (default is false)",
        "dataType" : "boolean",
        "required" : false,
        "allowableValues" : {
          "values" : [ "false", "true" ],
          "valueType" : "List"
        }
      } ],
      "summary" : "Execute the automaton for an existing patient",
      "notes" : "Execute the test automaton for a given patient"
    } ]
  }, {
    "path" : "/automaton/StatusExecution",
    "description" : "",
    "operations" : [ {
      "httpMethod" : "GET",
      "nickname" : "statusExecution",
      "responseClass" : "Response",
      "parameters" : [ {
        "paramType" : "query",
        "name" : "executionID",
        "description" : "Identifier of the automaton execution for which you want to get the status",
        "dataType" : "int",
        "required" : false
      } ],
      "summary" : "Gives the status of the given execution",
      "notes" : "Gives the status of the given execution"
    } ]
  }, {
    "path" : "/automaton/listGraphs",
    "description" : "",
    "operations" : [ {
      "httpMethod" : "GET",
      "nickname" : "listGraphs",
      "responseClass" : "Response",
      "parameters" : [ ],
      "summary" : "List the available graphs",
      "notes" : "List the available graphs"
    } ]
  } ],
  "models" : { },
  "swaggerVersion" : "1.1"
}