@startuml
'https://plantuml.com/component-diagram

[EVSClient] --|> [gazelle-tools]
[EVSClient] --> [evsclient-common]
[EVSClient] --> [MCA]
[EVSClient] --> [gazelle-x-validation]
[EVSClient] --> [gazelle-ws-clients]
[EVSClient] --> [assets]
[EVSClient] --> [version]
[EVSClient] --> [validation-model]
[MCA] --> [evsclient-common]
[MCA] --|> [gazelle-tools]
[MCA] ..> [assets] : provided
[MCA] --> [version]
[evsclient-common] --|> [gazelle-tools]
[evsclient-common] --> [gazelle-tm-tools]
[gazelle-x-validation] --|> [gazelle-tools]
[gazelle-tm-tools] --> [gazelle-hql (dbqm)]
[gazelle-tm-tools] --> [gazelle-model]
[gazelle-tm-tools] --> [gazelle-tools]
[gazelle-tm-tools] --> [gazelle-ws-clients] : excluded in\nEVS packaging
[gazelle-model] --|> [gazelle-tools]
[gazelle-ws-clients] --|> [gazelle-tools]
[gazelle-tools] --> [gazelle-hql (dbqm)]

@enduml