{
  "apiVersion" : "1",
  "basePath" : "http://localhost:8080/AssertionManagerGui/apidocs",
  "apis" : [ {
    "path" : "/testAssertion.{format}",
    "description" : ""
  } ],
  "swaggerVersion" : "1.1"
}