@startuml
'https://plantuml.com/sequence-diagram

title TM get results of a validated file in test step.

autonumber

actor User
box Gazelle TM
    participant MessageBean
    participant "EVSClient\nServletConnector" as EVSClientServletConnector
    participant "EVSClient\nResults" as EVSClientResults
end box
participant "EVSClient" as EVS

User -> MessageBean : HTTP GET <proxyURL>/messages/<type>.seam\nDisplay a recorded message.
activate MessageBean

    MessageBean -> EVSClientResults : getValidationStatus(validationOid, evsURL)
    note left: evsURL = https://<fqdn>/EVSCient/\nStored in Proxy preferences.
    activate EVSClientResults

        EVSClientResults -> EVS : Check url\nHTTP HEAD <evsURL>
        activate EVS
        EVSClientResults <-- EVS : HTTP 200 OK
        deactivate EVS

        EVSClientResults -> EVS : HTTP GET <evsURL>/rest/GetValidationStatus?oid=4.5.6
        activate EVS
        EVS -> EVS : cache <status>
        EVSClientResults <- EVS : HTTP 200 OK <status>
        deactivate EVS
        EVSClientResults -> EVSClientResults : cache <status>

    MessageBean <-- EVSClientResults : <status>
    deactivate EVSClientResults

    MessageBean -> EVSClientResults : getValidationDate(validationOid, evsURL)
    activate EVSClientResults

        EVSClientResults -> EVS : Check url\nHTTP HEAD <evsURL>
        activate EVS
        EVSClientResults <-- EVS : HTTP 200 OK
        deactivate EVS

        EVSClientResults -> EVS : HTTP GET <evsURL>/rest/GetValidationDate?oid=4.5.6
        activate EVS
        EVS -> EVS : cache <date>
        EVSClientResults <- EVS : HTTP 200 OK <date>
        deactivate EVS
        EVSClientResults -> EVSClientResults : cache <date>

    MessageBean <-- EVSClientResults : <date>
    deactivate EVSClientResults

    MessageBean -> EVSClientResults : getValidationPermanentLink(validationOid, evsURL)
        activate EVSClientResults

            EVSClientResults -> EVS : Check url\nHTTP HEAD <evsURL>
            activate EVS
            EVSClientResults <-- EVS : HTTP 200 OK
            deactivate EVS

            EVSClientResults -> EVS : HTTP GET <evsURL>/rest/GetValidationPermanentLink?oid=4.5.6
            activate EVS
            EVS -> EVS : cache <permanentLink>
            EVSClientResults <- EVS : HTTP 200 OK <permanentLink>
            note over EVSClientResults, EVS: permanentLink = <evs_url>/detailedResult.seam?oid=4.5.6&privacyKey=1ab2c3\nand evs_url comes from EVS preferences
            note over EVSClientResults, EVS: VULNERABILITY ISSUE\nIf result is private, a call to <evsURL>/rest/GetValidationPermanentLink?oid=4.5.6\nwill disclose the privacy key
            deactivate EVS
            EVSClientResults -> EVSClientResults : cache <permanentLink>

        MessageBean <-- EVSClientResults : <permanentLink>
        deactivate EVSClientResults

User <-- MessageBean : <permanentLink>, <status>, <date>
deactivate MessageBean


@enduml