{
  "profileType": "HTTPREQUEST",
  "id": "ITI-78-Patient-PDQmQuery-ValidationProfile",
  "name": "ITI-78-Patient-Mobile Patient Demographics Query-ValidationProfile",
  "description": "Validation Profile for validating a PDQm ITI-78 query.",
  "context": "IHE",
  "assertions": [
    {
      "selector": "request.method",
      "id": "GETMethodChecking",
      "description": "HTTP method shall be GET or POST",
      "requirementPriority": "MANDATORY",
      "checksComposition": "oneOf",
      "checks": [
        {
          "type": "CLOSEDLIST",
          "values": [
            "GET",
            "POST"
          ]
        }
      ]
    },
    {
      "selector": "request.version",
      "id": "HTTP1VersionChecking",
      "description": "The HTTP version shall be HTTP/1.1",
      "requirementPriority": "MANDATORY",
      "checksComposition": "oneOf",
      "checks": [
        {
          "type": "FIXEDVALUE",
          "fixedValue": "HTTP/1.1"
        }
      ]
    },
    {
      "selector": "request.uri.path",
      "id": "URIRegexChecking",
      "description": "URI path of the request shall be followed by the Patient resource",
      "requirementPriority": "MANDATORY",
      "checksComposition": "oneOf",
      "checks": [
        {
          "type": "REGEX",
          "regex": "^(\\S)+Patient$"
        }
      ]
    },
    {
      "selector": "request.headers('Host').values",
      "id": "HostChecking",
      "description": "Host Shall be a server name; Regex: ^(http[s]?:\\/\\/)?[a-zA-Z0-9.\\-\\/]+(:(\\d)+)?$",
      "requirementPriority": "MANDATORY",
      "checksComposition": "oneOf",
      "checks": [
        {
          "type": "REGEX",
          "regex": "^(http[s]?:\\/\\/)?[a-zA-Z0-9.\\-\\/]+(:(\\d)+)?$"
        }
      ]
    },
    {
      "selector": "request.uri.queryParams('_id').values",
      "id": "_id_parameter_presence",
      "description": "_id parameter can be used only once.",
      "requirementPriority": "MANDATORY",
      "checksComposition": "oneOf",
      "checks": [
        {
          "type": "OCCURRENCE",
          "minOccurrence": 0,
          "maxOccurrence": 1
        }
      ]
    },
    {
      "selector": "request.uri.queryParams('_id').values",
      "id": "_id_parameter_value",
      "description": "_id parameter is a token.",
      "requirementPriority": "MANDATORY",
      "checksComposition": "oneOf",
      "applyIf": "request.uri.queryParams('_id').values.size() > 0",
      "checks": [
        {
          "type": "REGEX",
          "regex": "^\\S+$"
        }
      ]
    },
    {
      "selector": "request.uri.queryParams('active').values",
      "id": "active_parameter_presence",
      "description": "active parameter can be used only once.",
      "requirementPriority": "MANDATORY",
      "checksComposition": "oneOf",
      "checks": [
        {
          "type": "OCCURRENCE",
          "minOccurrence": 0,
          "maxOccurrence": 1
        }
      ]
    },
    {
      "selector": "request.uri.queryParams('active').values",
      "id": "active_parameter_value",
      "description": "active parameter is a boolean and accept true or false values.",
      "requirementPriority": "MANDATORY",
      "checksComposition": "oneOf",
      "applyIf": "request.uri.queryParams('active').values.size() > 0",
      "checks": [
        {
          "type": "CLOSEDLIST",
          "values": [
            "true",
            "false"
          ]
        }
      ]
    },
    {
      "selector": "request.uri.queryParams('family').values",
      "id": "family_parameter_presence",
      "description": "family parameter can be used only once.",
      "requirementPriority": "MANDATORY",
      "checksComposition": "oneOf",
      "checks": [
        {
          "type": "OCCURRENCE",
          "minOccurrence": 0,
          "maxOccurrence": 1
        }
      ]
    },
    {
      "selector": "request.uri.queryParams('family').values",
      "id": "family_parameter_value",
      "description": "family parameter's value is made of items composed of string.",
      "requirementPriority": "MANDATORY",
      "checksComposition": "oneOf",
      "applyIf": "request.uri.queryParams('family').values.size() > 0",
      "checks": [
        {
          "type": "REGEX",
          "regex": "^[\\s\\S]+$"
        }
      ]
    },
    {
      "selector": "request.uri.queryParams('given').values",
      "id": "given_parameter_presence",
      "description": "given parameter can be used only once.",
      "requirementPriority": "MANDATORY",
      "checksComposition": "oneOf",
      "checks": [
        {
          "type": "OCCURRENCE",
          "minOccurrence": 0,
          "maxOccurrence": 1
        }
      ]
    },
    {
      "selector": "request.uri.queryParams('given').values",
      "id": "given_parameter_value",
      "description": "given parameter's value is made of items composed of string.",
      "requirementPriority": "MANDATORY",
      "checksComposition": "oneOf",
      "applyIf": "request.uri.queryParams('given').values.size() > 0",
      "checks": [
        {
          "type": "REGEX",
          "regex": "^[\\s\\S]+$"
        }
      ]
    },
    {
      "selector": "request.uri.queryParams('identifier').values",
      "id": "identifier_parameter_presence",
      "description": "identifier parameter can be used only once.",
      "requirementPriority": "MANDATORY",
      "checksComposition": "oneOf",
      "checks": [
        {
          "type": "OCCURRENCE",
          "minOccurrence": 0,
          "maxOccurrence": 1
        }
      ]
    },
    {
      "selector": "request.uri.queryParams('identifier').values",
      "id": "identifier_parameter_value",
      "description": "identifier parameter's value is made of items composed of string.",
      "requirementPriority": "MANDATORY",
      "checksComposition": "oneOf",
      "applyIf": "request.uri.queryParams('identifier').values.size() > 0",
      "checks": [
        {
          "type": "REGEX",
          "regex": "^\\S+$"
        }
      ]
    },
    {
      "selector": "request.uri.queryParams('telecom').values",
      "id": "telecom_parameter_presence",
      "description": "telecom parameter can be used only once.",
      "requirementPriority": "MANDATORY",
      "checksComposition": "oneOf",
      "checks": [
        {
          "type": "OCCURRENCE",
          "minOccurrence": 0,
          "maxOccurrence": 1
        }
      ]
    },
    {
      "selector": "request.uri.queryParams('telecom').values",
      "id": "telecom_parameter_value",
      "description": "telecom parameter is made of a string.",
      "requirementPriority": "MANDATORY",
      "checksComposition": "oneOf",
      "applyIf": "request.uri.queryParams('telecom').values.size() > 0",
      "checks": [
        {
          "type": "REGEX",
          "regex": "^[\\s\\S]+$"
        }
      ]
    },
    {
      "selector": "request.uri.queryParams('birthdate').values",
      "id": "birthdate_parameter_presence",
      "description": "birthdate parameter can be used only once.",
      "requirementPriority": "MANDATORY",
      "checksComposition": "oneOf",
      "checks": [
        {
          "type": "OCCURRENCE",
          "minOccurrence": 0,
          "maxOccurrence": 1
        }
      ]
    },
    {
      "selector": "request.uri.queryParams('birthdate').values",
      "id": "birthdate_parameter_value",
      "description": "birthdate parameter is made of a date eventually preceded by a modifier.",
      "requirementPriority": "MANDATORY",
      "checksComposition": "oneOf",
      "applyIf": "request.uri.queryParams('birthdate').values.size() > 0",
      "checks": [
        {
          "type": "REGEX",
          "regex": "^(eq|ne|lt|gt|ge|le|sa|eb|ap)?([0-9]([0-9]([0-9][1-9]|[1-9]0)|[1-9]00)|[1-9]000)(-(0[1-9]|1[0-2])(-(0[1-9]|[1-2][0-9]|3[0-1]))?)?$"
        }
      ]
    },
    {
      "selector": "request.uri.queryParams('address').values",
      "id": "address_parameter_presence",
      "description": "address parameter can be used only once.",
      "requirementPriority": "MANDATORY",
      "checksComposition": "oneOf",
      "checks": [
        {
          "type": "OCCURRENCE",
          "minOccurrence": 0,
          "maxOccurrence": 1
        }
      ]
    },
    {
      "selector": "request.uri.queryParams('address').values",
      "id": "address_parameter_value",
      "description": "address parameter is made of a string.",
      "requirementPriority": "MANDATORY",
      "checksComposition": "oneOf",
      "applyIf": "request.uri.queryParams('address').values.size() > 0",
      "checks": [
        {
          "type": "REGEX",
          "regex": "^[\\s\\S]+$"
        }
      ]
    },
    {
      "selector": "request.uri.queryParams('address-city').values",
      "id": "address-city_parameter_presence",
      "description": "address-city parameter can be used only once.",
      "requirementPriority": "MANDATORY",
      "checksComposition": "oneOf",
      "checks": [
        {
          "type": "OCCURRENCE",
          "minOccurrence": 0,
          "maxOccurrence": 1
        }
      ]
    },
    {
      "selector": "request.uri.queryParams('address-city').values",
      "id": "address-city_parameter_value",
      "description": "address-city parameter is made of a string.",
      "requirementPriority": "MANDATORY",
      "checksComposition": "oneOf",
      "applyIf": "request.uri.queryParams('address-city').values.size() > 0",
      "checks": [
        {
          "type": "REGEX",
          "regex": "^[\\s\\S]+$"
        }
      ]
    },
    {
      "selector": "request.uri.queryParams('address-country').values",
      "id": "address-country_parameter_presence",
      "description": "address-country parameter can be used only once.",
      "requirementPriority": "MANDATORY",
      "checksComposition": "oneOf",
      "checks": [
        {
          "type": "OCCURRENCE",
          "minOccurrence": 0,
          "maxOccurrence": 1
        }
      ]
    },
    {
      "selector": "request.uri.queryParams('address-country').values",
      "id": "address-country_parameter_value",
      "description": "address-country parameter is made of a string.",
      "requirementPriority": "MANDATORY",
      "checksComposition": "oneOf",
      "applyIf": "request.uri.queryParams('address-country').values.size() > 0",
      "checks": [
        {
          "type": "REGEX",
          "regex": "^[\\s\\S]+$"
        }
      ]
    },
    {
      "selector": "request.uri.queryParams('address-postalcode').values",
      "id": "address-postalcode_parameter_presence",
      "description": "address-postalcode parameter can be used only once.",
      "requirementPriority": "MANDATORY",
      "checksComposition": "oneOf",
      "checks": [
        {
          "type": "OCCURRENCE",
          "minOccurrence": 0,
          "maxOccurrence": 1
        }
      ]
    },
    {
      "selector": "request.uri.queryParams('address-postalcode').values",
      "id": "address-postalcode_parameter_value",
      "description": "address-postalcode parameter is made of a string.",
      "requirementPriority": "MANDATORY",
      "checksComposition": "oneOf",
      "applyIf": "request.uri.queryParams('address-postalcode').values.size() > 0",
      "checks": [
        {
          "type": "REGEX",
          "regex": "^[\\s\\S]+$"
        }
      ]
    },
    {
      "selector": "request.uri.queryParams('address-state').values",
      "id": "address-state_parameter_presence",
      "description": "address-state parameter can be used only once.",
      "requirementPriority": "MANDATORY",
      "checksComposition": "oneOf",
      "checks": [
        {
          "type": "OCCURRENCE",
          "minOccurrence": 0,
          "maxOccurrence": 1
        }
      ]
    },
    {
      "selector": "request.uri.queryParams('address-state').values",
      "id": "address-state_parameter_value",
      "description": "address-state parameter is made of a string.",
      "requirementPriority": "MANDATORY",
      "checksComposition": "oneOf",
      "applyIf": "request.uri.queryParams('address-state').values.size() > 0",
      "checks": [
        {
          "type": "REGEX",
          "regex": "^[\\s\\S]+$"
        }
      ]
    },
    {
      "selector": "request.uri.queryParams('gender').values",
      "id": "gender_parameter_presence",
      "description": "gender parameter can be used only once.",
      "requirementPriority": "MANDATORY",
      "checksComposition": "oneOf",
      "checks": [
        {
          "type": "OCCURRENCE",
          "minOccurrence": 0,
          "maxOccurrence": 1
        }
      ]
    },
    {
      "selector": "request.uri.queryParams('gender').values",
      "id": "gender_parameter_value",
      "description": "gender parameter's value shall be either json or xml.",
      "requirementPriority": "MANDATORY",
      "checksComposition": "oneOf",
      "applyIf": "request.uri.queryParams('gender').values.size() > 0",
      "checks": [
        {
          "type": "CLOSEDLIST",
          "values": [
            "male",
            "Male",
            "female",
            "Female",
            "other",
            "Other",
            "unknown",
            "Unknown"
          ]
        }
      ]
    },
    {
      "selector": "request.uri.queryParams('mothersMaidenName').values",
      "id": "mothersMaidenName_parameter_presence",
      "description": "mothersMaidenName parameter can be used only once.",
      "requirementPriority": "MANDATORY",
      "checksComposition": "oneOf",
      "checks": [
        {
          "type": "OCCURRENCE",
          "minOccurrence": 0,
          "maxOccurrence": 1
        }
      ]
    },
    {
      "selector": "request.uri.queryParams('mothersMaidenName').values",
      "id": "mothersMaidenName_parameter_value",
      "description": "mothersMaidenName parameter is made of a string.",
      "requirementPriority": "MANDATORY",
      "checksComposition": "oneOf",
      "applyIf": "request.uri.queryParams('mothersMaidenName').values.size() > 0",
      "checks": [
        {
          "type": "REGEX",
          "regex": "^[\\s\\S]+$"
        }
      ]
    },
    {
      "selector": "request.uri.queryParams('_format').values",
      "id": "_format_parameter_presence",
      "description": "_format parameter can be used only once.",
      "requirementPriority": "MANDATORY",
      "checksComposition": "oneOf",
      "checks": [
        {
          "type": "OCCURRENCE",
          "minOccurrence": 0,
          "maxOccurrence": 1
        }
      ]
    },
    {
      "selector": "request.uri.queryParams('_format').values",
      "id": "_format_parameter_value",
      "description": "_format parameter's value shall be either json or xml.",
      "requirementPriority": "MANDATORY",
      "checksComposition": "oneOf",
      "applyIf": "request.uri.queryParams('_format').values.size() > 0",
      "checks": [
        {
          "type": "CLOSEDLIST",
          "values": [
            "json",
            "xml"
          ]
        }
      ]
    }
  ]
}