MSH|^~\&|HL7Inspector|Local|PatientManager|IHE|20140515015651||ADT^A40^ADT_A39|hl7v2pixmgr1|P|2.3.1||||||UNICODE UTF-8
EVN||20140515015651
PID|||DDS-47530^^^DDS&1.3.6.1.4.1.12559.11.1.4.1.2&ISO^PI||Nilsson^Mona^^^^^L|Karlsson^^^^^^M|19970725|F|||Scheelegatan^^Falköping^^521 31^SWE
MRG|DDS-47191^^^DDS&1.3.6.1.4.1.12559.11.1.4.1.2&ISO^PI||||||Manson^Kayleen^^^^^L

MSH|^~\&|HL7Inspector|Local|PatientManager|IHE|20170724170003||ADT^A01^ADT_A01|hl7v2pixmgr2|P|2.3.1|||||AUT|UNICODE UTF-8
EVN||20170724170003||||20170724170003
PID|||DDS-59061^^^DDS&1.3.6.1.4.1.12559.11.1.4.1.2&ISO||Schuster^Frank|Haas^^^^^^L|19811125|M|||Wachaustrasse^^Krems an der Donau^^3500^AUT||||||^VAR
PV1||I

MSH|^~\&|HL7Inspector|Local|PatientManager|IHE|20170721095837||ADT^A04^ADT_A01|hl7v2pixmgr3|P|2.3.1|||||AUT|UNICODE UTF-8
EVN||20170721095837||||20170721095837
PID|||DDS-CATT-54942^^^DDS-CATT&1.3.6.1.4.1.12559.11.25.1.9&ISO||Lechner^Frida|Huber^^^^^^L|19631114|F|||Leopoldstra?e^^Gemeinde Klosterneuburg^^3400^AUT||||||^CAT
PV1||O

MSH|^~\&|HL7Inspector|Local|PatientManager|IHE|20170618161127+0200||ADT^A05^ADT_A01|hl7v2pixmgr4|P|2.3.1||||AUT|UNICODE UTF-8
EVN||20170618161127+0200
PID|||PASS-5667491^^^&1.3.6.1.4.1.12559.11.1.4.1.21&ISO||Andersson^Viktoria^^M. SC.^MR^^A|||F
PV1||I

MSH|^~\&|HL7Inspector|Local|PatientManager|IHE|20141113042133||ADT^A08^ADT_A01|hl7v2pixmgr5|P|2.3.1||||||UNICODE UTF-8
EVN||20141113042133
PID|||DDS-48563^^^DDS&1.3.6.1.4.1.12559.11.1.4.1.2&ISO^PI||Cham^Sharayah^^^^^L|Qureshi^^^^^^M|19350312|F|||شارع الخليج^^أم الحمام^^^SAU
PV1||I|||||CHAVEZ^JULIO^^^DR|||A02|||||||||4801^^^IHEPAM&1.3.6.1.4.1.12559.11.1.2.2.5&ISO^VN|||||||||||||||||||||||||20141107120000|||||||V

MSH|^~\&|HL7Inspector|Local|PatientManager|IHE|20170614123359.977+0200||QBP^Q23^QBP_Q21|hl7v2pixmgr6|P|2.5||||||UNICODE UTF-8
QPD|IHE PIX Query|QRY1248968460880|PAT_1057824782^^^IPK&1.3.6.1.4.1.21367.2005.13.20.1000&ISO|^^^INFNITTG&1.3.6.1.4.1.21367.2005.13.20.3000&ISO
RCP|I