Geometry file
Geometry file
node id assign
element id assign
coordinates
      41
 0.00000e+00-0.10000e+00 0.00000e+00
 0.02500e+00-0.10000e+00 0.00000e+00
 0.05000e+00-0.10000e+00 0.00000e+00
 0.07500e+00-0.10000e+00 0.00000e+00
 0.10000e+00-0.10000e+00 0.00000e+00
 0.12500e+00-0.10000e+00 0.00000e+00
 0.15000e+00-0.10000e+00 0.00000e+00
 0.17500e+00-0.10000e+00 0.00000e+00
 0.20000e+00-0.10000e+00 0.00000e+00
 0.22500e+00-0.10000e+00 0.00000e+00
 0.25000e+00-0.10000e+00 0.00000e+00
 0.27500e+00-0.10000e+00 0.00000e+00
 0.30000e+00-0.10000e+00 0.00000e+00
 0.32500e+00-0.10000e+00 0.00000e+00
 0.35000e+00-0.10000e+00 0.00000e+00
 0.37500e+00-0.10000e+00 0.00000e+00
 0.40000e+00-0.10000e+00 0.00000e+00
 0.42500e+00-0.10000e+00 0.00000e+00
 0.45000e+00-0.10000e+00 0.00000e+00
 0.47500e+00-0.10000e+00 0.00000e+00
 0.50000e+00-0.10000e+00 0.00000e+00
 0.52500e+00-0.10000e+00 0.00000e+00
 0.55000e+00-0.10000e+00 0.00000e+00
 0.57500e+00-0.10000e+00 0.00000e+00
 0.60000e+00-0.10000e+00 0.00000e+00
 0.62500e+00-0.10000e+00 0.00000e+00
 0.65000e+00-0.10000e+00 0.00000e+00
 0.67500e+00-0.10000e+00 0.00000e+00
 0.70000e+00-0.10000e+00 0.00000e+00
 0.72500e+00-0.10000e+00 0.00000e+00
 0.75000e+00-0.10000e+00 0.00000e+00
 0.77500e+00-0.10000e+00 0.00000e+00
 0.80000e+00-0.10000e+00 0.00000e+00
 0.82500e+00-0.10000e+00 0.00000e+00
 0.85000e+00-0.10000e+00 0.00000e+00
 0.87500e+00-0.10000e+00 0.00000e+00
 0.90000e+00-0.10000e+00 0.00000e+00
 0.92500e+00-0.10000e+00 0.00000e+00
 0.95000e+00-0.10000e+00 0.00000e+00
 0.97500e+00-0.10000e+00 0.00000e+00
 1.00000e+00-0.10000e+00 0.00000e+00 
part       1
Segments2_ref_1
bar2
      40
       1       2
       2       3
       3       4
       4       5
       5       6
       6       7
       7       8
       8       9
       9      10
      10      11
      11      12
      12      13
      13      14
      14      15
      15      16
      16      17
      17      18
      18      19
      19      20
      20      21
      21      22
      22      23
      23      24
      24      25
      25      26
      26      27
      27      28
      28      29
      29      30
      30      31
      31      32
      32      33
      33      34
      34      35
      35      36
      36      37
      37      38
      38      39
      39      40
      40      41
part       2
dirichlet1
point
       1
       1
part       3
dirichlet2
point
       1
      41
