Geometry file
Geometry file
node id assign
element id assign
coordinates
      11
 0.00000e+00-0.10000e+00 0.00000e+00
 0.10000e+00-0.10000e+00 0.00000e+00
 0.20000e+00-0.10000e+00 0.00000e+00
 0.30000e+00-0.10000e+00 0.00000e+00
 0.40000e+00-0.10000e+00 0.00000e+00
 0.50000e+00-0.10000e+00 0.00000e+00
 0.60000e+00-0.10000e+00 0.00000e+00
 0.70000e+00-0.10000e+00 0.00000e+00
 0.80000e+00-0.10000e+00 0.00000e+00
 0.90000e+00-0.10000e+00 0.00000e+00
 1.00000e+00-0.10000e+00 0.00000e+00 
part       1
Segments2_ref_1
bar2
      10
       1       2
       2       3
       3       4
       4       5
       5       6
       6       7
       7       8
       8       9
       9      10
      10      11
part       2
dirichlet1
point
       1
       1
part       3
dirichlet2
point
       1
      11
