'TOTO                                                                '
'TRANS                                                               '
     5     2     3                                          $ IMPRE NIVEA1 NIVEA2 
     1     1                                                $ NBNNF NBNNSD
     1     2                                                $ L NNF(L)
     1     2                                                $ L NNDSD(L)
  0.0000000E+00  0.0000000E+00  0.2000000E+00               $  X. Y. Z. 
'F                                                                   '
