Geometry file
Geometry file
node id assign
element id assign
coordinates
      31
 2.00000e+00 0.00000e+00 0.00000e+00
 2.00000e+00 3.33333e-02 0.00000e+00
 2.00000e+00 6.66667e-02 0.00000e+00
 2.00000e+00 1.00000e-01 0.00000e+00
 2.00000e+00 1.33333e-01 0.00000e+00
 2.00000e+00 1.66667e-01 0.00000e+00
 2.00000e+00 2.00000e-01 0.00000e+00
 2.00000e+00 2.33333e-01 0.00000e+00
 2.00000e+00 2.66667e-01 0.00000e+00
 2.00000e+00 3.00000e-01 0.00000e+00
 2.00000e+00 3.33333e-01 0.00000e+00
 2.00000e+00 3.66667e-01 0.00000e+00
 2.00000e+00 4.00000e-01 0.00000e+00
 2.00000e+00 4.33333e-01 0.00000e+00
 2.00000e+00 4.66667e-01 0.00000e+00
 2.00000e+00 5.00000e-01 0.00000e+00
 2.00000e+00 5.33333e-01 0.00000e+00
 2.00000e+00 5.66667e-01 0.00000e+00
 2.00000e+00 6.00000e-01 0.00000e+00
 2.00000e+00 6.33333e-01 0.00000e+00
 2.00000e+00 6.66667e-01 0.00000e+00
 2.00000e+00 7.00000e-01 0.00000e+00
 2.00000e+00 7.33333e-01 0.00000e+00
 2.00000e+00 7.66667e-01 0.00000e+00
 2.00000e+00 8.00000e-01 0.00000e+00
 2.00000e+00 8.33333e-01 0.00000e+00
 2.00000e+00 8.66667e-01 0.00000e+00
 2.00000e+00 9.00000e-01 0.00000e+00
 2.00000e+00 9.33333e-01 0.00000e+00
 2.00000e+00 9.66667e-01 0.00000e+00
 2.00000e+00 1.00000e+00 0.00000e+00
part       1
domain
bar2
      30
       1       2
       2       3
       3       4
       4       5
       5       6
       6       7
       7       8
       8       9
       9      10
      10      11
      11      12
      12      13
      13      14
      14      15
      15      16
      16      17
      17      18
      18      19
      19      20
      20      21
      21      22
      22      23
      23      24
      24      25
      25      26
      26      27
      27      28
      28      29
      29      30
      30      31
part       2
bottom
point
       1
       1
part       3
top
point
       1
      31
