PROC,TYPE,GEN,VEC,N,K,R,SNR (dB),FRA,LD+ST+DEC (ms),CTHR (Mbit/s),ITHR (Mbit/s),LATENCY (us),CLU_FREQ (MHz),CLU_POW (W),CLU_ENE (J),RAM_POW (W),RAM_ENE (J),EB_CLU (nJ),EB_CLU_RAM (nJ),TB_CLU (ns)
,,,,,,,,,,,,,,,,,,,,
A15,char,no,seq,128,64,0.50,2.50,1332899,15394.15,11.08,5.54,11.55,800.00,0.5289,8.14,0.0504,0.78,95.449921875,104.545546875,180.46875
A15,char,no,seq,256,128,0.50,2.50,1048729,21566.42,12.45,6.22,20.56,800.00,0.5205,11.23,0.0504,1.09,83.6053125,91.7008125,160.625
A15,char,no,seq,512,256,0.50,2.50,699036,28966.37,12.36,6.18,41.44,800.00,0.5377,15.57,0.0504,1.46,87.0401875,95.1986875,161.875
A15,char,no,seq,1024,512,0.50,2.50,399077,34709.14,11.77,5.89,86.97,800.00,0.5318,18.46,0.0505,1.75,90.33329296875,98.911388671875,169.86328125
A15,char,no,seq,2048,1024,0.50,2.50,213346,38752.48,11.27,5.64,181.64,800.00,0.5394,20.90,0.0525,2.03,95.6802890625,104.99288671875,177.3828125
A15,char,no,seq,4096,2048,0.50,2.50,106522,40248.91,10.84,5.42,377.85,800.00,0.5455,21.96,0.0530,2.13,100.643151855469,110.421496582031,184.4970703125
A15,char,no,seq,8192,4096,0.50,2.50,52362,42807.93,10.02,5.01,817.54,800.00,0.5432,23.26,0.0521,2.23,108.41985546875,118.818740722656,199.5947265625
A15,char,no,seq,16384,8192,0.50,2.50,24703,41573.39,9.74,4.87,1682.93,800.00,0.5576,23.18,0.0515,2.14,114.550997070313,125.130940307617,205.435791015625
A15,char,no,seq,32768,16384,0.50,2.50,11635,41814.26,9.12,4.56,3593.83,800.00,0.5702,23.84,0.0511,2.14,125.073356079102,136.282139831543,219.349975585938
A15,char,no,seq,65536,32768,0.50,2.50,5560,41765.52,8.72,4.36,7511.78,800.00,0.5778,24.13,0.0511,2.13,132.455642211914,144.169874328613,229.241333007812
A15,char,no,seq,131072,65536,0.50,2.50,2500,39983.30,8.20,4.10,15993.32,800.00,0.5792,23.16,0.0511,2.04,141.347212890625,153.817590270996,244.038696289062
A15,char,no,seq,262144,131072,0.50,2.50,1250,49746.53,6.59,3.29,39797.22,800.00,0.5580,27.76,0.0513,2.55,169.42481048584,185.000962417603,303.628692626953
A15,char,no,seq,524288,262144,0.50,2.50,625,50697.52,6.46,3.23,81116.03,800.00,0.5676,28.78,0.0619,3.14,175.634226333618,194.788135089874,309.433097839355
A15,char,no,seq,1048576,524288,0.50,2.50,300,55050.20,5.71,2.86,183500.67,800.00,0.5592,30.79,0.0657,3.62,195.719861343384,218.714845052719,349.999752044678
,,,,,,,,,,,,,,,,,,,,
A15,char,no,seq,128,107,0.83,4.00,1453651,13369.19,13.92,11.63,9.20,800.00,0.5071,6.78,0.0506,0.68,43.6011214953271,47.9517757009346,85.9813084112149
A15,char,no,seq,256,213,0.83,4.00,1102321,20971.00,13.46,11.20,19.02,800.00,0.5256,11.02,0.0507,1.06,46.9338591549296,51.4611549295775,89.2957746478873
A15,char,no,seq,512,427,0.83,4.00,752754,27670.36,13.93,11.62,36.76,800.00,0.5371,14.86,0.0507,1.40,46.2383981264637,50.6031100702576,86.0889929742389
A15,char,no,seq,1024,853,0.83,4.00,457183,33428.57,14.00,11.67,73.12,800.00,0.5292,17.69,0.0508,1.70,45.3635451348183,49.7181711606096,85.7209847596718
A15,char,no,seq,2048,1707,0.83,4.00,238931,38152.36,12.83,10.69,159.68,800.00,0.5339,20.37,0.0510,1.95,49.9432642062097,54.7140199179848,93.5442296426479
A15,char,no,seq,4096,3413,0.83,4.00,118322,40096.02,12.09,10.07,338.87,800.00,0.5593,22.43,0.0543,2.18,55.5317875769118,60.9231268678582,99.2880164078523
A15,char,no,seq,8192,6827,0.83,4.00,57604,40895.35,11.54,9.62,709.94,800.00,0.5588,22.85,0.0527,2.15,58.1096340998975,63.5899091841219,103.99003954885
A15,char,no,seq,16384,13653,0.83,4.00,27305,41682.65,10.73,8.94,1526.56,800.00,0.5660,23.59,0.0518,2.16,63.2852091115506,69.0770356698161,111.811323518641
A15,char,no,seq,32768,27307,0.83,4.00,12609,43385.30,9.52,7.94,3440.82,800.00,0.5732,24.87,0.0513,2.23,72.2260967517486,78.690156003955,126.005053649247
A15,char,no,seq,65536,54613,0.83,4.00,5896,41774.54,9.25,7.71,7085.23,800.00,0.5855,24.46,0.0513,2.14,75.9599759214839,82.6153931115302,129.735227876147
A15,char,no,seq,131072,109227,0.83,4.00,2500,37270.49,8.79,7.33,14908.20,800.00,0.5886,21.94,0.0514,1.92,80.3369727265237,87.352467796424,136.488230931912
A15,char,no,seq,262144,218453,0.83,4.00,1250,46116.29,7.11,5.92,36893.04,800.00,0.5630,25.96,0.0522,2.41,95.0812372455402,103.896939881805,168.883192265613
A15,char,no,seq,524288,436907,0.83,4.00,625,49991.92,6.55,5.46,79987.07,800.00,0.5670,28.35,0.0601,3.00,103.803941548201,114.806793200841,183.075734652912
A15,char,no,seq,1048576,873813,0.83,4.00,300,54470.70,5.78,4.81,181568.98,800.00,0.5575,30.37,0.0660,3.59,115.842527348529,129.556620272301,207.789286723818
,,,,,,,,,,,,,,,,,,,,
A15,char,yes,seq,128,64,0.50,2.50,1372446,14503.07,12.11,6.06,10.57,800.00,0.5298,7.68,0.0506,0.73,87.49978125,95.8566875,165.15625
A15,char,yes,seq,256,128,0.50,2.50,1039196,21474.08,12.39,6.19,20.66,800.00,0.5289,11.36,0.0505,1.08,85.367765625,93.51878125,161.40625
A15,char,yes,seq,512,256,0.50,2.50,672044,28411.32,12.11,6.06,42.28,800.00,0.5321,15.12,0.0506,1.44,87.879640625,96.236546875,165.15625
A15,char,yes,seq,1024,512,0.50,2.50,367136,33911.01,11.09,5.54,92.37,800.00,0.5328,18.07,0.0508,1.72,96.12253125,105.2873671875,180.41015625
A15,char,yes,seq,2048,1024,0.50,2.50,185879,37684.96,10.10,5.05,202.74,800.00,0.5254,19.80,0.0527,1.99,104.02304296875,114.457025390625,197.98828125
A15,char,yes,seq,4096,2048,0.50,2.50,92647,39551.91,9.59,4.80,426.91,800.00,0.5344,21.14,0.0530,2.10,111.396828125,122.444791992188,208.4521484375
A15,char,yes,seq,8192,4096,0.50,2.50,44280,40239.64,9.01,4.51,908.75,800.00,0.5434,21.87,0.0522,2.10,120.560241699219,132.141479492188,221.86279296875
A15,char,yes,seq,16384,8192,0.50,2.50,20875,41139.79,8.31,4.16,1970.77,800.00,0.5573,22.93,0.0515,2.12,134.071059692383,146.460543945312,240.572509765625
A15,char,yes,seq,32768,16384,0.50,2.50,9828,41737.67,7.72,3.86,4246.81,800.00,0.5652,23.59,0.0513,2.14,146.502503173828,159.79970489502,259.204711914062
A15,char,yes,seq,65536,32768,0.50,2.50,4714,41158.44,7.51,3.75,8731.11,800.00,0.5776,23.77,0.0511,2.10,153.902866699219,167.518580841064,266.452331542969
A15,char,yes,seq,131072,65536,0.50,2.50,2500,50000.13,6.55,3.28,20000.05,800.00,0.5744,28.72,0.0513,2.57,175.293406982422,190.948963699341,305.176544189453
A15,char,yes,seq,262144,131072,0.50,2.50,1250,62038.26,5.28,2.64,49630.61,800.00,0.5654,35.08,0.0559,3.47,214.089560653687,235.256179756165,378.651504516602
A15,char,yes,seq,524288,262144,0.50,2.50,625,67377.95,4.86,2.43,107804.73,800.00,0.5656,38.11,0.0625,4.21,232.598706390381,258.301356937408,411.242408752441
A15,char,yes,seq,1048576,524288,0.50,2.50,300,70086.62,4.49,2.24,233622.08,800.00,0.5647,39.58,0.0651,4.57,251.629616882324,280.638095825195,445.598754882812
,,,,,,,,,,,,,,,,,,,,
A15,char,yes,seq,128,107,0.83,4.00,1468511,12142.81,15.48,12.94,8.27,800.00,0.5158,6.26,0.0507,0.62,39.8660373831776,43.7846261682243,77.2897196261682
A15,char,yes,seq,256,213,0.83,4.00,1089749,19754.25,14.12,11.75,18.13,800.00,0.5204,10.28,0.0507,1.00,44.2950798122066,48.6105305164319,85.1173708920188
A15,char,yes,seq,512,427,0.83,4.00,718502,26615.52,13.82,11.53,37.04,800.00,0.5331,14.19,0.0504,1.34,46.2436159250585,50.6155503512881,86.7447306791569
A15,char,yes,seq,1024,853,0.83,4.00,417855,33015.09,12.96,10.80,79.01,800.00,0.5250,17.33,0.0514,1.70,48.6286635404455,53.3896412661196,92.6260257913247
A15,char,yes,seq,2048,1707,0.83,4.00,210135,37294.39,11.54,9.62,177.48,800.00,0.5256,19.60,0.0514,1.92,54.6476203866432,59.9917750439367,103.971880492091
A15,char,yes,seq,4096,3413,0.83,4.00,101774,39757.59,10.49,8.74,390.65,800.00,0.5454,21.68,0.0539,2.14,62.4261675944916,68.5955303252271,114.459419865221
A15,char,yes,seq,8192,6827,0.83,4.00,48800,40366.41,9.90,8.25,827.18,800.00,0.5498,22.19,0.0524,2.11,66.6154334261022,72.9643761535081,121.163029148967
A15,char,yes,seq,16384,13653,0.83,4.00,22830,40814.44,9.16,7.64,1787.75,800.00,0.5530,22.57,0.0517,2.11,72.4108803925877,79.1805775287483,130.941917527283
A15,char,yes,seq,32768,27307,0.83,4.00,10570,40972.61,8.45,7.04,3876.31,800.00,0.5663,23.20,0.0514,2.11,80.3879720584466,87.6843551836525,141.952979089611
A15,char,yes,seq,65536,54613,0.83,4.00,4895,40818.59,7.86,6.55,8338.83,800.00,0.5753,23.48,0.0513,2.09,87.8422518264882,95.6752216139015,152.689469540219
A15,char,yes,seq,131072,109227,0.83,4.00,2500,47971.26,6.83,5.69,19188.50,800.00,0.5750,27.58,0.0514,2.47,101.01337123605,110.043088247411,175.675428236608
A15,char,yes,seq,262144,218453,0.83,4.00,1250,59143.65,5.54,4.62,47314.92,800.00,0.5656,33.45,0.0554,3.27,122.503782287265,134.502915135063,216.590845628121
A15,char,yes,seq,524288,436907,0.83,4.00,625,66072.98,4.96,4.13,105716.76,800.00,0.5668,37.45,0.0618,4.08,137.146485563289,152.100001455687,241.966276576022
A15,char,yes,seq,1048576,873813,0.83,4.00,300,71111.23,4.42,3.69,237037.41,800.00,0.5616,39.93,0.0650,4.62,152.344047818011,169.976460759911,271.267891413838
,,,,,,,,,,,,,,,,,,,,
A15,char,no,intra,128,64,0.50,2.50,1628908,9450.13,22.06,11.03,5.80,800.00,0.5245,4.96,0.0508,0.48,47.5328125,52.1365625,90.625
A15,char,no,intra,256,128,0.50,2.50,1482148,11992.33,31.64,15.82,8.09,800.00,0.5297,6.35,0.0506,0.61,33.4786953125,36.6767734375,63.203125
A15,char,no,intra,512,256,0.50,2.50,1287237,15878.83,41.51,20.75,12.34,800.00,0.5498,8.73,0.0504,0.80,26.502078125,28.931515625,48.203125
A15,char,no,intra,1024,512,0.50,2.50,979960,22164.04,45.28,22.64,22.62,800.00,0.5645,12.51,0.0510,1.13,24.93943359375,27.19259765625,44.1796875
A15,char,no,intra,2048,1024,0.50,2.50,657025,27998.16,48.06,24.03,42.61,800.00,0.6174,17.29,0.0515,1.44,25.690833984375,27.8338173828125,41.611328125
A15,char,no,intra,4096,2048,0.50,2.50,419152,33175.14,51.75,25.88,79.15,800.00,0.6053,20.08,0.0532,1.77,23.3933081054688,25.4493530273438,38.6474609375
A15,char,no,intra,8192,4096,0.50,2.50,234743,35429.39,54.28,27.14,150.93,800.00,0.6083,21.55,0.0565,2.00,22.4147263183594,24.496646484375,36.84814453125
A15,char,no,intra,16384,8192,0.50,2.50,121493,37979.66,52.41,26.21,312.61,800.00,0.6395,24.29,0.0555,2.11,24.4035760498047,26.5214782714844,38.160400390625
A15,char,no,intra,32768,16384,0.50,2.50,61018,39096.13,51.14,25.57,640.73,800.00,0.6462,25.26,0.0537,2.10,25.2709793701172,27.3710282592773,39.1070556640625
A15,char,no,intra,65536,32768,0.50,2.50,29966,39260.24,50.02,25.01,1310.16,800.00,0.6621,26.00,0.0528,2.07,26.4726848144531,28.5837824707031,39.98291015625
A15,char,no,intra,131072,65536,0.50,2.50,15000,42802.88,45.93,22.97,2853.53,800.00,0.6641,28.42,0.0527,2.26,28.9158519439697,31.210484375,43.5414123535156
A15,char,no,intra,262144,131072,0.50,2.50,7000,47578.37,38.57,19.28,6796.91,800.00,0.6546,31.14,0.0529,2.52,33.9451392059326,36.6883378982544,51.8563079833984
A15,char,no,intra,524288,262144,0.50,2.50,3500,51369.68,35.72,17.86,14677.05,800.00,0.6451,33.14,0.0713,3.66,36.118182964325,40.110163192749,55.9885025024414
A15,char,no,intra,1048576,524288,0.50,2.50,1750,59221.25,30.99,15.49,33840.71,800.00,0.6331,37.49,0.0747,4.42,40.8640928287506,45.6856814155579,64.5460319519043
,,,,,,,,,,,,,,,,,,,,
A15,char,no,intra,128,107,0.83,4.00,1739009,7352.83,30.27,25.31,4.23,800.00,0.5040,3.71,0.0510,0.37,19.9244859813084,21.9406542056075,39.5327102803738
A15,char,no,intra,256,213,0.83,4.00,1549709,10486.59,37.83,31.48,6.77,800.00,0.5247,5.50,0.0508,0.53,16.6770845070423,18.2917136150235,31.7840375586854
A15,char,no,intra,512,427,0.83,4.00,1373013,14885.31,47.23,39.39,10.84,800.00,0.5680,8.45,0.0510,0.76,14.4194847775176,15.7141920374707,25.3864168618267
A15,char,no,intra,1024,853,0.83,4.00,1137199,19521.69,59.65,49.69,17.17,800.00,0.5611,10.95,0.0508,0.99,11.2943575615475,12.3169085580305,20.1289566236811
A15,char,no,intra,2048,1707,0.83,4.00,788585,25528.82,63.26,52.73,32.37,800.00,0.5980,15.27,0.0521,1.33,11.3399297012302,12.3279068541301,18.9630931458699
A15,char,no,intra,4096,3413,0.83,4.00,503777,31133.38,66.28,55.23,61.80,800.00,0.6091,18.96,0.0520,1.62,11.0291180779373,11.9706944037504,18.1072370348667
A15,char,no,intra,8192,6827,0.83,4.00,290048,35025.36,67.84,56.53,120.76,800.00,0.6379,22.34,0.0568,1.99,11.2835511937894,12.2882630730921,17.6885894243445
A15,char,no,intra,16384,13653,0.83,4.00,146841,37336.41,64.44,53.70,254.26,800.00,0.6509,24.30,0.0559,2.09,12.1217193290852,13.1627457701604,18.6230132571596
A15,char,no,intra,32768,27307,0.83,4.00,73239,39555.48,60.67,50.56,540.09,800.00,0.6531,25.83,0.0542,2.14,12.9173024865419,13.9892942102758,19.7784450873402
A15,char,no,intra,65536,54613,0.83,4.00,35138,39429.14,58.40,48.67,1122.12,800.00,0.6675,26.32,0.0534,2.11,13.7149598081043,14.8121565927526,20.5467562668229
A15,char,no,intra,131072,109227,0.83,4.00,15000,36546.79,53.80,44.83,2436.45,800.00,0.6678,24.41,0.0531,1.94,14.8961457331978,16.0806101513362,22.306297893378
A15,char,no,intra,262144,218453,0.83,4.00,7500,44984.05,43.71,36.42,5997.87,800.00,0.6565,29.53,0.0530,2.38,18.0249374236106,19.4801113511831,27.456111840991
A15,char,no,intra,524288,436907,0.83,4.00,3500,47494.52,38.64,32.20,13569.86,800.00,0.6456,30.66,0.0763,3.62,20.0516394015202,22.4214350742835,31.0589210060722
A15,char,no,intra,1048576,873813,0.83,4.00,1750,55030.83,33.35,27.79,31446.19,800.00,0.6342,34.90,0.0912,5.02,22.823159758438,26.1052035458388,35.9873222302712
,,,,,,,,,,,,,,,,,,,,
A15,char,yes,intra,128,64,0.50,2.50,1698069,8197.56,26.51,13.26,4.83,800.00,0.5041,4.13,0.0507,0.42,38.043796875,41.8700625,75.46875
A15,char,yes,intra,256,128,0.50,2.50,1572445,11168.92,36.04,18.02,7.10,800.00,0.5277,5.89,0.0509,0.57,29.270859375,32.09421875,55.46875
A15,char,yes,intra,512,256,0.50,2.50,1381377,14170.86,49.91,24.95,10.26,800.00,0.5370,7.61,0.0510,0.72,21.521953125,23.5659375,40.078125
A15,char,yes,intra,1024,512,0.50,2.50,1074590,20377.74,54.00,27.00,18.96,800.00,0.5428,11.06,0.0507,1.03,20.1005625,21.978046875,37.03125
A15,char,yes,intra,2048,1024,0.50,2.50,769737,26296.62,59.95,29.97,34.16,800.00,0.5791,15.23,0.0516,1.36,19.3184140625,21.0397578125,33.359375
A15,char,yes,intra,4096,2048,0.50,2.50,489617,32528.15,61.65,30.83,66.44,800.00,0.5945,19.34,0.0542,1.76,19.286416015625,21.044740234375,32.44140625
A15,char,yes,intra,8192,4096,0.50,2.50,275797,37687.13,59.95,29.97,136.65,800.00,0.6266,23.61,0.0583,2.20,20.9045141601563,22.8495080566406,33.36181640625
A15,char,yes,intra,16384,8192,0.50,2.50,142854,42243.23,55.41,27.70,295.71,800.00,0.6388,26.99,0.0558,2.36,23.0590268554688,25.0732624511719,36.097412109375
A15,char,yes,intra,32768,16384,0.50,2.50,68860,43637.10,51.71,25.85,633.71,800.00,0.6417,28.00,0.0535,2.34,24.8200504760742,26.8893549804688,38.6785888671875
A15,char,yes,intra,65536,32768,0.50,2.50,34752,41403.52,55.01,27.50,1191.40,800.00,0.6576,27.23,0.0533,2.20,23.909443359375,25.8473590087891,36.358642578125
A15,char,yes,intra,131072,65536,0.50,2.50,15000,37711.80,52.13,26.07,2514.12,800.00,0.6597,24.88,0.0530,2.00,25.3076929321289,27.340901550293,38.3624267578125
A15,char,yes,intra,262144,131072,0.50,2.50,7000,43055.07,42.62,21.31,6150.73,800.00,0.6517,28.06,0.0532,2.29,30.5818995742798,33.0783811721802,46.9263458251953
A15,char,yes,intra,524288,262144,0.50,2.50,3500,49658.36,36.95,18.48,14188.10,800.00,0.6348,31.52,0.0785,3.90,34.3574748229981,38.6061543655396,54.1233062744141
A15,char,yes,intra,1048576,524288,0.50,2.50,1750,54494.97,33.67,16.84,31139.98,800.00,0.6284,34.24,0.0927,5.05,37.3236912384033,42.8295890388489,59.3947982788086
,,,,,,,,,,,,,,,,,,,,
A15,char,yes,intra,128,107,0.83,4.00,1765946,6798.01,33.25,27.80,3.85,800.00,0.4868,3.31,0.0508,0.35,17.5157009345794,19.3435514018692,35.981308411215
A15,char,yes,intra,256,213,0.83,4.00,1622879,9888.07,42.02,34.96,6.09,800.00,0.5165,5.11,0.0508,0.50,14.7675352112676,16.219985915493,28.5915492957746
A15,char,yes,intra,512,427,0.83,4.00,1446105,12563.11,58.93,49.15,8.69,800.00,0.5367,6.74,0.0507,0.64,10.9225362997658,11.9543466042155,20.3512880562061
A15,char,yes,intra,1024,853,0.83,4.00,1198370,17724.33,69.23,57.67,14.79,800.00,0.5516,9.78,0.0514,0.91,9.56408440797186,10.4552989449004,17.3388042203986
A15,char,yes,intra,2048,1707,0.83,4.00,890666,24869.88,73.35,61.13,27.92,800.00,0.5768,14.35,0.0511,1.27,9.43424487404804,10.2700456942004,16.3561804335091
A15,char,yes,intra,4096,3413,0.83,4.00,561429,31234.10,73.63,61.35,55.63,800.00,0.6231,19.46,0.0534,1.67,10.1561831233519,11.0265733958394,16.2994433050103
A15,char,yes,intra,8192,6827,0.83,4.00,321341,34793.07,75.66,63.05,108.27,800.00,0.6419,22.33,0.0547,1.90,10.1799491724037,11.0474413358723,15.8590889116742
A15,char,yes,intra,16384,13653,0.83,4.00,170937,38798.04,72.18,60.15,226.97,800.00,0.6463,25.08,0.0570,2.21,10.744210869406,11.6917894235699,16.6241851607705
A15,char,yes,intra,32768,27307,0.83,4.00,79535,38300.31,68.05,56.71,481.55,800.00,0.6550,25.09,0.0545,2.09,11.5507104405464,12.5118000878896,17.6346724283151
A15,char,yes,intra,65536,54613,0.83,4.00,39967,40267.98,65.05,54.20,1007.53,800.00,0.6758,27.21,0.0535,2.15,12.4675219087031,13.4545186860271,18.448537893908
A15,char,yes,intra,131072,109227,0.83,4.00,15000,32203.97,61.05,50.88,2146.93,800.00,0.6672,21.49,0.0535,1.72,13.1142638358648,14.1658422459648,19.6556712168237
A15,char,yes,intra,262144,218453,0.83,4.00,7500,41509.49,47.36,39.47,5534.60,800.00,0.6563,27.24,0.0576,2.39,16.6276406366587,18.0869612227802,25.3354268423872
A15,char,yes,intra,524288,436907,0.83,4.00,3500,46036.77,39.86,33.22,13153.36,800.00,0.6416,29.54,0.0776,3.57,19.3157714937046,21.6519682953123,30.1056288866967
A15,char,yes,intra,1048576,873813,0.83,4.00,1750,52330.32,35.07,29.22,29903.04,800.00,0.6332,33.14,0.0946,4.95,21.6689439594055,24.9062814492346,34.2213265309626
,,,,,,,,,,,,,,,,,,,,
A15,char,no,inter,128,64,0.50,2.50,18706160,18694.03,128.08,64.04,15.99,800.00,0.5846,10.93,0.0509,0.95,9.128666015625,9.9234814453125,15.615234375
A15,char,no,inter,256,128,0.50,2.50,13180784,24489.88,137.78,68.89,29.73,800.00,0.6254,15.32,0.0509,1.25,9.0786826171875,9.81757763671875,14.5166015625
A15,char,no,inter,512,256,0.50,2.50,8149008,33555.53,124.34,62.17,65.88,800.00,0.6406,21.49,0.0511,1.71,10.303400390625,11.1252919921875,16.083984375
A15,char,no,inter,1024,512,0.50,2.50,3781824,33489.32,115.64,57.82,141.69,800.00,0.6625,22.19,0.0509,1.70,11.4586944580078,12.3390681152344,17.296142578125
A15,char,no,inter,2048,1024,0.50,2.50,1895728,37363.09,103.91,51.96,315.35,800.00,0.6539,24.43,0.0508,1.90,12.5858987426758,13.5636685180664,19.2474365234375
A15,char,no,inter,4096,2048,0.50,2.50,885920,40001.75,90.71,45.36,722.44,800.00,0.6638,26.55,0.0511,2.04,14.6348776855469,15.7614854736328,22.047119140625
A15,char,no,inter,8192,4096,0.50,2.50,421488,41390.83,83.42,41.71,1571.23,800.00,0.6665,27.59,0.0509,2.10,15.9793822479248,17.1997131652832,23.9750671386719
A15,char,no,inter,16384,8192,0.50,2.50,188736,40209.17,76.90,38.45,3408.71,800.00,0.6702,26.95,0.0513,2.06,17.42948487854,18.7636128616333,26.0063934326172
A15,char,no,inter,32768,16384,0.50,2.50,82496,42138.78,64.15,32.08,8172.77,800.00,0.6532,27.53,0.0612,2.58,20.3645834503174,22.2725940246582,31.176643371582
A15,char,no,inter,65536,32768,0.50,2.50,30624,39508.86,50.80,25.40,20642.04,800.00,0.6115,24.16,0.0939,3.71,24.0757130813599,27.7727032012939,39.3715667724609
A15,char,no,inter,131072,65536,0.50,2.50,15000,40815.31,48.17,24.09,43536.33,800.00,0.6135,25.04,0.1059,4.32,25.4722008275986,29.8691137332916,41.5194797515869
A15,char,no,inter,262144,131072,0.50,2.50,7000,41395.16,44.33,22.16,94617.52,800.00,0.6245,25.85,0.1137,4.71,28.1756597709656,33.3054796524048,45.1171493530273
A15,char,no,inter,524288,262144,0.50,2.50,3500,43654.86,42.03,21.02,199565.06,800.00,0.6284,27.43,0.1208,5.27,29.8992833385468,35.6469495182037,47.5800180435181
A15,char,no,inter,1048576,524288,0.50,2.50,1750,46316.45,39.62,19.81,423464.66,800.00,0.6165,28.55,0.1273,5.90,31.1214879620075,37.5477092394829,50.4809212684631
,,,,,,,,,,,,,,,,,,,,
A15,char,no,inter,128,107,0.83,4.00,20592832,16139.30,163.32,136.53,12.54,800.00,0.6137,9.90,0.0509,0.82,4.49520911214953,4.86803971962617,7.32476635514019
A15,char,no,inter,256,213,0.83,4.00,14286336,23549.31,155.30,129.22,26.37,800.00,0.6331,14.91,0.0511,1.20,4.89872271126761,5.29411795774648,7.73767605633803
A15,char,no,inter,512,427,0.83,4.00,7631728,26758.62,146.03,121.78,56.10,800.00,0.6162,16.49,0.0510,1.36,5.05983899297424,5.47861826697892,8.21135831381733
A15,char,no,inter,1024,853,0.83,4.00,4583760,36605.86,128.22,106.81,127.78,800.00,0.6391,23.39,0.0510,1.87,5.98360184642438,6.46109158851114,9.36254396248535
A15,char,no,inter,2048,1707,0.83,4.00,2104272,39048.24,110.36,91.99,296.91,800.00,0.6575,25.68,0.0509,1.99,7.14771254393673,7.70104876977153,10.8710456942004
A15,char,no,inter,4096,3413,0.83,4.00,961296,41929.99,93.91,78.25,697.89,800.00,0.6691,28.05,0.0511,2.14,8.55109505933197,9.20415283474949,12.7799956050396
A15,char,no,inter,8192,6827,0.83,4.00,455600,41733.61,89.43,74.53,1465.62,800.00,0.6647,27.74,0.0511,2.13,8.91861005932327,9.60424414091109,13.4174967042625
A15,char,no,inter,16384,13653,0.83,4.00,207968,41914.27,81.29,67.74,3224.67,800.00,0.6665,27.93,0.0517,2.17,9.83869183970556,10.6018731872116,14.7617281916062
A15,char,no,inter,32768,27307,0.83,4.00,86624,40795.52,69.58,57.98,7535.19,800.00,0.6506,26.54,0.0629,2.57,11.2205538277731,12.3053568338704,17.2464706851723
A15,char,no,inter,65536,54613,0.83,4.00,31392,39454.95,52.14,43.45,20109.56,800.00,0.6069,23.94,0.0954,3.76,13.9670178849358,16.1625253923059,23.0137055279878
A15,char,no,inter,131072,109227,0.83,4.00,15000,39513.31,49.76,41.46,42147.53,800.00,0.6182,24.43,0.1074,4.24,14.9090901551356,17.4992491371181,24.1169365175277
A15,char,no,inter,262144,218453,0.83,4.00,7500,41620.43,47.24,39.37,88790.25,800.00,0.6269,26.09,0.1181,4.91,15.9252241114221,18.925334125075,25.4031330537919
A15,char,no,inter,524288,436907,0.83,4.00,3500,42391.12,43.29,36.07,193788.00,800.00,0.6269,26.58,0.1227,5.20,17.3786551256904,20.7800923308622,27.7215746142772
A15,char,no,inter,1048576,873813,0.83,4.00,1750,45019.32,40.76,33.97,411605.22,800.00,0.6249,28.13,0.1297,5.84,18.3972501823903,22.2156584855684,29.4403107415431
,,,,,,,,,,,,,,,,,,,,
A15,char,yes,inter,128,64,0.50,2.50,19644080,17860.39,140.78,70.39,14.55,800.00,0.5734,10.24,0.0511,0.91,8.147431640625,8.8735107421875,14.208984375
A15,char,yes,inter,256,128,0.50,2.50,14383232,23749.32,155.04,77.52,26.42,800.00,0.5961,14.16,0.0510,1.21,7.6899228515625,8.3478427734375,12.900390625
A15,char,yes,inter,512,256,0.50,2.50,9026992,33232.73,139.07,69.54,58.90,800.00,0.6465,21.48,0.0511,1.70,9.29659423828125,10.03140625,14.3798828125
A15,char,yes,inter,1024,512,0.50,2.50,4512336,35874.13,128.80,64.40,127.20,800.00,0.6499,23.32,0.0511,1.83,10.091220703125,10.88466796875,15.52734375
A15,char,yes,inter,2048,1024,0.50,2.50,2072400,37933.33,111.89,55.94,292.86,800.00,0.6655,25.24,0.0511,1.94,11.8956500244141,12.8090500488281,17.874755859375
A15,char,yes,inter,4096,2048,0.50,2.50,963264,40743.50,96.84,48.42,676.76,800.00,0.6777,27.61,0.0512,2.09,13.9965897216797,15.0540272216797,20.653076171875
A15,char,yes,inter,8192,4096,0.50,2.50,451024,40900.70,90.34,45.17,1450.95,800.00,0.6765,27.67,0.0511,2.09,14.9775341033936,16.1088748168945,22.1397399902344
A15,char,yes,inter,16384,8192,0.50,2.50,198944,41023.48,79.45,39.73,3299.30,800.00,0.6775,27.79,0.0513,2.10,17.0538005828857,18.3451068115234,25.1716613769531
A15,char,yes,inter,32768,16384,0.50,2.50,87088,40193.95,71.00,35.50,7384.52,800.00,0.6642,26.70,0.0634,2.55,18.7103202209473,20.4962797241211,28.1697082519531
A15,char,yes,inter,65536,32768,0.50,2.50,32208,39659.73,53.22,26.61,19701.80,800.00,0.6154,24.41,0.0966,3.83,23.1256250762939,26.7556793212891,37.5782012939453
A15,char,yes,inter,131072,65536,0.50,2.50,15000,40244.41,48.85,24.43,42927.37,800.00,0.6169,24.82,0.1090,4.39,25.2551026849747,29.7174242811203,40.9387302398682
A15,char,yes,inter,262144,131072,0.50,2.50,7000,40296.23,45.54,22.77,92105.68,800.00,0.6179,24.90,0.1189,4.79,27.1378038749695,32.3598218078613,43.9194107055664
A15,char,yes,inter,524288,262144,0.50,2.50,3500,44131.45,41.58,20.79,201743.75,800.00,0.6173,27.24,0.1257,5.55,29.6917955577374,35.7378974556923,48.0994582176208
A15,char,yes,inter,1048576,524288,0.50,2.50,1750,48339.18,37.96,18.98,441958.22,800.00,0.6063,29.31,0.1296,6.27,31.9432340605259,38.7712781546116,52.6855254173279
,,,,,,,,,,,,,,,,,,,,
A15,char,yes,inter,128,107,0.83,4.00,21203296,15488.82,175.22,146.48,11.69,800.00,0.6116,9.47,0.0510,0.79,4.17617056074766,4.52441238317757,6.82827102803738
A15,char,yes,inter,256,213,0.83,4.00,14939920,22785.85,167.85,139.66,24.40,800.00,0.6163,14.04,0.0509,1.16,4.4124765258216,4.7769014084507,7.15962441314554
A15,char,yes,inter,512,427,0.83,4.00,9001600,29482.66,156.32,130.37,52.40,800.00,0.6309,18.60,0.0510,1.50,4.8388700234192,5.23002927400468,7.66978922716628
A15,char,yes,inter,1024,853,0.83,4.00,4298672,37623.88,117.00,97.46,140.04,800.00,0.6526,24.55,0.0510,1.92,6.69622684642438,7.21952989449003,10.2608440797186
A15,char,yes,inter,2048,1707,0.83,4.00,2383328,40422.45,120.75,100.65,271.37,800.00,0.6594,26.65,0.0509,2.06,6.55174934094903,7.05748795401289,9.93592560046866
A15,char,yes,inter,4096,3413,0.83,4.00,1038848,40208.37,105.83,88.18,619.28,800.00,0.6850,27.54,0.0510,2.05,7.768217111046,8.34658072077351,11.3404629358336
A15,char,yes,inter,8192,6827,0.83,4.00,480272,40598.17,96.91,80.76,1352.51,800.00,0.6838,27.76,0.0511,2.08,8.46680769371613,9.09952760180167,12.3819942873883
A15,char,yes,inter,16384,13653,0.83,4.00,214064,41734.22,84.04,70.03,3119.38,800.00,0.6788,28.33,0.0521,2.17,9.69308551234161,10.4370598128616,14.2797370541273
A15,char,yes,inter,32768,27307,0.83,4.00,92992,41356.50,73.68,61.40,7115.71,800.00,0.6568,27.16,0.0676,2.80,10.6968870802358,11.7978456165086,16.2863688797744
A15,char,yes,inter,65536,54613,0.83,4.00,32256,38462.76,54.96,45.80,19078.75,800.00,0.6127,23.57,0.0975,3.75,13.3777101205299,15.5065280359072,21.8340299013055
A15,char,yes,inter,262144,218453,0.83,4.00,7500,41416.72,47.47,39.56,88355.67,800.00,0.6221,25.77,0.1198,4.96,15.7259405647325,18.7543406284761,25.2787985287453
A15,char,yes,inter,524288,436907,0.83,4.00,3500,43692.83,42.00,35.00,199738.64,800.00,0.6183,27.01,0.1263,5.52,17.666574510136,21.2753216565539,28.5728198449556
A15,char,yes,inter,1048576,873813,0.83,4.00,1750,46887.90,39.14,32.61,428689.41,800.00,0.6108,28.64,0.1335,6.26,18.7285131106427,22.8219258484796,30.662267699153
