PROC,TYPE,GEN,VEC,N,K,R,SNR (dB),FRA,LD+ST+DEC (ms),CTHR (Mbit/s),ITHR (Mbit/s),LATENCY (us),CLU_FREQ (MHz),CLU_POW (W),CLU_ENE (J),RAM_POW (W),RAM_ENE (J),EB_CLU (nJ),EB_CLU_RAM (nJ),TB_CLU (ns)
A07,char,no,seq,4096,2048,0.50,2.50,106522,55979.34,7.79,3.90,525.52,550.00,0.1879,10.52,0.0532,2.98,48.21543359375,61.86663671875,256.6015625
A07,char,no,seq,1048576,524288,0.50,2.50,300,70689.20,4.45,2.23,235630.67,550.00,0.1791,12.66,0.0693,4.90,80.4928836765289,111.638371330261,449.429836273193
A07,char,yes,seq,4096,2048,0.50,2.50,92647,54027.59,7.02,3.51,583.16,550.00,0.1943,10.50,0.0530,2.87,55.326166015625,70.417708984375,284.74609375
A07,char,yes,seq,1048576,524288,0.50,2.50,300,80249.41,3.92,1.96,267498.06,550.00,0.1871,15.02,0.0700,5.62,95.4606762428284,131.175520374298,510.212059020996
A07,char,no,intra,4096,2048,0.50,2.50,419152,54663.72,31.41,15.70,130.42,550.00,0.1945,10.63,0.0544,2.97,12.3860791015625,15.8503603515625,63.681640625
A07,char,no,intra,1048576,524288,0.50,2.50,1750,107905.21,17.01,8.50,61660.12,550.00,0.1771,19.11,0.0957,10.33,20.8282609024048,32.0832838745117,117.607345581055
A07,char,yes,intra,4096,2048,0.50,2.50,489617,48854.61,41.05,20.52,99.78,550.00,0.1946,9.51,0.0514,2.51,9.481048828125,11.98529296875,48.720703125
A07,char,yes,intra,1048576,524288,0.50,2.50,1750,108798.44,16.87,8.43,62170.54,550.00,0.1693,18.42,0.1005,10.93,20.0757454338074,31.993125328064,118.580894470215
A07,char,no,inter,4096,2048,0.50,2.50,885920,69054.94,52.55,26.27,1247.15,550.00,0.2039,14.08,0.0658,4.54,7.76043350219727,10.2647813415527,38.0599975585938
A07,char,no,inter,1048576,524288,0.50,2.50,1750,119993.62,15.29,7.65,1097084.50,550.00,0.1613,19.35,0.1069,12.83,21.0952436745167,35.0759104371071,130.782663822174
A07,char,yes,inter,4096,2048,0.50,2.50,963264,80414.14,49.07,24.53,1335.69,550.00,0.1951,15.69,0.0768,6.17,7.95267086791992,11.0831943054199,40.7620239257812
A07,char,yes,inter,1048576,524288,0.50,2.50,1750,117590.66,15.61,7.80,1075114.62,550.00,0.1575,18.52,0.1077,12.67,20.1857748806477,33.9889999895096,128.163650035858
