# -> Seq 8-bit, rate 1/2, no gen:
# ------|-------|-----|-------|--------|--------|------||-------|----------||-----------|---------|---------|----------|----------||----------|---------|---------|----------|---------|---------|---------|---------|
#  PROC |  TYPE | GEN |   VEC |      N |      K |    R ||   SNR |      FRA || LD+ST+DEC |    CTHR |    ITHR |  LATENCY | RUNTIME  || BIG FREQ | BIG POW | BIG ENE | LIT FREQ | LIT POW | LIT ENE | RAM POW | RAM ENE |
#       |       |     |       |        |        |      ||  (dB) |          ||      (ms) |  (Mb/s) |  (Mb/s) |     (us) | (hhmmss) ||    (Mhz) |     (W) |     (J) |    (Mhz) |     (W) |     (J) |     (W) |     (J) |
# ------|-------|-----|-------|--------|--------|------||-------|----------||-----------|---------|---------|----------|----------||----------|---------|---------|----------|---------|---------|---------|---------|
    A53 |  char |  no |   seq |    128 |     64 | 0.50 ||  2.50 |  1332899 ||  25426.66 |    6.71 |    3.35 |    19.08 | 00h00'25 ||   450.00 |  0.0168 |    0.43 |   450.00 |  0.0637 |    1.62 |  0.0000 |    0.00
    A53 |  char |  no |   seq |    256 |    128 | 0.50 ||  2.50 |  1048729 ||  43222.45 |    6.21 |    3.11 |    41.21 | 00h00'43 ||   450.00 |  0.0170 |    0.73 |   450.00 |  0.0628 |    2.71 |  0.0000 |    0.00
    A53 |  char |  no |   seq |    512 |    256 | 0.50 ||  2.50 |   699036 ||  63407.37 |    5.64 |    2.82 |    90.71 | 00h01'03 ||   450.00 |  0.0168 |    1.06 |   450.00 |  0.0620 |    3.93 |  0.0000 |    0.00
    A53 |  char |  no |   seq |   1024 |    512 | 0.50 ||  2.50 |   399077 ||  81840.05 |    4.99 |    2.50 |   205.07 | 00h01'21 ||   450.00 |  0.0168 |    1.37 |   450.00 |  0.0617 |    5.05 |  0.0000 |    0.00
    A53 |  char |  no |   seq |   2048 |   1024 | 0.50 ||  2.50 |   213346 ||  95455.52 |    4.58 |    2.29 |   447.42 | 00h01'35 ||   450.00 |  0.0167 |    1.60 |   450.00 |  0.0616 |    5.88 |  0.0000 |    0.00
    A53 |  char |  no |   seq |   4096 |   2048 | 0.50 ||  2.50 |   106522 || 102921.74 |    4.24 |    2.12 |   966.20 | 00h01'43 ||   450.00 |  0.0167 |    1.72 |   450.00 |  0.0615 |    6.33 |  0.0000 |    0.00
    A53 |  char |  no |   seq |   8192 |   4096 | 0.50 ||  2.50 |    52362 || 108243.48 |    3.96 |    1.98 |  2067.21 | 00h01'48 ||   450.00 |  0.0167 |    1.81 |   450.00 |  0.0617 |    6.68 |  0.0000 |    0.00
    A53 |  char |  no |   seq |  16384 |   8192 | 0.50 ||  2.50 |    24703 || 110946.78 |    3.65 |    1.82 |  4491.23 | 00h01'51 ||   450.00 |  0.0167 |    1.86 |   450.00 |  0.0624 |    6.92 |  0.0000 |    0.00
    A53 |  char |  no |   seq |  32768 |  16384 | 0.50 ||  2.50 |    11635 || 112101.05 |    3.40 |    1.70 |  9634.81 | 00h01'53 ||   450.00 |  0.0168 |    1.88 |   450.00 |  0.0629 |    7.05 |  0.0000 |    0.00
    A53 |  char |  no |   seq |  65536 |  32768 | 0.50 ||  2.50 |     5560 || 112885.66 |    3.23 |    1.61 | 20303.18 | 00h01'55 ||   450.00 |  0.0168 |    1.89 |   450.00 |  0.0633 |    7.15 |  0.0000 |    0.00
    A53 |  char |  no |   seq |   131072 |   65536 | 0.50 ||  2.50 |     2500 || 110048.00 |    2.98 |    1.49 | 44019.20 | 00h01'54 ||   450.00 |  0.0168 |    1.85 |   450.00 |  0.0639 |    7.03 |  0.0000 |    0.00
    A53 |  char |  no |   seq |   262144 |  131072 | 0.50 ||  2.50 |     1250 || 118473.29 |    2.77 |    1.38 | 94778.63 | 00h02'06 ||   450.00 |  0.0168 |    1.99 |   450.00 |  0.0639 |    7.57 |  0.0000 |    0.00
    A53 |  char |  no |   seq |   524288 |  262144 | 0.50 ||  2.50 |      625 || 125501.02 |    2.61 |    1.31 | 200801.64 | 00h02'20 ||   450.00 |  0.0170 |    2.13 |   450.00 |  0.0639 |    8.02 |  0.0000 |    0.00
    A53 |  char |  no |   seq |  1048576 |  524288 | 0.50 ||  2.50 |      300 || 128711.33 |    2.44 |    1.22 | 429037.75 | 00h02'38 ||   450.00 |  0.0169 |    2.18 |   450.00 |  0.0641 |    8.25 |  0.0000 |    0.00
#---------
#---------
# -> Seq 8-bit, rate 5/6, no gen:
# ------|-------|-----|-------|--------|--------|------||-------|----------||-----------|---------|---------|----------|----------||----------|---------|---------|----------|---------|---------|---------|---------|
#  PROC |  TYPE | GEN |   VEC |      N |      K |    R ||   SNR |      FRA || LD+ST+DEC |    CTHR |    ITHR |  LATENCY | RUNTIME  || BIG FREQ | BIG POW | BIG ENE | LIT FREQ | LIT POW | LIT ENE | RAM POW | RAM ENE |
#       |       |     |       |        |        |      ||  (dB) |          ||      (ms) |  (Mb/s) |  (Mb/s) |     (us) | (hhmmss) ||    (Mhz) |     (W) |     (J) |    (Mhz) |     (W) |     (J) |     (W) |     (J) |
# ------|-------|-----|-------|--------|--------|------||-------|----------||-----------|---------|---------|----------|----------||----------|---------|---------|----------|---------|---------|---------|---------|
    A53 |  char |  no |   seq |    128 |    107 | 0.83 ||  4.00 |  1453651 ||  21328.08 |    8.72 |    7.29 |    14.67 | 00h00'21 ||   450.00 |  0.0168 |    0.36 |   450.00 |  0.0616 |    1.31 |  0.0000 |    0.00
    A53 |  char |  no |   seq |    256 |    213 | 0.83 ||  4.00 |  1102321 ||  40501.02 |    6.97 |    5.80 |    36.74 | 00h00'40 ||   450.00 |  0.0167 |    0.68 |   450.00 |  0.0627 |    2.54 |  0.0000 |    0.00
    A53 |  char |  no |   seq |    512 |    427 | 0.83 ||  4.00 |   752754 ||  61938.06 |    6.22 |    5.19 |    82.28 | 00h01'01 ||   450.00 |  0.0169 |    1.04 |   450.00 |  0.0616 |    3.81 |  0.0000 |    0.00
    A53 |  char |  no |   seq |   1024 |    853 | 0.83 ||  4.00 |   457183 ||  81011.12 |    5.78 |    4.81 |   177.20 | 00h01'21 ||   450.00 |  0.0168 |    1.36 |   450.00 |  0.0612 |    4.96 |  0.0000 |    0.00
    A53 |  char |  no |   seq |   2048 |   1707 | 0.83 ||  4.00 |   238931 ||  94855.81 |    5.16 |    4.30 |   397.00 | 00h01'34 ||   450.00 |  0.0168 |    1.59 |   450.00 |  0.0616 |    5.84 |  0.0000 |    0.00
    A53 |  char |  no |   seq |   4096 |   3413 | 0.83 ||  4.00 |   118322 || 105095.41 |    4.61 |    3.84 |   888.22 | 00h01'45 ||   450.00 |  0.0167 |    1.76 |   450.00 |  0.0614 |    6.46 |  0.0000 |    0.00
    A53 |  char |  no |   seq |   8192 |   6827 | 0.83 ||  4.00 |    57604 || 109483.00 |    4.31 |    3.59 |  1900.61 | 00h01'49 ||   450.00 |  0.0167 |    1.83 |   450.00 |  0.0616 |    6.75 |  0.0000 |    0.00
    A53 |  char |  no |   seq |  16384 |  13653 | 0.83 ||  4.00 |    27305 || 111575.55 |    4.01 |    3.34 |  4086.27 | 00h01'52 ||   450.00 |  0.0168 |    1.87 |   450.00 |  0.0619 |    6.90 |  0.0000 |    0.00
    A53 |  char |  no |   seq |  32768 |  27307 | 0.83 ||  4.00 |    12609 || 112550.48 |    3.67 |    3.06 |  8926.20 | 00h01'53 ||   450.00 |  0.0168 |    1.89 |   450.00 |  0.0623 |    7.02 |  0.0000 |    0.00
    A53 |  char |  no |   seq |  65536 |  54613 | 0.83 ||  4.00 |     5896 || 114455.07 |    3.38 |    2.81 | 19412.33 | 00h01'56 ||   450.00 |  0.0168 |    1.92 |   450.00 |  0.0628 |    7.19 |  0.0000 |    0.00
    A53 |  char |  no |   seq |   131072 |  109227 | 0.83 ||  4.00 |     2500 || 103522.01 |    3.17 |    2.64 | 41408.80 | 00h01'46 ||   450.00 |  0.0168 |    1.74 |   450.00 |  0.0635 |    6.58 |  0.0000 |    0.00
    A53 |  char |  no |   seq |   262144 |  218453 | 0.83 ||  4.00 |     1250 || 111745.13 |    2.93 |    2.44 | 89396.11 | 00h01'58 ||   450.00 |  0.0170 |    1.90 |   450.00 |  0.0635 |    7.10 |  0.0000 |    0.00
    A53 |  char |  no |   seq |   524288 |  436907 | 0.83 ||  4.00 |      625 || 121279.40 |    2.70 |    2.25 | 194047.05 | 00h02'13 ||   450.00 |  0.0169 |    2.04 |   450.00 |  0.0638 |    7.73 |  0.0000 |    0.00
    A53 |  char |  no |   seq |  1048576 |  873813 | 0.83 ||  4.00 |      300 || 123633.23 |    2.54 |    2.12 | 412110.78 | 00h02'27 ||   450.00 |  0.0169 |    2.09 |   450.00 |  0.0638 |    7.89 |  0.0000 |    0.00
#---------
#---------
# -> Seq 8-bit, rate 1/2, gen:
# ------|-------|-----|-------|--------|--------|------||-------|----------||-----------|---------|---------|----------|----------||----------|---------|---------|----------|---------|---------|---------|---------|
#  PROC |  TYPE | GEN |   VEC |      N |      K |    R ||   SNR |      FRA || LD+ST+DEC |    CTHR |    ITHR |  LATENCY | RUNTIME  || BIG FREQ | BIG POW | BIG ENE | LIT FREQ | LIT POW | LIT ENE | RAM POW | RAM ENE |
#       |       |     |       |        |        |      ||  (dB) |          ||      (ms) |  (Mb/s) |  (Mb/s) |     (us) | (hhmmss) ||    (Mhz) |     (W) |     (J) |    (Mhz) |     (W) |     (J) |     (W) |     (J) |
# ------|-------|-----|-------|--------|--------|------||-------|----------||-----------|---------|---------|----------|----------||----------|---------|---------|----------|---------|---------|---------|---------|
    A53 |  char | yes |   seq |    128 |     64 | 0.50 ||  2.50 |  1372446 ||  19804.65 |    8.87 |    4.44 |    14.43 | 00h00'19 ||   450.00 |  0.0169 |    0.33 |   450.00 |  0.0645 |    1.28 |  0.0000 |    0.00
    A53 |  char | yes |   seq |    256 |    128 | 0.50 ||  2.50 |  1039196 ||  32848.20 |    8.10 |    4.05 |    31.61 | 00h00'32 ||   450.00 |  0.0168 |    0.55 |   450.00 |  0.0638 |    2.10 |  0.0000 |    0.00
    A53 |  char | yes |   seq |    512 |    256 | 0.50 ||  2.50 |   672044 ||  47847.18 |    7.19 |    3.60 |    71.20 | 00h00'47 ||   450.00 |  0.0168 |    0.80 |   450.00 |  0.0638 |    3.05 |  0.0000 |    0.00
    A53 |  char | yes |   seq |   1024 |    512 | 0.50 ||  2.50 |   367136 ||  59833.17 |    6.28 |    3.14 |   162.97 | 00h00'59 ||   450.00 |  0.0169 |    1.01 |   450.00 |  0.0646 |    3.87 |  0.0000 |    0.00
    A53 |  char | yes |   seq |   2048 |   1024 | 0.50 ||  2.50 |   185879 ||  67164.31 |    5.67 |    2.83 |   361.33 | 00h01'07 ||   450.00 |  0.0167 |    1.12 |   450.00 |  0.0648 |    4.35 |  0.0000 |    0.00
    A53 |  char | yes |   seq |   4096 |   2048 | 0.50 ||  2.50 |    92647 ||  74280.58 |    5.11 |    2.55 |   801.76 | 00h01'14 ||   450.00 |  0.0167 |    1.24 |   450.00 |  0.0648 |    4.82 |  0.0000 |    0.00
    A53 |  char | yes |   seq |   8192 |   4096 | 0.50 ||  2.50 |    44280 ||  76236.77 |    4.76 |    2.38 |  1721.70 | 00h01'16 ||   450.00 |  0.0167 |    1.28 |   450.00 |  0.0654 |    4.98 |  0.0000 |    0.00
    A53 |  char | yes |   seq |  16384 |   8192 | 0.50 ||  2.50 |    20875 ||  77971.70 |    4.39 |    2.19 |  3735.17 | 00h01'17 ||   450.00 |  0.0168 |    1.31 |   450.00 |  0.0663 |    5.17 |  0.0000 |    0.00
    A53 |  char | yes |   seq |  32768 |  16384 | 0.50 ||  2.50 |     9828 ||  79289.67 |    4.06 |    2.03 |  8067.73 | 00h01'19 ||   450.00 |  0.0168 |    1.33 |   450.00 |  0.0669 |    5.31 |  0.0000 |    0.00
    A53 |  char | yes |   seq |  65536 |  32768 | 0.50 ||  2.50 |     4714 ||  79618.05 |    3.88 |    1.94 | 16889.70 | 00h01'19 ||   450.00 |  0.0167 |    1.33 |   450.00 |  0.0673 |    5.36 |  0.0000 |    0.00
    A53 |  char | yes |   seq |   131072 |   65536 | 0.50 ||  2.50 |     2500 ||  92034.55 |    3.56 |    1.78 | 36813.82 | 00h01'32 ||   450.00 |  0.0168 |    1.54 |   450.00 |  0.0682 |    6.28 |  0.0000 |    0.00
    A53 |  char | yes |   seq |   262144 |  131072 | 0.50 ||  2.50 |     1250 ||  99830.77 |    3.28 |    1.64 | 79864.62 | 00h01'40 ||   450.00 |  0.0168 |    1.68 |   450.00 |  0.0683 |    6.82 |  0.0000 |    0.00
    A53 |  char | yes |   seq |   524288 |  262144 | 0.50 ||  2.50 |      625 || 107946.70 |    3.04 |    1.52 | 172714.72 | 00h01'48 ||   450.00 |  0.0168 |    1.81 |   450.00 |  0.0687 |    7.41 |  0.0000 |    0.00
    A53 |  char | yes |   seq |  1048576 |  524288 | 0.50 ||  2.50 |      300 || 108176.85 |    2.91 |    1.45 | 360589.50 | 00h01'49 ||   450.00 |  0.0168 |    1.81 |   450.00 |  0.0687 |    7.43 |  0.0000 |    0.00
#---------
#---------
# -> Seq 8-bit, rate 5/6, gen:
# ------|-------|-----|-------|--------|--------|------||-------|----------||-----------|---------|---------|----------|----------||----------|---------|---------|----------|---------|---------|---------|---------|
#  PROC |  TYPE | GEN |   VEC |      N |      K |    R ||   SNR |      FRA || LD+ST+DEC |    CTHR |    ITHR |  LATENCY | RUNTIME  || BIG FREQ | BIG POW | BIG ENE | LIT FREQ | LIT POW | LIT ENE | RAM POW | RAM ENE |
#       |       |     |       |        |        |      ||  (dB) |          ||      (ms) |  (Mb/s) |  (Mb/s) |     (us) | (hhmmss) ||    (Mhz) |     (W) |     (J) |    (Mhz) |     (W) |     (J) |     (W) |     (J) |
# ------|-------|-----|-------|--------|--------|------||-------|----------||-----------|---------|---------|----------|----------||----------|---------|---------|----------|---------|---------|---------|---------|
    A53 |  char | yes |   seq |    128 |    107 | 0.83 ||  4.00 |  1468511 ||  17490.58 |   10.75 |    8.98 |    11.91 | 00h00'17 ||   450.00 |  0.0169 |    0.29 |   450.00 |  0.0623 |    1.09 |  0.0000 |    0.00
    A53 |  char | yes |   seq |    256 |    213 | 0.83 ||  4.00 |  1089749 ||  32258.69 |    8.65 |    7.20 |    29.60 | 00h00'32 ||   450.00 |  0.0168 |    0.54 |   450.00 |  0.0638 |    2.06 |  0.0000 |    0.00
    A53 |  char | yes |   seq |    512 |    427 | 0.83 ||  4.00 |   718502 ||  47000.54 |    7.83 |    6.53 |    65.41 | 00h00'47 ||   450.00 |  0.0168 |    0.79 |   450.00 |  0.0637 |    2.99 |  0.0000 |    0.00
    A53 |  char | yes |   seq |   1024 |    853 | 0.83 ||  4.00 |   417855 ||  60553.35 |    7.07 |    5.89 |   144.91 | 00h01'00 ||   450.00 |  0.0168 |    1.02 |   450.00 |  0.0637 |    3.86 |  0.0000 |    0.00
    A53 |  char | yes |   seq |   2048 |   1707 | 0.83 ||  4.00 |   210135 ||  67761.35 |    6.35 |    5.29 |   322.47 | 00h01'07 ||   450.00 |  0.0167 |    1.13 |   450.00 |  0.0643 |    4.36 |  0.0000 |    0.00
    A53 |  char | yes |   seq |   4096 |   3413 | 0.83 ||  4.00 |   101774 ||  73664.19 |    5.66 |    4.72 |   723.80 | 00h01'13 ||   450.00 |  0.0167 |    1.23 |   450.00 |  0.0648 |    4.77 |  0.0000 |    0.00
    A53 |  char | yes |   seq |   8192 |   6827 | 0.83 ||  4.00 |    48800 ||  77169.84 |    5.18 |    4.32 |  1581.35 | 00h01'17 ||   450.00 |  0.0173 |    1.33 |   450.00 |  0.0649 |    5.01 |  0.0000 |    0.00
    A53 |  char | yes |   seq |  16384 |  13653 | 0.83 ||  4.00 |    22830 ||  78360.88 |    4.77 |    3.98 |  3432.36 | 00h01'18 ||   450.00 |  0.0172 |    1.35 |   450.00 |  0.0656 |    5.14 |  0.0000 |    0.00
    A53 |  char | yes |   seq |  32768 |  27307 | 0.83 ||  4.00 |    10570 ||  78530.86 |    4.41 |    3.68 |  7429.60 | 00h01'18 ||   450.00 |  0.0171 |    1.34 |   450.00 |  0.0663 |    5.20 |  0.0000 |    0.00
    A53 |  char | yes |   seq |  65536 |  54613 | 0.83 ||  4.00 |     4895 ||  79453.55 |    4.04 |    3.36 | 16231.57 | 00h01'19 ||   450.00 |  0.0168 |    1.33 |   450.00 |  0.0669 |    5.32 |  0.0000 |    0.00
    A53 |  char | yes |   seq |   131072 |  109227 | 0.83 ||  4.00 |     2500 ||  87085.12 |    3.76 |    3.14 | 34834.05 | 00h01'27 ||   450.00 |  0.0167 |    1.46 |   450.00 |  0.0676 |    5.89 |  0.0000 |    0.00
    A53 |  char | yes |   seq |   262144 |  218453 | 0.83 ||  4.00 |     1250 ||  96389.67 |    3.40 |    2.83 | 77111.73 | 00h01'36 ||   450.00 |  0.0169 |    1.63 |   450.00 |  0.0683 |    6.58 |  0.0000 |    0.00
    A53 |  char | yes |   seq |   524288 |  436907 | 0.83 ||  4.00 |      625 || 105092.04 |    3.12 |    2.60 | 168147.27 | 00h01'45 ||   450.00 |  0.0168 |    1.77 |   450.00 |  0.0686 |    7.21 |  0.0000 |    0.00
    A53 |  char | yes |   seq |  1048576 |  873813 | 0.83 ||  4.00 |      300 || 105176.04 |    2.99 |    2.49 | 350586.81 | 00h01'46 ||   450.00 |  0.0169 |    1.77 |   450.00 |  0.0683 |    7.18 |  0.0000 |    0.00
#---------
#---------
# -> Intra-SIMD 8-bit, rate 1/2, no gen:
# ------|-------|-----|-------|--------|--------|------||-------|----------||-----------|---------|---------|----------|----------||----------|---------|---------|----------|---------|---------|---------|---------|
#  PROC |  TYPE | GEN |   VEC |      N |      K |    R ||   SNR |      FRA || LD+ST+DEC |    CTHR |    ITHR |  LATENCY | RUNTIME  || BIG FREQ | BIG POW | BIG ENE | LIT FREQ | LIT POW | LIT ENE | RAM POW | RAM ENE |
#       |       |     |       |        |        |      ||  (dB) |          ||      (ms) |  (Mb/s) |  (Mb/s) |     (us) | (hhmmss) ||    (Mhz) |     (W) |     (J) |    (Mhz) |     (W) |     (J) |     (W) |     (J) |
# ------|-------|-----|-------|--------|--------|------||-------|----------||-----------|---------|---------|----------|----------||----------|---------|---------|----------|---------|---------|---------|---------|
    A53 |  char |  no | intra |    128 |     64 | 0.50 ||  2.50 |  1628908 ||  14127.60 |   14.76 |    7.38 |     8.67 | 00h00'14 ||   450.00 |  0.0167 |    0.24 |   450.00 |  0.0679 |    0.96 |  0.0000 |    0.00
    A53 |  char |  no | intra |    256 |    128 | 0.50 ||  2.50 |  1482148 ||  21411.12 |   17.72 |    8.86 |    14.45 | 00h00'21 ||   450.00 |  0.0168 |    0.36 |   450.00 |  0.0674 |    1.44 |  0.0000 |    0.00
    A53 |  char |  no | intra |    512 |    256 | 0.50 ||  2.50 |  1287237 ||  34258.20 |   19.24 |    9.62 |    26.61 | 00h00'34 ||   450.00 |  0.0167 |    0.57 |   450.00 |  0.0682 |    2.33 |  0.0000 |    0.00
    A53 |  char |  no | intra |   1024 |    512 | 0.50 ||  2.50 |   979960 ||  52800.93 |   19.00 |    9.50 |    53.88 | 00h00'52 ||   450.00 |  0.0168 |    0.88 |   450.00 |  0.0682 |    3.60 |  0.0000 |    0.00
    A53 |  char |  no | intra |   2048 |   1024 | 0.50 ||  2.50 |   657025 ||  67905.83 |   19.82 |    9.91 |   103.35 | 00h01'08 ||   450.00 |  0.0168 |    1.14 |   450.00 |  0.0693 |    4.70 |  0.0000 |    0.00
    A53 |  char |  no | intra |   4096 |   2048 | 0.50 ||  2.50 |   419152 ||  85176.32 |   20.16 |   10.08 |   203.21 | 00h01'25 ||   450.00 |  0.0168 |    1.43 |   450.00 |  0.0701 |    5.98 |  0.0000 |    0.00
    A53 |  char |  no | intra |   8192 |   4096 | 0.50 ||  2.50 |   234743 ||  95700.45 |   20.09 |   10.05 |   407.68 | 00h01'36 ||   450.00 |  0.0168 |    1.60 |   450.00 |  0.0725 |    6.94 |  0.0000 |    0.00
    A53 |  char |  no | intra |  16384 |   8192 | 0.50 ||  2.50 |   121493 || 102591.87 |   19.40 |    9.70 |   844.43 | 00h01'43 ||   450.00 |  0.0169 |    1.74 |   450.00 |  0.0754 |    7.74 |  0.0000 |    0.00
    A53 |  char |  no | intra |  32768 |  16384 | 0.50 ||  2.50 |    61018 || 105080.85 |   19.03 |    9.51 |  1722.13 | 00h01'46 ||   450.00 |  0.0168 |    1.77 |   450.00 |  0.0779 |    8.19 |  0.0000 |    0.00
    A53 |  char |  no | intra |  65536 |  32768 | 0.50 ||  2.50 |    29966 || 105298.42 |   18.65 |    9.33 |  3513.93 | 00h01'47 ||   450.00 |  0.0168 |    1.77 |   450.00 |  0.0805 |    8.47 |  0.0000 |    0.00
    A53 |  char |  no | intra |   131072 |   65536 | 0.50 ||  2.50 |    15000 || 112097.28 |   17.54 |    8.77 |  7473.15 | 00h01'56 ||   450.00 |  0.0168 |    1.88 |   450.00 |  0.0826 |    9.26 |  0.0000 |    0.00
    A53 |  char |  no | intra |   262144 |  131072 | 0.50 ||  2.50 |     7000 || 113682.60 |   16.14 |    8.07 | 16240.37 | 00h02'01 ||   450.00 |  0.0169 |    1.92 |   450.00 |  0.0846 |    9.61 |  0.0000 |    0.00
    A53 |  char |  no | intra |   524288 |  262144 | 0.50 ||  2.50 |     3500 || 122007.47 |   15.04 |    7.52 | 34859.28 | 00h02'16 ||   450.00 |  0.0170 |    2.07 |   450.00 |  0.0851 |   10.38 |  0.0000 |    0.00
    A53 |  char |  no | intra |  1048576 |  524288 | 0.50 ||  2.50 |     1750 || 127515.30 |   14.39 |    7.20 | 72865.89 | 00h02'36 ||   450.00 |  0.0169 |    2.15 |   450.00 |  0.0860 |   10.97 |  0.0000 |    0.00
#---------
#---------
# -> Intra-SIMD 8-bit, rate 5/6, no gen:
# ------|-------|-----|-------|--------|--------|------||-------|----------||-----------|---------|---------|----------|----------||----------|---------|---------|----------|---------|---------|---------|---------|
#  PROC |  TYPE | GEN |   VEC |      N |      K |    R ||   SNR |      FRA || LD+ST+DEC |    CTHR |    ITHR |  LATENCY | RUNTIME  || BIG FREQ | BIG POW | BIG ENE | LIT FREQ | LIT POW | LIT ENE | RAM POW | RAM ENE |
#       |       |     |       |        |        |      ||  (dB) |          ||      (ms) |  (Mb/s) |  (Mb/s) |     (us) | (hhmmss) ||    (Mhz) |     (W) |     (J) |    (Mhz) |     (W) |     (J) |     (W) |     (J) |
# ------|-------|-----|-------|--------|--------|------||-------|----------||-----------|---------|---------|----------|----------||----------|---------|---------|----------|---------|---------|---------|---------|
    A53 |  char |  no | intra |    128 |    107 | 0.83 ||  4.00 |  1739009 ||   9291.72 |   23.96 |   20.03 |     5.34 | 00h00'09 ||   450.00 |  0.0179 |    0.17 |   450.00 |  0.0682 |    0.63 |  0.0000 |    0.00
    A53 |  char |  no | intra |    256 |    213 | 0.83 ||  4.00 |  1549709 ||  18261.64 |   21.72 |   18.08 |    11.78 | 00h00'18 ||   450.00 |  0.0168 |    0.31 |   450.00 |  0.0680 |    1.24 |  0.0000 |    0.00
    A53 |  char |  no | intra |    512 |    427 | 0.83 ||  4.00 |  1373013 ||  29486.13 |   23.84 |   19.88 |    21.48 | 00h00'29 ||   450.00 |  0.0167 |    0.49 |   450.00 |  0.0688 |    2.03 |  0.0000 |    0.00
    A53 |  char |  no | intra |   1024 |    853 | 0.83 ||  4.00 |  1137199 ||  45642.63 |   25.51 |   21.25 |    40.14 | 00h00'45 ||   450.00 |  0.0168 |    0.77 |   450.00 |  0.0699 |    3.19 |  0.0000 |    0.00
    A53 |  char |  no | intra |   2048 |   1707 | 0.83 ||  4.00 |   788585 ||  64878.47 |   24.89 |   20.75 |    82.27 | 00h01'04 ||   450.00 |  0.0168 |    1.09 |   450.00 |  0.0702 |    4.55 |  0.0000 |    0.00
    A53 |  char |  no | intra |   4096 |   3413 | 0.83 ||  4.00 |   503777 ||  83299.84 |   24.77 |   20.64 |   165.35 | 00h01'23 ||   450.00 |  0.0168 |    1.40 |   450.00 |  0.0722 |    6.01 |  0.0000 |    0.00
    A53 |  char |  no | intra |   8192 |   6827 | 0.83 ||  4.00 |   290048 ||  96457.06 |   24.63 |   20.53 |   332.56 | 00h01'36 ||   450.00 |  0.0168 |    1.62 |   450.00 |  0.0733 |    7.07 |  0.0000 |    0.00
    A53 |  char |  no | intra |  16384 |  13653 | 0.83 ||  4.00 |   146841 || 100082.19 |   24.04 |   20.03 |   681.57 | 00h01'40 ||   450.00 |  0.0168 |    1.68 |   450.00 |  0.0770 |    7.71 |  0.0000 |    0.00
    A53 |  char |  no | intra |  32768 |  27307 | 0.83 ||  4.00 |    73239 || 106343.60 |   22.57 |   18.81 |  1452.01 | 00h01'47 ||   450.00 |  0.0169 |    1.80 |   450.00 |  0.0802 |    8.53 |  0.0000 |    0.00
    A53 |  char |  no | intra |  65536 |  54613 | 0.83 ||  4.00 |    35138 || 107966.55 |   21.33 |   17.77 |  3072.64 | 00h01'49 ||   450.00 |  0.0168 |    1.82 |   450.00 |  0.0824 |    8.90 |  0.0000 |    0.00
    A53 |  char |  no | intra |   131072 |  109227 | 0.83 ||  4.00 |    15000 ||  95883.33 |   20.50 |   17.09 |  6392.22 | 00h01'39 ||   450.00 |  0.0167 |    1.61 |   450.00 |  0.0858 |    8.22 |  0.0000 |    0.00
    A53 |  char |  no | intra |   262144 |  218453 | 0.83 ||  4.00 |     7500 || 106788.71 |   18.41 |   15.34 | 14238.50 | 00h01'53 ||   450.00 |  0.0169 |    1.81 |   450.00 |  0.0872 |    9.31 |  0.0000 |    0.00
    A53 |  char |  no | intra |   524288 |  436907 | 0.83 ||  4.00 |     3500 || 111080.10 |   16.52 |   13.77 | 31737.17 | 00h02'03 ||   450.00 |  0.0169 |    1.88 |   450.00 |  0.0879 |    9.76 |  0.0000 |    0.00
    A53 |  char |  no | intra |  1048576 |  873813 | 0.83 ||  4.00 |     1750 || 119049.46 |   15.41 |   12.84 | 68028.27 | 00h02'23 ||   450.00 |  0.0170 |    2.02 |   450.00 |  0.0882 |   10.50 |  0.0000 |    0.00
#---------
#---------
# -> Intra-SIMD 8-bit, rate 1/2, gen:
# ------|-------|-----|-------|--------|--------|------||-------|----------||-----------|---------|---------|----------|----------||----------|---------|---------|----------|---------|---------|---------|---------|
#  PROC |  TYPE | GEN |   VEC |      N |      K |    R ||   SNR |      FRA || LD+ST+DEC |    CTHR |    ITHR |  LATENCY | RUNTIME  || BIG FREQ | BIG POW | BIG ENE | LIT FREQ | LIT POW | LIT ENE | RAM POW | RAM ENE |
#       |       |     |       |        |        |      ||  (dB) |          ||      (ms) |  (Mb/s) |  (Mb/s) |     (us) | (hhmmss) ||    (Mhz) |     (W) |     (J) |    (Mhz) |     (W) |     (J) |     (W) |     (J) |
# ------|-------|-----|-------|--------|--------|------||-------|----------||-----------|---------|---------|----------|----------||----------|---------|---------|----------|---------|---------|---------|---------|
    A53 |  char | yes | intra |    128 |     64 | 0.50 ||  2.50 |  1698069 ||   7662.33 |   28.37 |   14.18 |     4.51 | 00h00'07 ||   450.00 |  0.0171 |    0.13 |   450.00 |  0.0692 |    0.53 |  0.0000 |    0.00
    A53 |  char | yes | intra |    256 |    128 | 0.50 ||  2.50 |  1572445 ||  13726.27 |   29.33 |   14.66 |     8.73 | 00h00'13 ||   450.00 |  0.0167 |    0.23 |   450.00 |  0.0686 |    0.94 |  0.0000 |    0.00
    A53 |  char | yes | intra |    512 |    256 | 0.50 ||  2.50 |  1381377 ||  21892.90 |   32.31 |   16.15 |    15.85 | 00h00'21 ||   450.00 |  0.0167 |    0.37 |   450.00 |  0.0712 |    1.56 |  0.0000 |    0.00
    A53 |  char | yes | intra |   1024 |    512 | 0.50 ||  2.50 |  1074590 ||  37039.37 |   29.71 |   14.85 |    34.47 | 00h00'37 ||   450.00 |  0.0168 |    0.62 |   450.00 |  0.0723 |    2.68 |  0.0000 |    0.00
    A53 |  char | yes | intra |   2048 |   1024 | 0.50 ||  2.50 |   769737 ||  53536.39 |   29.45 |   14.72 |    69.55 | 00h00'53 ||   450.00 |  0.0168 |    0.90 |   450.00 |  0.0724 |    3.87 |  0.0000 |    0.00
    A53 |  char | yes | intra |   4096 |   2048 | 0.50 ||  2.50 |   489617 ||  74571.33 |   26.89 |   13.45 |   152.31 | 00h01'14 ||   450.00 |  0.0168 |    1.25 |   450.00 |  0.0726 |    5.41 |  0.0000 |    0.00
    A53 |  char | yes | intra |   8192 |   4096 | 0.50 ||  2.50 |   275797 ||  88844.03 |   25.43 |   12.72 |   322.14 | 00h01'28 ||   450.00 |  0.0169 |    1.50 |   450.00 |  0.0757 |    6.72 |  0.0000 |    0.00
    A53 |  char | yes | intra |  16384 |   8192 | 0.50 ||  2.50 |   142854 ||  97533.23 |   24.00 |   12.00 |   682.75 | 00h01'37 ||   450.00 |  0.0168 |    1.64 |   450.00 |  0.0789 |    7.69 |  0.0000 |    0.00
    A53 |  char | yes | intra |  32768 |  16384 | 0.50 ||  2.50 |    68860 ||  98875.84 |   22.82 |   11.41 |  1435.90 | 00h01'38 ||   450.00 |  0.0168 |    1.66 |   450.00 |  0.0817 |    8.08 |  0.0000 |    0.00
    A53 |  char | yes | intra |  65536 |  32768 | 0.50 ||  2.50 |    34752 || 102826.45 |   22.15 |   11.07 |  2958.86 | 00h01'42 ||   450.00 |  0.0168 |    1.73 |   450.00 |  0.0839 |    8.62 |  0.0000 |    0.00
    A53 |  char | yes | intra |   131072 |   65536 | 0.50 ||  2.50 |    15000 ||  96384.04 |   20.40 |   10.20 |  6425.60 | 00h01'36 ||   450.00 |  0.0168 |    1.62 |   450.00 |  0.0861 |    8.29 |  0.0000 |    0.00
    A53 |  char | yes | intra |   262144 |  131072 | 0.50 ||  2.50 |     7000 || 102386.48 |   17.92 |    8.96 | 14626.64 | 00h01'42 ||   450.00 |  0.0168 |    1.72 |   450.00 |  0.0867 |    8.88 |  0.0000 |    0.00
    A53 |  char | yes | intra |   524288 |  262144 | 0.50 ||  2.50 |     3500 || 106868.19 |   17.17 |    8.59 | 30533.77 | 00h01'47 ||   450.00 |  0.0168 |    1.80 |   450.00 |  0.0870 |    9.30 |  0.0000 |    0.00
    A53 |  char | yes | intra |  1048576 |  524288 | 0.50 ||  2.50 |     1750 || 115450.18 |   15.89 |    7.95 | 65971.53 | 00h01'56 ||   450.00 |  0.0169 |    1.95 |   450.00 |  0.0875 |   10.10 |  0.0000 |    0.00
#---------
#---------
# -> Intra-SIMD 8-bit, rate 5/6, gen:
# ------|-------|-----|-------|--------|--------|------||-------|----------||-----------|---------|---------|----------|----------||----------|---------|---------|----------|---------|---------|---------|---------|
#  PROC |  TYPE | GEN |   VEC |      N |      K |    R ||   SNR |      FRA || LD+ST+DEC |    CTHR |    ITHR |  LATENCY | RUNTIME  || BIG FREQ | BIG POW | BIG ENE | LIT FREQ | LIT POW | LIT ENE | RAM POW | RAM ENE |
#       |       |     |       |        |        |      ||  (dB) |          ||      (ms) |  (Mb/s) |  (Mb/s) |     (us) | (hhmmss) ||    (Mhz) |     (W) |     (J) |    (Mhz) |     (W) |     (J) |     (W) |     (J) |
# ------|-------|-----|-------|--------|--------|------||-------|----------||-----------|---------|---------|----------|----------||----------|---------|---------|----------|---------|---------|---------|---------|
    A53 |  char | yes | intra |    128 |    107 | 0.83 ||  4.00 |  1765946 ||   5739.36 |   39.38 |   32.92 |     3.25 | 00h00'05 ||   450.00 |  0.0175 |    0.10 |   450.00 |  0.0705 |    0.40 |  0.0000 |    0.00
    A53 |  char | yes | intra |    256 |    213 | 0.83 ||  4.00 |  1622879 ||  12159.25 |   34.17 |   28.43 |     7.49 | 00h00'12 ||   450.00 |  0.0168 |    0.20 |   450.00 |  0.0698 |    0.85 |  0.0000 |    0.00
    A53 |  char | yes | intra |    512 |    427 | 0.83 ||  4.00 |  1446105 ||  19615.21 |   37.75 |   31.48 |    13.56 | 00h00'19 ||   450.00 |  0.0168 |    0.33 |   450.00 |  0.0711 |    1.39 |  0.0000 |    0.00
    A53 |  char | yes | intra |   1024 |    853 | 0.83 ||  4.00 |  1198370 ||  32527.45 |   37.73 |   31.43 |    27.14 | 00h00'32 ||   450.00 |  0.0168 |    0.55 |   450.00 |  0.0724 |    2.36 |  0.0000 |    0.00
    A53 |  char | yes | intra |   2048 |   1707 | 0.83 ||  4.00 |   890666 ||  51460.29 |   35.45 |   29.54 |    57.78 | 00h00'51 ||   450.00 |  0.0168 |    0.86 |   450.00 |  0.0733 |    3.77 |  0.0000 |    0.00
    A53 |  char | yes | intra |   4096 |   3413 | 0.83 ||  4.00 |   561429 ||  71531.24 |   32.15 |   26.79 |   127.41 | 00h01'11 ||   450.00 |  0.0168 |    1.20 |   450.00 |  0.0727 |    5.20 |  0.0000 |    0.00
    A53 |  char | yes | intra |   8192 |   6827 | 0.83 ||  4.00 |   321341 ||  85201.55 |   30.90 |   25.75 |   265.14 | 00h01'25 ||   450.00 |  0.0168 |    1.43 |   450.00 |  0.0757 |    6.45 |  0.0000 |    0.00
    A53 |  char | yes | intra |  16384 |  13653 | 0.83 ||  4.00 |   170937 ||  96928.41 |   28.89 |   24.08 |   567.04 | 00h01'36 ||   450.00 |  0.0168 |    1.63 |   450.00 |  0.0805 |    7.80 |  0.0000 |    0.00
    A53 |  char | yes | intra |  32768 |  27307 | 0.83 ||  4.00 |    79535 ||  97473.12 |   26.74 |   22.28 |  1225.54 | 00h01'37 ||   450.00 |  0.0168 |    1.64 |   450.00 |  0.0835 |    8.14 |  0.0000 |    0.00
    A53 |  char | yes | intra |  65536 |  54613 | 0.83 ||  4.00 |    39967 || 106480.44 |   24.60 |   20.50 |  2664.21 | 00h01'46 ||   450.00 |  0.0168 |    1.79 |   450.00 |  0.0857 |    9.12 |  0.0000 |    0.00
    A53 |  char | yes | intra |   131072 |  109227 | 0.83 ||  4.00 |    15000 ||  84308.16 |   23.32 |   19.43 |  5620.54 | 00h01'24 ||   450.00 |  0.0168 |    1.42 |   450.00 |  0.0886 |    7.47 |  0.0000 |    0.00
    A53 |  char | yes | intra |   262144 |  218453 | 0.83 ||  4.00 |     7500 ||  98715.95 |   19.92 |   16.60 | 13162.13 | 00h01'39 ||   450.00 |  0.0169 |    1.67 |   450.00 |  0.0890 |    8.79 |  0.0000 |    0.00
    A53 |  char | yes | intra |   524288 |  436907 | 0.83 ||  4.00 |     3500 || 103134.75 |   17.79 |   14.83 | 29467.07 | 00h01'43 ||   450.00 |  0.0168 |    1.74 |   450.00 |  0.0891 |    9.19 |  0.0000 |    0.00
    A53 |  char | yes | intra |  1048576 |  873813 | 0.83 ||  4.00 |     1750 || 103895.82 |   17.66 |   14.72 | 59369.04 | 00h01'45 ||   450.00 |  0.0169 |    1.75 |   450.00 |  0.0897 |    9.32 |  0.0000 |    0.00
#---------
#---------
# -> Inter-SIMD 8-bit, rate 1/2, no gen:
# ------|-------|-----|-------|--------|--------|------||-------|----------||-----------|---------|---------|----------|----------||----------|---------|---------|----------|---------|---------|---------|---------|
#  PROC |  TYPE | GEN |   VEC |      N |      K |    R ||   SNR |      FRA || LD+ST+DEC |    CTHR |    ITHR |  LATENCY | RUNTIME  || BIG FREQ | BIG POW | BIG ENE | LIT FREQ | LIT POW | LIT ENE | RAM POW | RAM ENE |
#       |       |     |       |        |        |      ||  (dB) |          ||      (ms) |  (Mb/s) |  (Mb/s) |     (us) | (hhmmss) ||    (Mhz) |     (W) |     (J) |    (Mhz) |     (W) |     (J) |     (W) |     (J) |
# ------|-------|-----|-------|--------|--------|------||-------|----------||-----------|---------|---------|----------|----------||----------|---------|---------|----------|---------|---------|---------|---------|
    A53 |  char |  no | inter |    128 |     64 | 0.50 ||  2.50 | 18706160 ||  42624.92 |   56.17 |   28.09 |    36.46 | 00h00'42 ||   450.00 |  0.0168 |    0.71 |   450.00 |  0.0776 |    3.31 |  0.0000 |    0.00
    A53 |  char |  no | inter |    256 |    128 | 0.50 ||  2.50 | 13180784 ||  60126.08 |   56.12 |   28.06 |    72.99 | 00h01'00 ||   450.00 |  0.0168 |    1.01 |   450.00 |  0.0777 |    4.67 |  0.0000 |    0.00
    A53 |  char |  no | inter |    512 |    256 | 0.50 ||  2.50 |  8149008 ||  80409.71 |   51.89 |   25.94 |   157.88 | 00h01'20 ||   450.00 |  0.0168 |    1.35 |   450.00 |  0.0786 |    6.32 |  0.0000 |    0.00
    A53 |  char |  no | inter |   1024 |    512 | 0.50 ||  2.50 |  3781824 ||  86542.41 |   44.75 |   22.37 |   366.14 | 00h01'26 ||   450.00 |  0.0168 |    1.45 |   450.00 |  0.0831 |    7.19 |  0.0000 |    0.00
    A53 |  char |  no | inter |   2048 |   1024 | 0.50 ||  2.50 |  1895728 ||  97211.20 |   39.94 |   19.97 |   820.47 | 00h01'37 ||   450.00 |  0.0168 |    1.63 |   450.00 |  0.0864 |    8.39 |  0.0000 |    0.00
    A53 |  char |  no | inter |   4096 |   2048 | 0.50 ||  2.50 |   885920 || 105318.62 |   34.45 |   17.23 |  1902.09 | 00h01'45 ||   450.00 |  0.0168 |    1.77 |   450.00 |  0.0878 |    9.25 |  0.0000 |    0.00
    A53 |  char |  no | inter |   8192 |   4096 | 0.50 ||  2.50 |   421488 || 108377.48 |   31.86 |   15.93 |  4114.09 | 00h01'48 ||   450.00 |  0.0169 |    1.83 |   450.00 |  0.0906 |    9.82 |  0.0000 |    0.00
    A53 |  char |  no | inter |  16384 |   8192 | 0.50 ||  2.50 |   188736 || 108245.87 |   28.57 |   14.28 |  9176.49 | 00h01'49 ||   450.00 |  0.0168 |    1.82 |   450.00 |  0.0912 |    9.88 |  0.0000 |    0.00
    A53 |  char |  no | inter |  32768 |  16384 | 0.50 ||  2.50 |    82496 || 109174.93 |   24.76 |   12.38 | 21174.35 | 00h01'50 ||   450.00 |  0.0168 |    1.84 |   450.00 |  0.0889 |    9.71 |  0.0000 |    0.00
    A53 |  char |  no | inter |  65536 |  32768 | 0.50 ||  2.50 |    30624 ||  88588.31 |   22.66 |   11.33 | 46284.38 | 00h01'31 ||   450.00 |  0.0169 |    1.50 |   450.00 |  0.0889 |    7.87 |  0.0000 |    0.00
    A53 |  char |  no | inter |   131072 |   65536 | 0.50 ||  2.50 |    15000 ||  92108.94 |   21.35 |   10.67 | 98249.53 | 00h01'38 ||   450.00 |  0.0169 |    1.55 |   450.00 |  0.0907 |    8.35 |  0.0000 |    0.00
    A53 |  char |  no | inter |   262144 |  131072 | 0.50 ||  2.50 |     7000 ||  93602.86 |   19.60 |    9.80 | 213949.39 | 00h01'45 ||   450.00 |  0.0169 |    1.59 |   450.00 |  0.0909 |    8.51 |  0.0000 |    0.00
    A53 |  char |  no | inter |   524288 |  262144 | 0.50 ||  2.50 |     3500 || 100665.98 |   18.23 |    9.11 | 460187.34 | 00h02'04 ||   450.00 |  0.0170 |    1.71 |   450.00 |  0.0908 |    9.14 |  0.0000 |    0.00
    A53 |  char |  no | inter |  1048576 |  524288 | 0.50 ||  2.50 |     1750 || 106299.77 |   17.26 |    8.63 | 971883.69 | 00h02'32 ||   450.00 |  0.0171 |    1.82 |   450.00 |  0.0912 |    9.69 |  0.0000 |    0.00
#---------
#---------
# -> Inter-SIMD 8-bit, rate 5/6, no gen:
# ------|-------|-----|-------|--------|--------|------||-------|----------||-----------|---------|---------|----------|----------||----------|---------|---------|----------|---------|---------|---------|---------|
#  PROC |  TYPE | GEN |   VEC |      N |      K |    R ||   SNR |      FRA || LD+ST+DEC |    CTHR |    ITHR |  LATENCY | RUNTIME  || BIG FREQ | BIG POW | BIG ENE | LIT FREQ | LIT POW | LIT ENE | RAM POW | RAM ENE |
#       |       |     |       |        |        |      ||  (dB) |          ||      (ms) |  (Mb/s) |  (Mb/s) |     (us) | (hhmmss) ||    (Mhz) |     (W) |     (J) |    (Mhz) |     (W) |     (J) |     (W) |     (J) |
# ------|-------|-----|-------|--------|--------|------||-------|----------||-----------|---------|---------|----------|----------||----------|---------|---------|----------|---------|---------|---------|---------|
    A53 |  char |  no | inter |    128 |    107 | 0.83 ||  4.00 | 20592832 ||  33522.41 |   78.63 |   65.73 |    26.05 | 00h00'33 ||   450.00 |  0.0169 |    0.57 |   450.00 |  0.0787 |    2.64 |  0.0000 |    0.00
    A53 |  char |  no | inter |    256 |    213 | 0.83 ||  4.00 | 14286336 ||  58653.23 |   62.35 |   51.88 |    65.69 | 00h00'58 ||   450.00 |  0.0168 |    0.99 |   450.00 |  0.0786 |    4.61 |  0.0000 |    0.00
    A53 |  char |  no | inter |    512 |    427 | 0.83 ||  4.00 |  7631728 ||  69124.75 |   56.53 |   47.14 |   144.92 | 00h01'09 ||   450.00 |  0.0168 |    1.16 |   450.00 |  0.0813 |    5.62 |  0.0000 |    0.00
    A53 |  char |  no | inter |   1024 |    853 | 0.83 ||  4.00 |  4583760 ||  88351.62 |   53.13 |   44.25 |   308.40 | 00h01'28 ||   450.00 |  0.0168 |    1.48 |   450.00 |  0.0848 |    7.49 |  0.0000 |    0.00
    A53 |  char |  no | inter |   2048 |   1707 | 0.83 ||  4.00 |  2104272 ||  94625.17 |   45.54 |   37.96 |   719.49 | 00h01'34 ||   450.00 |  0.0168 |    1.59 |   450.00 |  0.0883 |    8.35 |  0.0000 |    0.00
    A53 |  char |  no | inter |   4096 |   3413 | 0.83 ||  4.00 |   961296 || 105277.26 |   37.40 |   31.16 |  1752.26 | 00h01'45 ||   450.00 |  0.0168 |    1.77 |   450.00 |  0.0892 |    9.39 |  0.0000 |    0.00
    A53 |  char |  no | inter |   8192 |   6827 | 0.83 ||  4.00 |   455600 || 105460.26 |   35.39 |   29.49 |  3703.61 | 00h01'45 ||   450.00 |  0.0168 |    1.77 |   450.00 |  0.0918 |    9.69 |  0.0000 |    0.00
    A53 |  char |  no | inter |  16384 |  13653 | 0.83 ||  4.00 |   207968 || 111673.01 |   30.51 |   25.43 |  8591.55 | 00h01'52 ||   450.00 |  0.0168 |    1.88 |   450.00 |  0.0916 |   10.23 |  0.0000 |    0.00
    A53 |  char |  no | inter |  32768 |  27307 | 0.83 ||  4.00 |    86624 || 104165.63 |   27.25 |   22.71 | 19240.05 | 00h01'45 ||   450.00 |  0.0168 |    1.76 |   450.00 |  0.0914 |    9.52 |  0.0000 |    0.00
    A53 |  char |  no | inter |  65536 |  54613 | 0.83 ||  4.00 |    31392 ||  85555.45 |   24.05 |   20.04 | 43606.25 | 00h01'28 ||   450.00 |  0.0169 |    1.45 |   450.00 |  0.0907 |    7.76 |  0.0000 |    0.00
    A53 |  char |  no | inter |   131072 |  109227 | 0.83 ||  4.00 |    15000 ||  86649.64 |   22.69 |   18.91 | 92426.28 | 00h01'32 ||   450.00 |  0.0169 |    1.46 |   450.00 |  0.0915 |    7.93 |  0.0000 |    0.00
    A53 |  char |  no | inter |   262144 |  218453 | 0.83 ||  4.00 |     7500 ||  93400.94 |   21.05 |   17.54 | 199255.33 | 00h01'44 ||   450.00 |  0.0170 |    1.59 |   450.00 |  0.0916 |    8.55 |  0.0000 |    0.00
    A53 |  char |  no | inter |   524288 |  436907 | 0.83 ||  4.00 |     3500 ||  96735.38 |   18.97 |   15.81 | 442218.91 | 00h01'58 ||   450.00 |  0.0171 |    1.65 |   450.00 |  0.0919 |    8.89 |  0.0000 |    0.00
    A53 |  char |  no | inter |  1048576 |  873813 | 0.83 ||  4.00 |     1750 || 101966.98 |   18.00 |   15.00 | 932269.50 | 00h02'24 ||   450.00 |  0.0172 |    1.75 |   450.00 |  0.0916 |    9.34 |  0.0000 |    0.00
#---------
#---------
# -> inter-SIMD 8-bit, rate 1/2, gen:
# ------|-------|-----|-------|--------|--------|------||-------|----------||-----------|---------|---------|----------|----------||----------|---------|---------|----------|---------|---------|---------|---------|
#  PROC |  TYPE | GEN |   VEC |      N |      K |    R ||   SNR |      FRA || LD+ST+DEC |    CTHR |    ITHR |  LATENCY | RUNTIME  || BIG FREQ | BIG POW | BIG ENE | LIT FREQ | LIT POW | LIT ENE | RAM POW | RAM ENE |
#       |       |     |       |        |        |      ||  (dB) |          ||      (ms) |  (Mb/s) |  (Mb/s) |     (us) | (hhmmss) ||    (Mhz) |     (W) |     (J) |    (Mhz) |     (W) |     (J) |     (W) |     (J) |
# ------|-------|-----|-------|--------|--------|------||-------|----------||-----------|---------|---------|----------|----------||----------|---------|---------|----------|---------|---------|---------|---------|
    A53 |  char | yes | inter |    128 |     64 | 0.50 ||  2.50 | 19644080 ||  38772.23 |   64.85 |   32.43 |    31.58 | 00h00'38 ||   450.00 |  0.0172 |    0.67 |   450.00 |  0.0787 |    3.05 |  0.0000 |    0.00
    A53 |  char | yes | inter |    256 |    128 | 0.50 ||  2.50 | 14383232 ||  59797.74 |   61.58 |   30.79 |    66.52 | 00h00'59 ||   450.00 |  0.0168 |    1.00 |   450.00 |  0.0797 |    4.77 |  0.0000 |    0.00
    A53 |  char | yes | inter |    512 |    256 | 0.50 ||  2.50 |  9026992 ||  81233.63 |   56.90 |   28.45 |   143.98 | 00h01'21 ||   450.00 |  0.0168 |    1.37 |   450.00 |  0.0799 |    6.49 |  0.0000 |    0.00
    A53 |  char | yes | inter |   1024 |    512 | 0.50 ||  2.50 |  4512336 ||  96298.22 |   47.98 |   23.99 |   341.46 | 00h01'36 ||   450.00 |  0.0168 |    1.62 |   450.00 |  0.0851 |    8.20 |  0.0000 |    0.00
    A53 |  char | yes | inter |   2048 |   1024 | 0.50 ||  2.50 |  2072400 ||  99447.26 |   42.68 |   21.34 |   767.78 | 00h01'39 ||   450.00 |  0.0168 |    1.67 |   450.00 |  0.0894 |    8.89 |  0.0000 |    0.00
    A53 |  char | yes | inter |   4096 |   2048 | 0.50 ||  2.50 |   963264 || 107774.59 |   36.61 |   18.30 |  1790.16 | 00h01'47 ||   450.00 |  0.0168 |    1.81 |   450.00 |  0.0905 |    9.76 |  0.0000 |    0.00
    A53 |  char | yes | inter |   8192 |   4096 | 0.50 ||  2.50 |   451024 || 116154.69 |   31.81 |   15.90 |  4120.57 | 00h01'56 ||   450.00 |  0.0168 |    1.95 |   450.00 |  0.0912 |   10.59 |  0.0000 |    0.00
    A53 |  char | yes | inter |  16384 |   8192 | 0.50 ||  2.50 |   198944 || 114876.84 |   28.37 |   14.19 |  9238.93 | 00h01'55 ||   450.00 |  0.0168 |    1.93 |   450.00 |  0.0914 |   10.50 |  0.0000 |    0.00
    A53 |  char | yes | inter |  32768 |  16384 | 0.50 ||  2.50 |    87088 || 114430.48 |   24.94 |   12.47 | 21023.42 | 00h01'55 ||   450.00 |  0.0169 |    1.93 |   450.00 |  0.0900 |   10.30 |  0.0000 |    0.00
    A53 |  char | yes | inter |  65536 |  32768 | 0.50 ||  2.50 |    32208 ||  90751.94 |   23.26 |   11.63 | 45082.93 | 00h01'31 ||   450.00 |  0.0169 |    1.54 |   450.00 |  0.0907 |    8.23 |  0.0000 |    0.00
    A53 |  char | yes | inter |   131072 |   65536 | 0.50 ||  2.50 |    15000 ||  91752.18 |   21.43 |   10.71 | 97868.98 | 00h01'34 ||   450.00 |  0.0169 |    1.55 |   450.00 |  0.0909 |    8.34 |  0.0000 |    0.00
    A53 |  char | yes | inter |   262144 |  131072 | 0.50 ||  2.50 |     7000 ||  90840.21 |   20.20 |   10.10 | 207634.77 | 00h01'35 ||   450.00 |  0.0169 |    1.54 |   450.00 |  0.0917 |    8.33 |  0.0000 |    0.00
    A53 |  char | yes | inter |   524288 |  262144 | 0.50 ||  2.50 |     3500 ||  97814.89 |   18.76 |    9.38 | 447153.78 | 00h01'46 ||   450.00 |  0.0169 |    1.65 |   450.00 |  0.0917 |    8.97 |  0.0000 |    0.00
    A53 |  char | yes | inter |  1048576 |  524288 | 0.50 ||  2.50 |     1750 || 105600.72 |   17.38 |    8.69 | 965492.31 | 00h02'03 ||   450.00 |  0.0169 |    1.78 |   450.00 |  0.0913 |    9.64 |  0.0000 |    0.00
#---------
#---------
# -> inter-SIMD 8-bit, rate 5/6, gen:
# ------|-------|-----|-------|--------|--------|------||-------|----------||-----------|---------|---------|----------|----------||----------|---------|---------|----------|---------|---------|---------|---------|
#  PROC |  TYPE | GEN |   VEC |      N |      K |    R ||   SNR |      FRA || LD+ST+DEC |    CTHR |    ITHR |  LATENCY | RUNTIME  || BIG FREQ | BIG POW | BIG ENE | LIT FREQ | LIT POW | LIT ENE | RAM POW | RAM ENE |
#       |       |     |       |        |        |      ||  (dB) |          ||      (ms) |  (Mb/s) |  (Mb/s) |     (us) | (hhmmss) ||    (Mhz) |     (W) |     (J) |    (Mhz) |     (W) |     (J) |     (W) |     (J) |
# ------|-------|-----|-------|--------|--------|------||-------|----------||-----------|---------|---------|----------|----------||----------|---------|---------|----------|---------|---------|---------|---------|
    A53 |  char | yes | inter |    128 |    107 | 0.83 ||  4.00 | 21203296 ||  31284.74 |   86.75 |   72.52 |    23.61 | 00h00'31 ||   450.00 |  0.0170 |    0.53 |   450.00 |  0.0798 |    2.50 |  0.0000 |    0.00
    A53 |  char | yes | inter |    256 |    213 | 0.83 ||  4.00 | 14939920 ||  56555.84 |   67.63 |   56.27 |    60.57 | 00h00'56 ||   450.00 |  0.0168 |    0.95 |   450.00 |  0.0800 |    4.53 |  0.0000 |    0.00
    A53 |  char | yes | inter |    512 |    427 | 0.83 ||  4.00 |  9001600 ||  75422.38 |   61.11 |   50.96 |   134.06 | 00h01'15 ||   450.00 |  0.0168 |    1.27 |   450.00 |  0.0820 |    6.18 |  0.0000 |    0.00
    A53 |  char | yes | inter |   1024 |    853 | 0.83 ||  4.00 |  4298672 ||  78050.88 |   56.40 |   46.98 |   290.51 | 00h01'18 ||   450.00 |  0.0168 |    1.31 |   450.00 |  0.0861 |    6.72 |  0.0000 |    0.00
    A53 |  char | yes | inter |   2048 |   1707 | 0.83 ||  4.00 |  2383328 || 104707.24 |   46.62 |   38.85 |   702.93 | 00h01'44 ||   450.00 |  0.0168 |    1.76 |   450.00 |  0.0900 |    9.42 |  0.0000 |    0.00
    A53 |  char | yes | inter |   4096 |   3413 | 0.83 ||  4.00 |  1038848 || 107116.65 |   39.72 |   33.10 |  1649.78 | 00h01'47 ||   450.00 |  0.0168 |    1.80 |   450.00 |  0.0909 |    9.74 |  0.0000 |    0.00
    A53 |  char | yes | inter |   8192 |   6827 | 0.83 ||  4.00 |   480272 || 115048.45 |   34.20 |   28.50 |  3832.78 | 00h01'55 ||   450.00 |  0.0168 |    1.93 |   450.00 |  0.0921 |   10.60 |  0.0000 |    0.00
    A53 |  char | yes | inter |  16384 |  13653 | 0.83 ||  4.00 |   214064 || 112010.01 |   31.31 |   26.09 |  8372.08 | 00h01'52 ||   450.00 |  0.0168 |    1.88 |   450.00 |  0.0921 |   10.32 |  0.0000 |    0.00
    A53 |  char | yes | inter |  32768 |  27307 | 0.83 ||  4.00 |    92992 || 111606.59 |   27.30 |   22.75 | 19202.79 | 00h01'52 ||   450.00 |  0.0169 |    1.88 |   450.00 |  0.0913 |   10.19 |  0.0000 |    0.00
    A53 |  char | yes | inter |  65536 |  54613 | 0.83 ||  4.00 |    32256 ||  86234.83 |   24.51 |   20.43 | 42775.21 | 00h01'27 ||   450.00 |  0.0169 |    1.45 |   450.00 |  0.0917 |    7.90 |  0.0000 |    0.00
    A53 |  char | yes | inter |   262144 |  218453 | 0.83 ||  4.00 |     7500 ||  92187.40 |   21.33 |   17.77 | 196666.45 | 00h01'37 ||   450.00 |  0.0168 |    1.55 |   450.00 |  0.0921 |    8.49 |  0.0000 |    0.00
    A53 |  char | yes | inter |   524288 |  436907 | 0.83 ||  4.00 |     3500 ||  96952.77 |   18.93 |   15.77 | 443212.69 | 00h01'46 ||   450.00 |  0.0170 |    1.65 |   450.00 |  0.0918 |    8.90 |  0.0000 |    0.00
    A53 |  char | yes | inter |  1048576 |  873813 | 0.83 ||  4.00 |     1750 || 101417.53 |   18.09 |   15.08 | 927246.00 | 00h02'00 ||   450.00 |  0.0168 |    1.71 |   450.00 |  0.0922 |    9.35 |  0.0000 |    0.00
#---------
#---------
