# -> Seq 8-bit, rate 1/2, no gen:
# ------|-------|-----|-------|--------|--------|------||-------|----------||-----------|---------|---------|----------|----------||----------|---------|---------|----------|---------|---------|---------|---------|
#  PROC |  TYPE | GEN |   VEC |      N |      K |    R ||   SNR |      FRA || LD+ST+DEC |    CTHR |    ITHR |  LATENCY | RUNTIME  || BIG FREQ | BIG POW | BIG ENE | LIT FREQ | LIT POW | LIT ENE | RAM POW | RAM ENE |
#       |       |     |       |        |        |      ||  (dB) |          ||      (ms) |  (Mb/s) |  (Mb/s) |     (us) | (hhmmss) ||    (Mhz) |     (W) |     (J) |    (Mhz) |     (W) |     (J) |     (W) |     (J) |
# ------|-------|-----|-------|--------|--------|------||-------|----------||-----------|---------|---------|----------|----------||----------|---------|---------|----------|---------|---------|---------|---------|
    A15 |  char |  no |   seq |    128 |     64 | 0.50 ||  2.50 |  1332899 ||  15394.15 |   11.08 |    5.54 |    11.55 | 00h00'15 ||   800.00 |  0.5289 |    8.14 |     0.00 |  0.0192 |    0.30 |  0.0504 |    0.78
    A15 |  char |  no |   seq |    256 |    128 | 0.50 ||  2.50 |  1048729 ||  21566.42 |   12.45 |    6.22 |    20.56 | 00h00'21 ||   800.00 |  0.5205 |   11.23 |     0.00 |  0.0194 |    0.42 |  0.0504 |    1.09
    A15 |  char |  no |   seq |    512 |    256 | 0.50 ||  2.50 |   699036 ||  28966.37 |   12.36 |    6.18 |    41.44 | 00h00'28 ||   800.00 |  0.5377 |   15.57 |     0.00 |  0.0194 |    0.56 |  0.0504 |    1.46
    A15 |  char |  no |   seq |   1024 |    512 | 0.50 ||  2.50 |   399077 ||  34709.14 |   11.77 |    5.89 |    86.97 | 00h00'34 ||   800.00 |  0.5318 |   18.46 |     0.00 |  0.0195 |    0.68 |  0.0505 |    1.75
    A15 |  char |  no |   seq |   2048 |   1024 | 0.50 ||  2.50 |   213346 ||  38752.48 |   11.27 |    5.64 |   181.64 | 00h00'38 ||   800.00 |  0.5394 |   20.90 |     0.00 |  0.0194 |    0.75 |  0.0525 |    2.03
    A15 |  char |  no |   seq |   4096 |   2048 | 0.50 ||  2.50 |   106522 ||  40248.91 |   10.84 |    5.42 |   377.85 | 00h00'40 ||   800.00 |  0.5455 |   21.96 |     0.00 |  0.0195 |    0.78 |  0.0530 |    2.13
    A15 |  char |  no |   seq |   8192 |   4096 | 0.50 ||  2.50 |    52362 ||  42807.93 |   10.02 |    5.01 |   817.54 | 00h00'42 ||   800.00 |  0.5432 |   23.26 |     0.00 |  0.0194 |    0.83 |  0.0521 |    2.23
    A15 |  char |  no |   seq |  16384 |   8192 | 0.50 ||  2.50 |    24703 ||  41573.39 |    9.74 |    4.87 |  1682.93 | 00h00'41 ||   800.00 |  0.5576 |   23.18 |     0.00 |  0.0195 |    0.81 |  0.0515 |    2.14
    A15 |  char |  no |   seq |  32768 |  16384 | 0.50 ||  2.50 |    11635 ||  41814.26 |    9.12 |    4.56 |  3593.83 | 00h00'42 ||   800.00 |  0.5702 |   23.84 |     0.00 |  0.0195 |    0.82 |  0.0511 |    2.14
    A15 |  char |  no |   seq |  65536 |  32768 | 0.50 ||  2.50 |     5560 ||  41765.52 |    8.72 |    4.36 |  7511.78 | 00h00'42 ||   800.00 |  0.5778 |   24.13 |     0.00 |  0.0197 |    0.82 |  0.0511 |    2.13
    A15 |  char |  no |   seq |   131072 |   65536 | 0.50 ||  2.50 |     2500 ||  39983.30 |    8.20 |    4.10 | 15993.32 | 00h00'42 ||   800.00 |  0.5792 |   23.16 |     0.00 |  0.0194 |    0.78 |  0.0511 |    2.04
    A15 |  char |  no |   seq |   262144 |  131072 | 0.50 ||  2.50 |     1250 ||  49746.53 |    6.59 |    3.29 | 39797.22 | 00h00'53 ||   800.00 |  0.5580 |   27.76 |     0.00 |  0.0195 |    0.97 |  0.0513 |    2.55
    A15 |  char |  no |   seq |   524288 |  262144 | 0.50 ||  2.50 |      625 ||  50697.52 |    6.46 |    3.23 | 81116.03 | 00h00'58 ||   800.00 |  0.5676 |   28.78 |     0.00 |  0.0197 |    1.00 |  0.0619 |    3.14
    A15 |  char |  no |   seq |  1048576 |  524288 | 0.50 ||  2.50 |      300 ||  55050.20 |    5.71 |    2.86 | 183500.67 | 00h01'11 ||   800.00 |  0.5592 |   30.79 |     0.00 |  0.0197 |    1.08 |  0.0657 |    3.62
#---------
#---------
# -> Seq 8-bit, rate 5/6, no gen:
# ------|-------|-----|-------|--------|--------|------||-------|----------||-----------|---------|---------|----------|----------||----------|---------|---------|----------|---------|---------|---------|---------|
#  PROC |  TYPE | GEN |   VEC |      N |      K |    R ||   SNR |      FRA || LD+ST+DEC |    CTHR |    ITHR |  LATENCY | RUNTIME  || BIG FREQ | BIG POW | BIG ENE | LIT FREQ | LIT POW | LIT ENE | RAM POW | RAM ENE |
#       |       |     |       |        |        |      ||  (dB) |          ||      (ms) |  (Mb/s) |  (Mb/s) |     (us) | (hhmmss) ||    (Mhz) |     (W) |     (J) |    (Mhz) |     (W) |     (J) |     (W) |     (J) |
# ------|-------|-----|-------|--------|--------|------||-------|----------||-----------|---------|---------|----------|----------||----------|---------|---------|----------|---------|---------|---------|---------|
    A15 |  char |  no |   seq |    128 |    107 | 0.83 ||  4.00 |  1453651 ||  13369.19 |   13.92 |   11.63 |     9.20 | 00h00'13 ||   800.00 |  0.5071 |    6.78 |     0.00 |  0.0196 |    0.26 |  0.0506 |    0.68
    A15 |  char |  no |   seq |    256 |    213 | 0.83 ||  4.00 |  1102321 ||  20971.00 |   13.46 |   11.20 |    19.02 | 00h00'20 ||   800.00 |  0.5256 |   11.02 |     0.00 |  0.0195 |    0.41 |  0.0507 |    1.06
    A15 |  char |  no |   seq |    512 |    427 | 0.83 ||  4.00 |   752754 ||  27670.36 |   13.93 |   11.62 |    36.76 | 00h00'27 ||   800.00 |  0.5371 |   14.86 |     0.00 |  0.0194 |    0.54 |  0.0507 |    1.40
    A15 |  char |  no |   seq |   1024 |    853 | 0.83 ||  4.00 |   457183 ||  33428.57 |   14.00 |   11.67 |    73.12 | 00h00'33 ||   800.00 |  0.5292 |   17.69 |     0.00 |  0.0195 |    0.65 |  0.0508 |    1.70
    A15 |  char |  no |   seq |   2048 |   1707 | 0.83 ||  4.00 |   238931 ||  38152.36 |   12.83 |   10.69 |   159.68 | 00h00'38 ||   800.00 |  0.5339 |   20.37 |     0.00 |  0.0196 |    0.75 |  0.0510 |    1.95
    A15 |  char |  no |   seq |   4096 |   3413 | 0.83 ||  4.00 |   118322 ||  40096.02 |   12.09 |   10.07 |   338.87 | 00h00'40 ||   800.00 |  0.5593 |   22.43 |     0.00 |  0.0197 |    0.79 |  0.0543 |    2.18
    A15 |  char |  no |   seq |   8192 |   6827 | 0.83 ||  4.00 |    57604 ||  40895.35 |   11.54 |    9.62 |   709.94 | 00h00'41 ||   800.00 |  0.5588 |   22.85 |     0.00 |  0.0197 |    0.81 |  0.0527 |    2.15
    A15 |  char |  no |   seq |  16384 |  13653 | 0.83 ||  4.00 |    27305 ||  41682.65 |   10.73 |    8.94 |  1526.56 | 00h00'41 ||   800.00 |  0.5660 |   23.59 |     0.00 |  0.0196 |    0.82 |  0.0518 |    2.16
    A15 |  char |  no |   seq |  32768 |  27307 | 0.83 ||  4.00 |    12609 ||  43385.30 |    9.52 |    7.94 |  3440.82 | 00h00'43 ||   800.00 |  0.5732 |   24.87 |     0.00 |  0.0197 |    0.85 |  0.0513 |    2.23
    A15 |  char |  no |   seq |  65536 |  54613 | 0.83 ||  4.00 |     5896 ||  41774.54 |    9.25 |    7.71 |  7085.23 | 00h00'42 ||   800.00 |  0.5855 |   24.46 |     0.00 |  0.0197 |    0.82 |  0.0513 |    2.14
    A15 |  char |  no |   seq |   131072 |  109227 | 0.83 ||  4.00 |     2500 ||  37270.49 |    8.79 |    7.33 | 14908.20 | 00h00'39 ||   800.00 |  0.5886 |   21.94 |     0.00 |  0.0196 |    0.73 |  0.0514 |    1.92
    A15 |  char |  no |   seq |   262144 |  218453 | 0.83 ||  4.00 |     1250 ||  46116.29 |    7.11 |    5.92 | 36893.04 | 00h00'49 ||   800.00 |  0.5630 |   25.96 |     0.00 |  0.0196 |    0.90 |  0.0522 |    2.41
    A15 |  char |  no |   seq |   524288 |  436907 | 0.83 ||  4.00 |      625 ||  49991.92 |    6.55 |    5.46 | 79987.07 | 00h00'56 ||   800.00 |  0.5670 |   28.35 |     0.00 |  0.0197 |    0.99 |  0.0601 |    3.00
    A15 |  char |  no |   seq |  1048576 |  873813 | 0.83 ||  4.00 |      300 ||  54470.70 |    5.78 |    4.81 | 181568.98 | 00h01'07 ||   800.00 |  0.5575 |   30.37 |     0.00 |  0.0197 |    1.07 |  0.0660 |    3.59
#---------
#---------
# -> Seq 8-bit, rate 1/2, gen:
# ------|-------|-----|-------|--------|--------|------||-------|----------||-----------|---------|---------|----------|----------||----------|---------|---------|----------|---------|---------|---------|---------|
#  PROC |  TYPE | GEN |   VEC |      N |      K |    R ||   SNR |      FRA || LD+ST+DEC |    CTHR |    ITHR |  LATENCY | RUNTIME  || BIG FREQ | BIG POW | BIG ENE | LIT FREQ | LIT POW | LIT ENE | RAM POW | RAM ENE |
#       |       |     |       |        |        |      ||  (dB) |          ||      (ms) |  (Mb/s) |  (Mb/s) |     (us) | (hhmmss) ||    (Mhz) |     (W) |     (J) |    (Mhz) |     (W) |     (J) |     (W) |     (J) |
# ------|-------|-----|-------|--------|--------|------||-------|----------||-----------|---------|---------|----------|----------||----------|---------|---------|----------|---------|---------|---------|---------|
    A15 |  char | yes |   seq |    128 |     64 | 0.50 ||  2.50 |  1372446 ||  14503.07 |   12.11 |    6.06 |    10.57 | 00h00'14 ||   800.00 |  0.5298 |    7.68 |     0.00 |  0.0196 |    0.28 |  0.0506 |    0.73
    A15 |  char | yes |   seq |    256 |    128 | 0.50 ||  2.50 |  1039196 ||  21474.08 |   12.39 |    6.19 |    20.66 | 00h00'21 ||   800.00 |  0.5289 |   11.36 |     0.00 |  0.0196 |    0.42 |  0.0505 |    1.08
    A15 |  char | yes |   seq |    512 |    256 | 0.50 ||  2.50 |   672044 ||  28411.32 |   12.11 |    6.06 |    42.28 | 00h00'28 ||   800.00 |  0.5321 |   15.12 |     0.00 |  0.0196 |    0.56 |  0.0506 |    1.44
    A15 |  char | yes |   seq |   1024 |    512 | 0.50 ||  2.50 |   367136 ||  33911.01 |   11.09 |    5.54 |    92.37 | 00h00'33 ||   800.00 |  0.5328 |   18.07 |     0.00 |  0.0196 |    0.67 |  0.0508 |    1.72
    A15 |  char | yes |   seq |   2048 |   1024 | 0.50 ||  2.50 |   185879 ||  37684.96 |   10.10 |    5.05 |   202.74 | 00h00'37 ||   800.00 |  0.5254 |   19.80 |     0.00 |  0.0197 |    0.74 |  0.0527 |    1.99
    A15 |  char | yes |   seq |   4096 |   2048 | 0.50 ||  2.50 |    92647 ||  39551.91 |    9.59 |    4.80 |   426.91 | 00h00'39 ||   800.00 |  0.5344 |   21.14 |     0.00 |  0.0197 |    0.78 |  0.0530 |    2.10
    A15 |  char | yes |   seq |   8192 |   4096 | 0.50 ||  2.50 |    44280 ||  40239.64 |    9.01 |    4.51 |   908.75 | 00h00'40 ||   800.00 |  0.5434 |   21.87 |     0.00 |  0.0196 |    0.79 |  0.0522 |    2.10
    A15 |  char | yes |   seq |  16384 |   8192 | 0.50 ||  2.50 |    20875 ||  41139.79 |    8.31 |    4.16 |  1970.77 | 00h00'41 ||   800.00 |  0.5573 |   22.93 |     0.00 |  0.0197 |    0.81 |  0.0515 |    2.12
    A15 |  char | yes |   seq |  32768 |  16384 | 0.50 ||  2.50 |     9828 ||  41737.67 |    7.72 |    3.86 |  4246.81 | 00h00'41 ||   800.00 |  0.5652 |   23.59 |     0.00 |  0.0197 |    0.82 |  0.0513 |    2.14
    A15 |  char | yes |   seq |  65536 |  32768 | 0.50 ||  2.50 |     4714 ||  41158.44 |    7.51 |    3.75 |  8731.11 | 00h00'41 ||   800.00 |  0.5776 |   23.77 |     0.00 |  0.0197 |    0.81 |  0.0511 |    2.10
    A15 |  char | yes |   seq |   131072 |   65536 | 0.50 ||  2.50 |     2500 ||  50000.13 |    6.55 |    3.28 | 20000.05 | 00h00'50 ||   800.00 |  0.5744 |   28.72 |     0.00 |  0.0197 |    0.98 |  0.0513 |    2.57
    A15 |  char | yes |   seq |   262144 |  131072 | 0.50 ||  2.50 |     1250 ||  62038.26 |    5.28 |    2.64 | 49630.61 | 00h01'02 ||   800.00 |  0.5654 |   35.08 |     0.00 |  0.0197 |    1.22 |  0.0559 |    3.47
    A15 |  char | yes |   seq |   524288 |  262144 | 0.50 ||  2.50 |      625 ||  67377.95 |    4.86 |    2.43 | 107804.73 | 00h01'07 ||   800.00 |  0.5656 |   38.11 |     0.00 |  0.0197 |    1.32 |  0.0625 |    4.21
    A15 |  char | yes |   seq |  1048576 |  524288 | 0.50 ||  2.50 |      300 ||  70086.62 |    4.49 |    2.24 | 233622.08 | 00h01'10 ||   800.00 |  0.5647 |   39.58 |     0.00 |  0.0197 |    1.38 |  0.0651 |    4.57
#---------
#---------
# -> Seq 8-bit, rate 5/6, gen:
# ------|-------|-----|-------|--------|--------|------||-------|----------||-----------|---------|---------|----------|----------||----------|---------|---------|----------|---------|---------|---------|---------|
#  PROC |  TYPE | GEN |   VEC |      N |      K |    R ||   SNR |      FRA || LD+ST+DEC |    CTHR |    ITHR |  LATENCY | RUNTIME  || BIG FREQ | BIG POW | BIG ENE | LIT FREQ | LIT POW | LIT ENE | RAM POW | RAM ENE |
#       |       |     |       |        |        |      ||  (dB) |          ||      (ms) |  (Mb/s) |  (Mb/s) |     (us) | (hhmmss) ||    (Mhz) |     (W) |     (J) |    (Mhz) |     (W) |     (J) |     (W) |     (J) |
# ------|-------|-----|-------|--------|--------|------||-------|----------||-----------|---------|---------|----------|----------||----------|---------|---------|----------|---------|---------|---------|---------|
    A15 |  char | yes |   seq |    128 |    107 | 0.83 ||  4.00 |  1468511 ||  12142.81 |   15.48 |   12.94 |     8.27 | 00h00'12 ||   800.00 |  0.5158 |    6.26 |     0.00 |  0.0197 |    0.24 |  0.0507 |    0.62
    A15 |  char | yes |   seq |    256 |    213 | 0.83 ||  4.00 |  1089749 ||  19754.25 |   14.12 |   11.75 |    18.13 | 00h00'19 ||   800.00 |  0.5204 |   10.28 |     0.00 |  0.0197 |    0.39 |  0.0507 |    1.00
    A15 |  char | yes |   seq |    512 |    427 | 0.83 ||  4.00 |   718502 ||  26615.52 |   13.82 |   11.53 |    37.04 | 00h00'26 ||   800.00 |  0.5331 |   14.19 |     0.00 |  0.0197 |    0.52 |  0.0504 |    1.34
    A15 |  char | yes |   seq |   1024 |    853 | 0.83 ||  4.00 |   417855 ||  33015.09 |   12.96 |   10.80 |    79.01 | 00h00'33 ||   800.00 |  0.5250 |   17.33 |     0.00 |  0.0197 |    0.65 |  0.0514 |    1.70
    A15 |  char | yes |   seq |   2048 |   1707 | 0.83 ||  4.00 |   210135 ||  37294.39 |   11.54 |    9.62 |   177.48 | 00h00'37 ||   800.00 |  0.5256 |   19.60 |     0.00 |  0.0197 |    0.73 |  0.0514 |    1.92
    A15 |  char | yes |   seq |   4096 |   3413 | 0.83 ||  4.00 |   101774 ||  39757.59 |   10.49 |    8.74 |   390.65 | 00h00'39 ||   800.00 |  0.5454 |   21.68 |     0.00 |  0.0196 |    0.78 |  0.0539 |    2.14
    A15 |  char | yes |   seq |   8192 |   6827 | 0.83 ||  4.00 |    48800 ||  40366.41 |    9.90 |    8.25 |   827.18 | 00h00'40 ||   800.00 |  0.5498 |   22.19 |     0.00 |  0.0197 |    0.79 |  0.0524 |    2.11
    A15 |  char | yes |   seq |  16384 |  13653 | 0.83 ||  4.00 |    22830 ||  40814.44 |    9.16 |    7.64 |  1787.75 | 00h00'40 ||   800.00 |  0.5530 |   22.57 |     0.00 |  0.0197 |    0.80 |  0.0517 |    2.11
    A15 |  char | yes |   seq |  32768 |  27307 | 0.83 ||  4.00 |    10570 ||  40972.61 |    8.45 |    7.04 |  3876.31 | 00h00'40 ||   800.00 |  0.5663 |   23.20 |     0.00 |  0.0197 |    0.81 |  0.0514 |    2.11
    A15 |  char | yes |   seq |  65536 |  54613 | 0.83 ||  4.00 |     4895 ||  40818.59 |    7.86 |    6.55 |  8338.83 | 00h00'40 ||   800.00 |  0.5753 |   23.48 |     0.00 |  0.0197 |    0.80 |  0.0513 |    2.09
    A15 |  char | yes |   seq |   131072 |  109227 | 0.83 ||  4.00 |     2500 ||  47971.26 |    6.83 |    5.69 | 19188.50 | 00h00'48 ||   800.00 |  0.5750 |   27.58 |     0.00 |  0.0197 |    0.94 |  0.0514 |    2.47
    A15 |  char | yes |   seq |   262144 |  218453 | 0.83 ||  4.00 |     1250 ||  59143.65 |    5.54 |    4.62 | 47314.92 | 00h00'59 ||   800.00 |  0.5656 |   33.45 |     0.00 |  0.0197 |    1.16 |  0.0554 |    3.27
    A15 |  char | yes |   seq |   524288 |  436907 | 0.83 ||  4.00 |      625 ||  66072.98 |    4.96 |    4.13 | 105716.76 | 00h01'06 ||   800.00 |  0.5668 |   37.45 |     0.00 |  0.0197 |    1.30 |  0.0618 |    4.08
    A15 |  char | yes |   seq |  1048576 |  873813 | 0.83 ||  4.00 |      300 ||  71111.23 |    4.42 |    3.69 | 237037.41 | 00h01'11 ||   800.00 |  0.5616 |   39.93 |     0.00 |  0.0197 |    1.40 |  0.0650 |    4.62
#---------
#---------
# -> Intra-SIMD 8-bit, rate 1/2, no gen:
# ------|-------|-----|-------|--------|--------|------||-------|----------||-----------|---------|---------|----------|----------||----------|---------|---------|----------|---------|---------|---------|---------|
#  PROC |  TYPE | GEN |   VEC |      N |      K |    R ||   SNR |      FRA || LD+ST+DEC |    CTHR |    ITHR |  LATENCY | RUNTIME  || BIG FREQ | BIG POW | BIG ENE | LIT FREQ | LIT POW | LIT ENE | RAM POW | RAM ENE |
#       |       |     |       |        |        |      ||  (dB) |          ||      (ms) |  (Mb/s) |  (Mb/s) |     (us) | (hhmmss) ||    (Mhz) |     (W) |     (J) |    (Mhz) |     (W) |     (J) |     (W) |     (J) |
# ------|-------|-----|-------|--------|--------|------||-------|----------||-----------|---------|---------|----------|----------||----------|---------|---------|----------|---------|---------|---------|---------|
    A15 |  char |  no | intra |    128 |     64 | 0.50 ||  2.50 |  1628908 ||   9450.13 |   22.06 |   11.03 |     5.80 | 00h00'09 ||   800.00 |  0.5245 |    4.96 |     0.00 |  0.0196 |    0.18 |  0.0508 |    0.48
    A15 |  char |  no | intra |    256 |    128 | 0.50 ||  2.50 |  1482148 ||  11992.33 |   31.64 |   15.82 |     8.09 | 00h00'12 ||   800.00 |  0.5297 |    6.35 |     0.00 |  0.0197 |    0.24 |  0.0506 |    0.61
    A15 |  char |  no | intra |    512 |    256 | 0.50 ||  2.50 |  1287237 ||  15878.83 |   41.51 |   20.75 |    12.34 | 00h00'15 ||   800.00 |  0.5498 |    8.73 |     0.00 |  0.0197 |    0.31 |  0.0504 |    0.80
    A15 |  char |  no | intra |   1024 |    512 | 0.50 ||  2.50 |   979960 ||  22164.04 |   45.28 |   22.64 |    22.62 | 00h00'22 ||   800.00 |  0.5645 |   12.51 |     0.00 |  0.0196 |    0.43 |  0.0510 |    1.13
    A15 |  char |  no | intra |   2048 |   1024 | 0.50 ||  2.50 |   657025 ||  27998.16 |   48.06 |   24.03 |    42.61 | 00h00'28 ||   800.00 |  0.6174 |   17.29 |     0.00 |  0.0197 |    0.55 |  0.0515 |    1.44
    A15 |  char |  no | intra |   4096 |   2048 | 0.50 ||  2.50 |   419152 ||  33175.14 |   51.75 |   25.88 |    79.15 | 00h00'33 ||   800.00 |  0.6053 |   20.08 |     0.00 |  0.0197 |    0.65 |  0.0532 |    1.77
    A15 |  char |  no | intra |   8192 |   4096 | 0.50 ||  2.50 |   234743 ||  35429.39 |   54.28 |   27.14 |   150.93 | 00h00'35 ||   800.00 |  0.6083 |   21.55 |     0.00 |  0.0197 |    0.70 |  0.0565 |    2.00
    A15 |  char |  no | intra |  16384 |   8192 | 0.50 ||  2.50 |   121493 ||  37979.66 |   52.41 |   26.21 |   312.61 | 00h00'38 ||   800.00 |  0.6395 |   24.29 |     0.00 |  0.0197 |    0.75 |  0.0555 |    2.11
    A15 |  char |  no | intra |  32768 |  16384 | 0.50 ||  2.50 |    61018 ||  39096.13 |   51.14 |   25.57 |   640.73 | 00h00'39 ||   800.00 |  0.6462 |   25.26 |     0.00 |  0.0197 |    0.77 |  0.0537 |    2.10
    A15 |  char |  no | intra |  65536 |  32768 | 0.50 ||  2.50 |    29966 ||  39260.24 |   50.02 |   25.01 |  1310.16 | 00h00'40 ||   800.00 |  0.6621 |   26.00 |     0.00 |  0.0197 |    0.77 |  0.0528 |    2.07
    A15 |  char |  no | intra |   131072 |   65536 | 0.50 ||  2.50 |    15000 ||  42802.88 |   45.93 |   22.97 |  2853.53 | 00h00'44 ||   800.00 |  0.6641 |   28.42 |     0.00 |  0.0197 |    0.84 |  0.0527 |    2.26
    A15 |  char |  no | intra |   262144 |  131072 | 0.50 ||  2.50 |     7000 ||  47578.37 |   38.57 |   19.28 |  6796.91 | 00h00'51 ||   800.00 |  0.6546 |   31.14 |     0.00 |  0.0197 |    0.94 |  0.0529 |    2.52
    A15 |  char |  no | intra |   524288 |  262144 | 0.50 ||  2.50 |     3500 ||  51369.68 |   35.72 |   17.86 | 14677.05 | 00h00'59 ||   800.00 |  0.6451 |   33.14 |     0.00 |  0.0198 |    1.02 |  0.0713 |    3.66
    A15 |  char |  no | intra |  1048576 |  524288 | 0.50 ||  2.50 |     1750 ||  59221.25 |   30.99 |   15.49 | 33840.71 | 00h01'15 ||   800.00 |  0.6331 |   37.49 |     0.00 |  0.0197 |    1.17 |  0.0747 |    4.42
#---------
#---------
# -> Intra-SIMD 8-bit, rate 5/6, no gen:
# ------|-------|-----|-------|--------|--------|------||-------|----------||-----------|---------|---------|----------|----------||----------|---------|---------|----------|---------|---------|---------|---------|
#  PROC |  TYPE | GEN |   VEC |      N |      K |    R ||   SNR |      FRA || LD+ST+DEC |    CTHR |    ITHR |  LATENCY | RUNTIME  || BIG FREQ | BIG POW | BIG ENE | LIT FREQ | LIT POW | LIT ENE | RAM POW | RAM ENE |
#       |       |     |       |        |        |      ||  (dB) |          ||      (ms) |  (Mb/s) |  (Mb/s) |     (us) | (hhmmss) ||    (Mhz) |     (W) |     (J) |    (Mhz) |     (W) |     (J) |     (W) |     (J) |
# ------|-------|-----|-------|--------|--------|------||-------|----------||-----------|---------|---------|----------|----------||----------|---------|---------|----------|---------|---------|---------|---------|
    A15 |  char |  no | intra |    128 |    107 | 0.83 ||  4.00 |  1739009 ||   7352.83 |   30.27 |   25.31 |     4.23 | 00h00'07 ||   800.00 |  0.5040 |    3.71 |     0.00 |  0.0197 |    0.14 |  0.0510 |    0.37
    A15 |  char |  no | intra |    256 |    213 | 0.83 ||  4.00 |  1549709 ||  10486.59 |   37.83 |   31.48 |     6.77 | 00h00'10 ||   800.00 |  0.5247 |    5.50 |     0.00 |  0.0197 |    0.21 |  0.0508 |    0.53
    A15 |  char |  no | intra |    512 |    427 | 0.83 ||  4.00 |  1373013 ||  14885.31 |   47.23 |   39.39 |    10.84 | 00h00'14 ||   800.00 |  0.5680 |    8.45 |     0.00 |  0.0197 |    0.29 |  0.0510 |    0.76
    A15 |  char |  no | intra |   1024 |    853 | 0.83 ||  4.00 |  1137199 ||  19521.69 |   59.65 |   49.69 |    17.17 | 00h00'19 ||   800.00 |  0.5611 |   10.95 |     0.00 |  0.0197 |    0.38 |  0.0508 |    0.99
    A15 |  char |  no | intra |   2048 |   1707 | 0.83 ||  4.00 |   788585 ||  25528.82 |   63.26 |   52.73 |    32.37 | 00h00'25 ||   800.00 |  0.5980 |   15.27 |     0.00 |  0.0197 |    0.50 |  0.0521 |    1.33
    A15 |  char |  no | intra |   4096 |   3413 | 0.83 ||  4.00 |   503777 ||  31133.38 |   66.28 |   55.23 |    61.80 | 00h00'31 ||   800.00 |  0.6091 |   18.96 |     0.00 |  0.0197 |    0.61 |  0.0520 |    1.62
    A15 |  char |  no | intra |   8192 |   6827 | 0.83 ||  4.00 |   290048 ||  35025.36 |   67.84 |   56.53 |   120.76 | 00h00'35 ||   800.00 |  0.6379 |   22.34 |     0.00 |  0.0197 |    0.69 |  0.0568 |    1.99
    A15 |  char |  no | intra |  16384 |  13653 | 0.83 ||  4.00 |   146841 ||  37336.41 |   64.44 |   53.70 |   254.26 | 00h00'37 ||   800.00 |  0.6509 |   24.30 |     0.00 |  0.0197 |    0.73 |  0.0559 |    2.09
    A15 |  char |  no | intra |  32768 |  27307 | 0.83 ||  4.00 |    73239 ||  39555.48 |   60.67 |   50.56 |   540.09 | 00h00'40 ||   800.00 |  0.6531 |   25.83 |     0.00 |  0.0197 |    0.78 |  0.0542 |    2.14
    A15 |  char |  no | intra |  65536 |  54613 | 0.83 ||  4.00 |    35138 ||  39429.14 |   58.40 |   48.67 |  1122.12 | 00h00'40 ||   800.00 |  0.6675 |   26.32 |     0.00 |  0.0197 |    0.78 |  0.0534 |    2.11
    A15 |  char |  no | intra |   131072 |  109227 | 0.83 ||  4.00 |    15000 ||  36546.79 |   53.80 |   44.83 |  2436.45 | 00h00'38 ||   800.00 |  0.6678 |   24.41 |     0.00 |  0.0198 |    0.72 |  0.0531 |    1.94
    A15 |  char |  no | intra |   262144 |  218453 | 0.83 ||  4.00 |     7500 ||  44984.05 |   43.71 |   36.42 |  5997.87 | 00h00'48 ||   800.00 |  0.6565 |   29.53 |     0.00 |  0.0197 |    0.89 |  0.0530 |    2.38
    A15 |  char |  no | intra |   524288 |  436907 | 0.83 ||  4.00 |     3500 ||  47494.52 |   38.64 |   32.20 | 13569.86 | 00h00'54 ||   800.00 |  0.6456 |   30.66 |     0.00 |  0.0198 |    0.94 |  0.0763 |    3.62
    A15 |  char |  no | intra |  1048576 |  873813 | 0.83 ||  4.00 |     1750 ||  55030.83 |   33.35 |   27.79 | 31446.19 | 00h01'08 ||   800.00 |  0.6342 |   34.90 |     0.00 |  0.0197 |    1.09 |  0.0912 |    5.02
#---------
#---------
# -> Intra-SIMD 8-bit, rate 1/2, gen:
# ------|-------|-----|-------|--------|--------|------||-------|----------||-----------|---------|---------|----------|----------||----------|---------|---------|----------|---------|---------|---------|---------|
#  PROC |  TYPE | GEN |   VEC |      N |      K |    R ||   SNR |      FRA || LD+ST+DEC |    CTHR |    ITHR |  LATENCY | RUNTIME  || BIG FREQ | BIG POW | BIG ENE | LIT FREQ | LIT POW | LIT ENE | RAM POW | RAM ENE |
#       |       |     |       |        |        |      ||  (dB) |          ||      (ms) |  (Mb/s) |  (Mb/s) |     (us) | (hhmmss) ||    (Mhz) |     (W) |     (J) |    (Mhz) |     (W) |     (J) |     (W) |     (J) |
# ------|-------|-----|-------|--------|--------|------||-------|----------||-----------|---------|---------|----------|----------||----------|---------|---------|----------|---------|---------|---------|---------|
    A15 |  char | yes | intra |    128 |     64 | 0.50 ||  2.50 |  1698069 ||   8197.56 |   26.51 |   13.26 |     4.83 | 00h00'08 ||   800.00 |  0.5041 |    4.13 |     0.00 |  0.0197 |    0.16 |  0.0507 |    0.42
    A15 |  char | yes | intra |    256 |    128 | 0.50 ||  2.50 |  1572445 ||  11168.92 |   36.04 |   18.02 |     7.10 | 00h00'11 ||   800.00 |  0.5277 |    5.89 |     0.00 |  0.0197 |    0.22 |  0.0509 |    0.57
    A15 |  char | yes | intra |    512 |    256 | 0.50 ||  2.50 |  1381377 ||  14170.86 |   49.91 |   24.95 |    10.26 | 00h00'14 ||   800.00 |  0.5370 |    7.61 |     0.00 |  0.0197 |    0.28 |  0.0510 |    0.72
    A15 |  char | yes | intra |   1024 |    512 | 0.50 ||  2.50 |  1074590 ||  20377.74 |   54.00 |   27.00 |    18.96 | 00h00'20 ||   800.00 |  0.5428 |   11.06 |     0.00 |  0.0197 |    0.40 |  0.0507 |    1.03
    A15 |  char | yes | intra |   2048 |   1024 | 0.50 ||  2.50 |   769737 ||  26296.62 |   59.95 |   29.97 |    34.16 | 00h00'26 ||   800.00 |  0.5791 |   15.23 |     0.00 |  0.0197 |    0.52 |  0.0516 |    1.36
    A15 |  char | yes | intra |   4096 |   2048 | 0.50 ||  2.50 |   489617 ||  32528.15 |   61.65 |   30.83 |    66.44 | 00h00'32 ||   800.00 |  0.5945 |   19.34 |     0.00 |  0.0197 |    0.64 |  0.0542 |    1.76
    A15 |  char | yes | intra |   8192 |   4096 | 0.50 ||  2.50 |   275797 ||  37687.13 |   59.95 |   29.97 |   136.65 | 00h00'37 ||   800.00 |  0.6266 |   23.61 |     0.00 |  0.0197 |    0.74 |  0.0583 |    2.20
    A15 |  char | yes | intra |  16384 |   8192 | 0.50 ||  2.50 |   142854 ||  42243.23 |   55.41 |   27.70 |   295.71 | 00h00'42 ||   800.00 |  0.6388 |   26.99 |     0.00 |  0.0197 |    0.83 |  0.0558 |    2.36
    A15 |  char | yes | intra |  32768 |  16384 | 0.50 ||  2.50 |    68860 ||  43637.10 |   51.71 |   25.85 |   633.71 | 00h00'43 ||   800.00 |  0.6417 |   28.00 |     0.00 |  0.0197 |    0.86 |  0.0535 |    2.34
    A15 |  char | yes | intra |  65536 |  32768 | 0.50 ||  2.50 |    34752 ||  41403.52 |   55.01 |   27.50 |  1191.40 | 00h00'41 ||   800.00 |  0.6576 |   27.23 |     0.00 |  0.0198 |    0.82 |  0.0533 |    2.20
    A15 |  char | yes | intra |   131072 |   65536 | 0.50 ||  2.50 |    15000 ||  37711.80 |   52.13 |   26.07 |  2514.12 | 00h00'37 ||   800.00 |  0.6597 |   24.88 |     0.00 |  0.0197 |    0.74 |  0.0530 |    2.00
    A15 |  char | yes | intra |   262144 |  131072 | 0.50 ||  2.50 |     7000 ||  43055.07 |   42.62 |   21.31 |  6150.73 | 00h00'43 ||   800.00 |  0.6517 |   28.06 |     0.00 |  0.0198 |    0.85 |  0.0532 |    2.29
    A15 |  char | yes | intra |   524288 |  262144 | 0.50 ||  2.50 |     3500 ||  49658.36 |   36.95 |   18.48 | 14188.10 | 00h00'50 ||   800.00 |  0.6348 |   31.52 |     0.00 |  0.0199 |    0.99 |  0.0785 |    3.90
    A15 |  char | yes | intra |  1048576 |  524288 | 0.50 ||  2.50 |     1750 ||  54494.97 |   33.67 |   16.84 | 31139.98 | 00h00'55 ||   800.00 |  0.6284 |   34.24 |     0.00 |  0.0198 |    1.08 |  0.0927 |    5.05
#---------
#---------
# -> Intra-SIMD 8-bit, rate 5/6, gen:
# ------|-------|-----|-------|--------|--------|------||-------|----------||-----------|---------|---------|----------|----------||----------|---------|---------|----------|---------|---------|---------|---------|
#  PROC |  TYPE | GEN |   VEC |      N |      K |    R ||   SNR |      FRA || LD+ST+DEC |    CTHR |    ITHR |  LATENCY | RUNTIME  || BIG FREQ | BIG POW | BIG ENE | LIT FREQ | LIT POW | LIT ENE | RAM POW | RAM ENE |
#       |       |     |       |        |        |      ||  (dB) |          ||      (ms) |  (Mb/s) |  (Mb/s) |     (us) | (hhmmss) ||    (Mhz) |     (W) |     (J) |    (Mhz) |     (W) |     (J) |     (W) |     (J) |
# ------|-------|-----|-------|--------|--------|------||-------|----------||-----------|---------|---------|----------|----------||----------|---------|---------|----------|---------|---------|---------|---------|
    A15 |  char | yes | intra |    128 |    107 | 0.83 ||  4.00 |  1765946 ||   6798.01 |   33.25 |   27.80 |     3.85 | 00h00'06 ||   800.00 |  0.4868 |    3.31 |     0.00 |  0.0197 |    0.13 |  0.0508 |    0.35
    A15 |  char | yes | intra |    256 |    213 | 0.83 ||  4.00 |  1622879 ||   9888.07 |   42.02 |   34.96 |     6.09 | 00h00'09 ||   800.00 |  0.5165 |    5.11 |     0.00 |  0.0197 |    0.19 |  0.0508 |    0.50
    A15 |  char | yes | intra |    512 |    427 | 0.83 ||  4.00 |  1446105 ||  12563.11 |   58.93 |   49.15 |     8.69 | 00h00'12 ||   800.00 |  0.5367 |    6.74 |     0.00 |  0.0197 |    0.25 |  0.0507 |    0.64
    A15 |  char | yes | intra |   1024 |    853 | 0.83 ||  4.00 |  1198370 ||  17724.33 |   69.23 |   57.67 |    14.79 | 00h00'17 ||   800.00 |  0.5516 |    9.78 |     0.00 |  0.0197 |    0.35 |  0.0514 |    0.91
    A15 |  char | yes | intra |   2048 |   1707 | 0.83 ||  4.00 |   890666 ||  24869.88 |   73.35 |   61.13 |    27.92 | 00h00'24 ||   800.00 |  0.5768 |   14.35 |     0.00 |  0.0197 |    0.49 |  0.0511 |    1.27
    A15 |  char | yes | intra |   4096 |   3413 | 0.83 ||  4.00 |   561429 ||  31234.10 |   73.63 |   61.35 |    55.63 | 00h00'31 ||   800.00 |  0.6231 |   19.46 |     0.00 |  0.0198 |    0.62 |  0.0534 |    1.67
    A15 |  char | yes | intra |   8192 |   6827 | 0.83 ||  4.00 |   321341 ||  34793.07 |   75.66 |   63.05 |   108.27 | 00h00'34 ||   800.00 |  0.6419 |   22.33 |     0.00 |  0.0197 |    0.68 |  0.0547 |    1.90
    A15 |  char | yes | intra |  16384 |  13653 | 0.83 ||  4.00 |   170937 ||  38798.04 |   72.18 |   60.15 |   226.97 | 00h00'38 ||   800.00 |  0.6463 |   25.08 |     0.00 |  0.0198 |    0.77 |  0.0570 |    2.21
    A15 |  char | yes | intra |  32768 |  27307 | 0.83 ||  4.00 |    79535 ||  38300.31 |   68.05 |   56.71 |   481.55 | 00h00'38 ||   800.00 |  0.6550 |   25.09 |     0.00 |  0.0197 |    0.76 |  0.0545 |    2.09
    A15 |  char | yes | intra |  65536 |  54613 | 0.83 ||  4.00 |    39967 ||  40267.98 |   65.05 |   54.20 |  1007.53 | 00h00'40 ||   800.00 |  0.6758 |   27.21 |     0.00 |  0.0197 |    0.79 |  0.0535 |    2.15
    A15 |  char | yes | intra |   131072 |  109227 | 0.83 ||  4.00 |    15000 ||  32203.97 |   61.05 |   50.88 |  2146.93 | 00h00'32 ||   800.00 |  0.6672 |   21.49 |     0.00 |  0.0198 |    0.64 |  0.0535 |    1.72
    A15 |  char | yes | intra |   262144 |  218453 | 0.83 ||  4.00 |     7500 ||  41509.49 |   47.36 |   39.47 |  5534.60 | 00h00'41 ||   800.00 |  0.6563 |   27.24 |     0.00 |  0.0197 |    0.82 |  0.0576 |    2.39
    A15 |  char | yes | intra |   524288 |  436907 | 0.83 ||  4.00 |     3500 ||  46036.77 |   39.86 |   33.22 | 13153.36 | 00h00'46 ||   800.00 |  0.6416 |   29.54 |     0.00 |  0.0198 |    0.91 |  0.0776 |    3.57
    A15 |  char | yes | intra |  1048576 |  873813 | 0.83 ||  4.00 |     1750 ||  52330.32 |   35.07 |   29.22 | 29903.04 | 00h00'53 ||   800.00 |  0.6332 |   33.14 |     0.00 |  0.0198 |    1.04 |  0.0946 |    4.95
#---------
#---------
# -> Inter-SIMD 8-bit, rate 1/2, no gen:
# ------|-------|-----|-------|--------|--------|------||-------|----------||-----------|---------|---------|----------|----------||----------|---------|---------|----------|---------|---------|---------|---------|
#  PROC |  TYPE | GEN |   VEC |      N |      K |    R ||   SNR |      FRA || LD+ST+DEC |    CTHR |    ITHR |  LATENCY | RUNTIME  || BIG FREQ | BIG POW | BIG ENE | LIT FREQ | LIT POW | LIT ENE | RAM POW | RAM ENE |
#       |       |     |       |        |        |      ||  (dB) |          ||      (ms) |  (Mb/s) |  (Mb/s) |     (us) | (hhmmss) ||    (Mhz) |     (W) |     (J) |    (Mhz) |     (W) |     (J) |     (W) |     (J) |
# ------|-------|-----|-------|--------|--------|------||-------|----------||-----------|---------|---------|----------|----------||----------|---------|---------|----------|---------|---------|---------|---------|
    A15 |  char |  no | inter |    128 |     64 | 0.50 ||  2.50 | 18706160 ||  18694.03 |  128.08 |   64.04 |    15.99 | 00h00'18 ||   800.00 |  0.5846 |   10.93 |     0.00 |  0.0197 |    0.37 |  0.0509 |    0.95
    A15 |  char |  no | inter |    256 |    128 | 0.50 ||  2.50 | 13180784 ||  24489.88 |  137.78 |   68.89 |    29.73 | 00h00'24 ||   800.00 |  0.6254 |   15.32 |     0.00 |  0.0197 |    0.48 |  0.0509 |    1.25
    A15 |  char |  no | inter |    512 |    256 | 0.50 ||  2.50 |  8149008 ||  33555.53 |  124.34 |   62.17 |    65.88 | 00h00'33 ||   800.00 |  0.6406 |   21.49 |     0.00 |  0.0198 |    0.66 |  0.0511 |    1.71
    A15 |  char |  no | inter |   1024 |    512 | 0.50 ||  2.50 |  3781824 ||  33489.32 |  115.64 |   57.82 |   141.69 | 00h00'33 ||   800.00 |  0.6625 |   22.19 |     0.00 |  0.0197 |    0.66 |  0.0509 |    1.70
    A15 |  char |  no | inter |   2048 |   1024 | 0.50 ||  2.50 |  1895728 ||  37363.09 |  103.91 |   51.96 |   315.35 | 00h00'37 ||   800.00 |  0.6539 |   24.43 |     0.00 |  0.0197 |    0.74 |  0.0508 |    1.90
    A15 |  char |  no | inter |   4096 |   2048 | 0.50 ||  2.50 |   885920 ||  40001.75 |   90.71 |   45.36 |   722.44 | 00h00'40 ||   800.00 |  0.6638 |   26.55 |     0.00 |  0.0198 |    0.79 |  0.0511 |    2.04
    A15 |  char |  no | inter |   8192 |   4096 | 0.50 ||  2.50 |   421488 ||  41390.83 |   83.42 |   41.71 |  1571.23 | 00h00'41 ||   800.00 |  0.6665 |   27.59 |     0.00 |  0.0198 |    0.82 |  0.0509 |    2.10
    A15 |  char |  no | inter |  16384 |   8192 | 0.50 ||  2.50 |   188736 ||  40209.17 |   76.90 |   38.45 |  3408.71 | 00h00'40 ||   800.00 |  0.6702 |   26.95 |     0.00 |  0.0198 |    0.80 |  0.0513 |    2.06
    A15 |  char |  no | inter |  32768 |  16384 | 0.50 ||  2.50 |    82496 ||  42138.78 |   64.15 |   32.08 |  8172.77 | 00h00'43 ||   800.00 |  0.6532 |   27.53 |     0.00 |  0.0198 |    0.83 |  0.0612 |    2.58
    A15 |  char |  no | inter |  65536 |  32768 | 0.50 ||  2.50 |    30624 ||  39508.86 |   50.80 |   25.40 | 20642.04 | 00h00'41 ||   800.00 |  0.6115 |   24.16 |     0.00 |  0.0198 |    0.78 |  0.0939 |    3.71
    A15 |  char |  no | inter |   131072 |   65536 | 0.50 ||  2.50 |    15000 ||  40815.31 |   48.17 |   24.09 | 43536.33 | 00h00'44 ||   800.00 |  0.6135 |   25.04 |     0.00 |  0.0197 |    0.80 |  0.1059 |    4.32
    A15 |  char |  no | inter |   262144 |  131072 | 0.50 ||  2.50 |     7000 ||  41395.16 |   44.33 |   22.16 | 94617.52 | 00h00'48 ||   800.00 |  0.6245 |   25.85 |     0.00 |  0.0199 |    0.82 |  0.1137 |    4.71
    A15 |  char |  no | inter |   524288 |  262144 | 0.50 ||  2.50 |     3500 ||  43654.86 |   42.03 |   21.02 | 199565.06 | 00h00'57 ||   800.00 |  0.6284 |   27.43 |     0.00 |  0.0198 |    0.87 |  0.1208 |    5.27
    A15 |  char |  no | inter |  1048576 |  524288 | 0.50 ||  2.50 |     1750 ||  46316.45 |   39.62 |   19.81 | 423464.66 | 00h01'13 ||   800.00 |  0.6165 |   28.55 |     0.00 |  0.0199 |    0.92 |  0.1273 |    5.90
#---------
#---------
# -> Inter-SIMD 8-bit, rate 5/6, no gen:
# ------|-------|-----|-------|--------|--------|------||-------|----------||-----------|---------|---------|----------|----------||----------|---------|---------|----------|---------|---------|---------|---------|
#  PROC |  TYPE | GEN |   VEC |      N |      K |    R ||   SNR |      FRA || LD+ST+DEC |    CTHR |    ITHR |  LATENCY | RUNTIME  || BIG FREQ | BIG POW | BIG ENE | LIT FREQ | LIT POW | LIT ENE | RAM POW | RAM ENE |
#       |       |     |       |        |        |      ||  (dB) |          ||      (ms) |  (Mb/s) |  (Mb/s) |     (us) | (hhmmss) ||    (Mhz) |     (W) |     (J) |    (Mhz) |     (W) |     (J) |     (W) |     (J) |
# ------|-------|-----|-------|--------|--------|------||-------|----------||-----------|---------|---------|----------|----------||----------|---------|---------|----------|---------|---------|---------|---------|
    A15 |  char |  no | inter |    128 |    107 | 0.83 ||  4.00 | 20592832 ||  16139.30 |  163.32 |  136.53 |    12.54 | 00h00'16 ||   800.00 |  0.6137 |    9.90 |     0.00 |  0.0197 |    0.32 |  0.0509 |    0.82
    A15 |  char |  no | inter |    256 |    213 | 0.83 ||  4.00 | 14286336 ||  23549.31 |  155.30 |  129.22 |    26.37 | 00h00'23 ||   800.00 |  0.6331 |   14.91 |     0.00 |  0.0198 |    0.47 |  0.0511 |    1.20
    A15 |  char |  no | inter |    512 |    427 | 0.83 ||  4.00 |  7631728 ||  26758.62 |  146.03 |  121.78 |    56.10 | 00h00'26 ||   800.00 |  0.6162 |   16.49 |     0.00 |  0.0199 |    0.53 |  0.0510 |    1.36
    A15 |  char |  no | inter |   1024 |    853 | 0.83 ||  4.00 |  4583760 ||  36605.86 |  128.22 |  106.81 |   127.78 | 00h00'36 ||   800.00 |  0.6391 |   23.39 |     0.00 |  0.0198 |    0.72 |  0.0510 |    1.87
    A15 |  char |  no | inter |   2048 |   1707 | 0.83 ||  4.00 |  2104272 ||  39048.24 |  110.36 |   91.99 |   296.91 | 00h00'39 ||   800.00 |  0.6575 |   25.68 |     0.00 |  0.0197 |    0.77 |  0.0509 |    1.99
    A15 |  char |  no | inter |   4096 |   3413 | 0.83 ||  4.00 |   961296 ||  41929.99 |   93.91 |   78.25 |   697.89 | 00h00'42 ||   800.00 |  0.6691 |   28.05 |     0.00 |  0.0197 |    0.83 |  0.0511 |    2.14
    A15 |  char |  no | inter |   8192 |   6827 | 0.83 ||  4.00 |   455600 ||  41733.61 |   89.43 |   74.53 |  1465.62 | 00h00'41 ||   800.00 |  0.6647 |   27.74 |     0.00 |  0.0197 |    0.82 |  0.0511 |    2.13
    A15 |  char |  no | inter |  16384 |  13653 | 0.83 ||  4.00 |   207968 ||  41914.27 |   81.29 |   67.74 |  3224.67 | 00h00'42 ||   800.00 |  0.6665 |   27.93 |     0.00 |  0.0198 |    0.83 |  0.0517 |    2.17
    A15 |  char |  no | inter |  32768 |  27307 | 0.83 ||  4.00 |    86624 ||  40795.52 |   69.58 |   57.98 |  7535.19 | 00h00'41 ||   800.00 |  0.6506 |   26.54 |     0.00 |  0.0199 |    0.81 |  0.0629 |    2.57
    A15 |  char |  no | inter |  65536 |  54613 | 0.83 ||  4.00 |    31392 ||  39454.95 |   52.14 |   43.45 | 20109.56 | 00h00'41 ||   800.00 |  0.6069 |   23.94 |     0.00 |  0.0198 |    0.78 |  0.0954 |    3.76
    A15 |  char |  no | inter |   131072 |  109227 | 0.83 ||  4.00 |    15000 ||  39513.31 |   49.76 |   41.46 | 42147.53 | 00h00'42 ||   800.00 |  0.6182 |   24.43 |     0.00 |  0.0198 |    0.78 |  0.1074 |    4.24
    A15 |  char |  no | inter |   262144 |  218453 | 0.83 ||  4.00 |     7500 ||  41620.43 |   47.24 |   39.37 | 88790.25 | 00h00'48 ||   800.00 |  0.6269 |   26.09 |     0.00 |  0.0198 |    0.82 |  0.1181 |    4.91
    A15 |  char |  no | inter |   524288 |  436907 | 0.83 ||  4.00 |     3500 ||  42391.12 |   43.29 |   36.07 | 193788.00 | 00h00'55 ||   800.00 |  0.6269 |   26.58 |     0.00 |  0.0198 |    0.84 |  0.1227 |    5.20
    A15 |  char |  no | inter |  1048576 |  873813 | 0.83 ||  4.00 |     1750 ||  45019.32 |   40.76 |   33.97 | 411605.22 | 00h01'10 ||   800.00 |  0.6249 |   28.13 |     0.00 |  0.0197 |    0.89 |  0.1297 |    5.84
#---------
#---------
# -> inter-SIMD 8-bit, rate 1/2, gen:
# ------|-------|-----|-------|--------|--------|------||-------|----------||-----------|---------|---------|----------|----------||----------|---------|---------|----------|---------|---------|---------|---------|
#  PROC |  TYPE | GEN |   VEC |      N |      K |    R ||   SNR |      FRA || LD+ST+DEC |    CTHR |    ITHR |  LATENCY | RUNTIME  || BIG FREQ | BIG POW | BIG ENE | LIT FREQ | LIT POW | LIT ENE | RAM POW | RAM ENE |
#       |       |     |       |        |        |      ||  (dB) |          ||      (ms) |  (Mb/s) |  (Mb/s) |     (us) | (hhmmss) ||    (Mhz) |     (W) |     (J) |    (Mhz) |     (W) |     (J) |     (W) |     (J) |
# ------|-------|-----|-------|--------|--------|------||-------|----------||-----------|---------|---------|----------|----------||----------|---------|---------|----------|---------|---------|---------|---------|
    A15 |  char | yes | inter |    128 |     64 | 0.50 ||  2.50 | 19644080 ||  17860.39 |  140.78 |   70.39 |    14.55 | 00h00'17 ||   800.00 |  0.5734 |   10.24 |     0.00 |  0.0198 |    0.35 |  0.0511 |    0.91
    A15 |  char | yes | inter |    256 |    128 | 0.50 ||  2.50 | 14383232 ||  23749.32 |  155.04 |   77.52 |    26.42 | 00h00'23 ||   800.00 |  0.5961 |   14.16 |     0.00 |  0.0197 |    0.47 |  0.0510 |    1.21
    A15 |  char | yes | inter |    512 |    256 | 0.50 ||  2.50 |  9026992 ||  33232.73 |  139.07 |   69.54 |    58.90 | 00h00'33 ||   800.00 |  0.6465 |   21.48 |     0.00 |  0.0198 |    0.66 |  0.0511 |    1.70
    A15 |  char | yes | inter |   1024 |    512 | 0.50 ||  2.50 |  4512336 ||  35874.13 |  128.80 |   64.40 |   127.20 | 00h00'35 ||   800.00 |  0.6499 |   23.32 |     0.00 |  0.0198 |    0.71 |  0.0511 |    1.83
    A15 |  char | yes | inter |   2048 |   1024 | 0.50 ||  2.50 |  2072400 ||  37933.33 |  111.89 |   55.94 |   292.86 | 00h00'37 ||   800.00 |  0.6655 |   25.24 |     0.00 |  0.0197 |    0.75 |  0.0511 |    1.94
    A15 |  char | yes | inter |   4096 |   2048 | 0.50 ||  2.50 |   963264 ||  40743.50 |   96.84 |   48.42 |   676.76 | 00h00'40 ||   800.00 |  0.6777 |   27.61 |     0.00 |  0.0198 |    0.81 |  0.0512 |    2.09
    A15 |  char | yes | inter |   8192 |   4096 | 0.50 ||  2.50 |   451024 ||  40900.70 |   90.34 |   45.17 |  1450.95 | 00h00'40 ||   800.00 |  0.6765 |   27.67 |     0.00 |  0.0197 |    0.81 |  0.0511 |    2.09
    A15 |  char | yes | inter |  16384 |   8192 | 0.50 ||  2.50 |   198944 ||  41023.48 |   79.45 |   39.73 |  3299.30 | 00h00'41 ||   800.00 |  0.6775 |   27.79 |     0.00 |  0.0197 |    0.81 |  0.0513 |    2.10
    A15 |  char | yes | inter |  32768 |  16384 | 0.50 ||  2.50 |    87088 ||  40193.95 |   71.00 |   35.50 |  7384.52 | 00h00'40 ||   800.00 |  0.6642 |   26.70 |     0.00 |  0.0198 |    0.79 |  0.0634 |    2.55
    A15 |  char | yes | inter |  65536 |  32768 | 0.50 ||  2.50 |    32208 ||  39659.73 |   53.22 |   26.61 | 19701.80 | 00h00'40 ||   800.00 |  0.6154 |   24.41 |     0.00 |  0.0197 |    0.78 |  0.0966 |    3.83
    A15 |  char | yes | inter |   131072 |   65536 | 0.50 ||  2.50 |    15000 ||  40244.41 |   48.85 |   24.43 | 42927.37 | 00h00'41 ||   800.00 |  0.6169 |   24.82 |     0.00 |  0.0197 |    0.79 |  0.1090 |    4.39
    A15 |  char | yes | inter |   262144 |  131072 | 0.50 ||  2.50 |     7000 ||  40296.23 |   45.54 |   22.77 | 92105.68 | 00h00'43 ||   800.00 |  0.6179 |   24.90 |     0.00 |  0.0197 |    0.79 |  0.1189 |    4.79
    A15 |  char | yes | inter |   524288 |  262144 | 0.50 ||  2.50 |     3500 ||  44131.45 |   41.58 |   20.79 | 201743.75 | 00h00'49 ||   800.00 |  0.6173 |   27.24 |     0.00 |  0.0198 |    0.87 |  0.1257 |    5.55
    A15 |  char | yes | inter |  1048576 |  524288 | 0.50 ||  2.50 |     1750 ||  48339.18 |   37.96 |   18.98 | 441958.22 | 00h00'59 ||   800.00 |  0.6063 |   29.31 |     0.00 |  0.0198 |    0.96 |  0.1296 |    6.27
#---------
#---------
# -> inter-SIMD 8-bit, rate 5/6, gen:
# ------|-------|-----|-------|--------|--------|------||-------|----------||-----------|---------|---------|----------|----------||----------|---------|---------|----------|---------|---------|---------|---------|
#  PROC |  TYPE | GEN |   VEC |      N |      K |    R ||   SNR |      FRA || LD+ST+DEC |    CTHR |    ITHR |  LATENCY | RUNTIME  || BIG FREQ | BIG POW | BIG ENE | LIT FREQ | LIT POW | LIT ENE | RAM POW | RAM ENE |
#       |       |     |       |        |        |      ||  (dB) |          ||      (ms) |  (Mb/s) |  (Mb/s) |     (us) | (hhmmss) ||    (Mhz) |     (W) |     (J) |    (Mhz) |     (W) |     (J) |     (W) |     (J) |
# ------|-------|-----|-------|--------|--------|------||-------|----------||-----------|---------|---------|----------|----------||----------|---------|---------|----------|---------|---------|---------|---------|
    A15 |  char | yes | inter |    128 |    107 | 0.83 ||  4.00 | 21203296 ||  15488.82 |  175.22 |  146.48 |    11.69 | 00h00'15 ||   800.00 |  0.6116 |    9.47 |     0.00 |  0.0198 |    0.31 |  0.0510 |    0.79
    A15 |  char | yes | inter |    256 |    213 | 0.83 ||  4.00 | 14939920 ||  22785.85 |  167.85 |  139.66 |    24.40 | 00h00'22 ||   800.00 |  0.6163 |   14.04 |     0.00 |  0.0197 |    0.45 |  0.0509 |    1.16
    A15 |  char | yes | inter |    512 |    427 | 0.83 ||  4.00 |  9001600 ||  29482.66 |  156.32 |  130.37 |    52.40 | 00h00'29 ||   800.00 |  0.6309 |   18.60 |     0.00 |  0.0199 |    0.59 |  0.0510 |    1.50
    A15 |  char | yes | inter |   1024 |    853 | 0.83 ||  4.00 |  4298672 ||  37623.88 |  117.00 |   97.46 |   140.04 | 00h00'37 ||   800.00 |  0.6526 |   24.55 |     0.00 |  0.0197 |    0.74 |  0.0510 |    1.92
    A15 |  char | yes | inter |   2048 |   1707 | 0.83 ||  4.00 |  2383328 ||  40422.45 |  120.75 |  100.65 |   271.37 | 00h00'40 ||   800.00 |  0.6594 |   26.65 |     0.00 |  0.0198 |    0.80 |  0.0509 |    2.06
    A15 |  char | yes | inter |   4096 |   3413 | 0.83 ||  4.00 |  1038848 ||  40208.37 |  105.83 |   88.18 |   619.28 | 00h00'40 ||   800.00 |  0.6850 |   27.54 |     0.00 |  0.0197 |    0.79 |  0.0510 |    2.05
    A15 |  char | yes | inter |   8192 |   6827 | 0.83 ||  4.00 |   480272 ||  40598.17 |   96.91 |   80.76 |  1352.51 | 00h00'40 ||   800.00 |  0.6838 |   27.76 |     0.00 |  0.0198 |    0.80 |  0.0511 |    2.08
    A15 |  char | yes | inter |  16384 |  13653 | 0.83 ||  4.00 |   214064 ||  41734.22 |   84.04 |   70.03 |  3119.38 | 00h00'41 ||   800.00 |  0.6788 |   28.33 |     0.00 |  0.0198 |    0.83 |  0.0521 |    2.17
    A15 |  char | yes | inter |  32768 |  27307 | 0.83 ||  4.00 |    92992 ||  41356.50 |   73.68 |   61.40 |  7115.71 | 00h00'41 ||   800.00 |  0.6568 |   27.16 |     0.00 |  0.0197 |    0.82 |  0.0676 |    2.80
    A15 |  char | yes | inter |  65536 |  54613 | 0.83 ||  4.00 |    32256 ||  38462.76 |   54.96 |   45.80 | 19078.75 | 00h00'39 ||   800.00 |  0.6127 |   23.57 |     0.00 |  0.0198 |    0.76 |  0.0975 |    3.75
    A15 |  char | yes | inter |   262144 |  218453 | 0.83 ||  4.00 |     7500 ||  41416.72 |   47.47 |   39.56 | 88355.67 | 00h00'44 ||   800.00 |  0.6221 |   25.77 |     0.00 |  0.0198 |    0.82 |  0.1198 |    4.96
    A15 |  char | yes | inter |   524288 |  436907 | 0.83 ||  4.00 |     3500 ||  43692.83 |   42.00 |   35.00 | 199738.64 | 00h00'50 ||   800.00 |  0.6183 |   27.01 |     0.00 |  0.0199 |    0.87 |  0.1263 |    5.52
    A15 |  char | yes | inter |  1048576 |  873813 | 0.83 ||  4.00 |     1750 ||  46887.90 |   39.14 |   32.61 | 428689.41 | 00h00'59 ||   800.00 |  0.6108 |   28.64 |     0.00 |  0.0199 |    0.93 |  0.1335 |    6.26
#---------
#---------
