# -> Seq 8-bit, rate 1/2, no gen:
# ------|-------|-----|-------|----------|---------|------||-------|----------||-----------|---------|---------|----------|----------||----------|---------|---------|----------|---------|---------|---------|---------|
#  PROC |  TYPE | GEN |   VEC |        N |       K |    R ||   SNR |      FRA || LD+ST+DEC |    CTHR |    ITHR |  LATENCY | RUNTIME  || BIG FREQ | BIG POW | BIG ENE | LIT FREQ | LIT POW | LIT ENE | RAM POW | RAM ENE |
#       |       |     |       |          |         |      ||  (dB) |          ||      (ms) |  (Mb/s) |  (Mb/s) |     (us) | (hhmmss) ||    (Mhz) |     (W) |     (J) |    (Mhz) |     (W) |     (J) |     (W) |     (J) |
# ------|-------|-----|-------|----------|---------|------||-------|----------||-----------|---------|---------|----------|----------||----------|---------|---------|----------|---------|---------|---------|---------|
    A07 |  char |  no |   seq |     4096 |    2048 | 0.50 ||  2.50 |   106522 ||  68400.64 |    6.38 |    3.19 |   642.13 | 00h01'08 ||     0.00 |  0.0152 |    1.04 |   450.00 |  0.1239 |    8.48 |  0.0523 |    3.58
    A07 |  char |  no |   seq |  1048576 |  524288 | 0.50 ||  2.50 |      300 ||  85476.32 |    3.68 |    1.84 | 284921.06 | 00h01'48 ||     0.00 |  0.0152 |    1.30 |   450.00 |  0.1151 |    9.84 |  0.0676 |    5.77
#---------
#---------
# -> Seq 8-bit, rate 1/2, gen:
# ------|-------|-----|-------|----------|---------|------||-------|----------||-----------|---------|---------|----------|----------||----------|---------|---------|----------|---------|---------|---------|---------|
#  PROC |  TYPE | GEN |   VEC |        N |       K |    R ||   SNR |      FRA || LD+ST+DEC |    CTHR |    ITHR |  LATENCY | RUNTIME  || BIG FREQ | BIG POW | BIG ENE | LIT FREQ | LIT POW | LIT ENE | RAM POW | RAM ENE |
#       |       |     |       |          |         |      ||  (dB) |          ||      (ms) |  (Mb/s) |  (Mb/s) |     (us) | (hhmmss) ||    (Mhz) |     (W) |     (J) |    (Mhz) |     (W) |     (J) |     (W) |     (J) |
# ------|-------|-----|-------|----------|---------|------||-------|----------||-----------|---------|---------|----------|----------||----------|---------|---------|----------|---------|---------|---------|---------|
    A07 |  char | yes |   seq |     4096 |    2048 | 0.50 ||  2.50 |    92647 ||  66013.41 |    5.75 |    2.87 |   712.53 | 00h01'06 ||     0.00 |  0.0152 |    1.00 |   450.00 |  0.1209 |    7.98 |  0.0517 |    3.41
    A07 |  char | yes |   seq |  1048576 |  524288 | 0.50 ||  2.50 |      300 ||  96851.83 |    3.25 |    1.62 | 322839.44 | 00h01'37 ||     0.00 |  0.0152 |    1.47 |   450.00 |  0.1200 |   11.63 |  0.0677 |    6.56
#---------
#---------
# -> Intra-SIMD 8-bit, rate 1/2, no gen:
# ------|-------|-----|-------|----------|---------|------||-------|----------||-----------|---------|---------|----------|----------||----------|---------|---------|----------|---------|---------|---------|---------|
#  PROC |  TYPE | GEN |   VEC |        N |       K |    R ||   SNR |      FRA || LD+ST+DEC |    CTHR |    ITHR |  LATENCY | RUNTIME  || BIG FREQ | BIG POW | BIG ENE | LIT FREQ | LIT POW | LIT ENE | RAM POW | RAM ENE |
#       |       |     |       |          |         |      ||  (dB) |          ||      (ms) |  (Mb/s) |  (Mb/s) |     (us) | (hhmmss) ||    (Mhz) |     (W) |     (J) |    (Mhz) |     (W) |     (J) |     (W) |     (J) |
# ------|-------|-----|-------|----------|---------|------||-------|----------||-----------|---------|---------|----------|----------||----------|---------|---------|----------|---------|---------|---------|---------|
    A07 |  char |  no | intra |     4096 |    2048 | 0.50 ||  2.50 |   419152 ||  68128.04 |   25.20 |   12.60 |   162.54 | 00h01'08 ||     0.00 |  0.0152 |    1.04 |   450.00 |  0.1230 |    8.38 |  0.0593 |    4.04
    A07 |  char |  no | intra |  1048576 |  524288 | 0.50 ||  2.50 |     1750 || 125395.12 |   14.63 |    7.32 | 71654.35 | 00h02'28 ||     0.00 |  0.0153 |    1.91 |   450.00 |  0.1155 |   14.48 |  0.0910 |   11.41
#---------
#---------
# -> Intra-SIMD 8-bit, rate 1/2, gen:
# ------|-------|-----|-------|----------|---------|------||-------|----------||-----------|---------|---------|----------|----------||----------|---------|---------|----------|---------|---------|---------|---------|
#  PROC |  TYPE | GEN |   VEC |        N |       K |    R ||   SNR |      FRA || LD+ST+DEC |    CTHR |    ITHR |  LATENCY | RUNTIME  || BIG FREQ | BIG POW | BIG ENE | LIT FREQ | LIT POW | LIT ENE | RAM POW | RAM ENE |
#       |       |     |       |          |         |      ||  (dB) |          ||      (ms) |  (Mb/s) |  (Mb/s) |     (us) | (hhmmss) ||    (Mhz) |     (W) |     (J) |    (Mhz) |     (W) |     (J) |     (W) |     (J) |
# ------|-------|-----|-------|----------|---------|------||-------|----------||-----------|---------|---------|----------|----------||----------|---------|---------|----------|---------|---------|---------|---------|
    A07 |  char | yes | intra |     4096 |    2048 | 0.50 ||  2.50 |   489617 ||  61213.32 |   32.76 |   16.38 |   125.02 | 00h01'01 ||     0.00 |  0.0152 |    0.93 |   450.00 |  0.1246 |    7.62 |  0.0579 |    3.54
    A07 |  char | yes | intra |  1048576 |  524288 | 0.50 ||  2.50 |     1750 || 122850.98 |   14.94 |    7.47 | 70200.55 | 00h02'03 ||     0.00 |  0.0154 |    1.89 |   450.00 |  0.1125 |   13.82 |  0.0956 |   11.74
#---------
#---------
# -> Inter-SIMD 8-bit, rate 1/2, no gen:
# ------|-------|-----|-------|----------|---------|------||-------|----------||-----------|---------|---------|----------|----------||----------|---------|---------|----------|---------|---------|---------|---------|
#  PROC |  TYPE | GEN |   VEC |        N |       K |    R ||   SNR |      FRA || LD+ST+DEC |    CTHR |    ITHR |  LATENCY | RUNTIME  || BIG FREQ | BIG POW | BIG ENE | LIT FREQ | LIT POW | LIT ENE | RAM POW | RAM ENE |
#       |       |     |       |          |         |      ||  (dB) |          ||      (ms) |  (Mb/s) |  (Mb/s) |     (us) | (hhmmss) ||    (Mhz) |     (W) |     (J) |    (Mhz) |     (W) |     (J) |     (W) |     (J) |
# ------|-------|-----|-------|----------|---------|------||-------|----------||-----------|---------|---------|----------|----------||----------|---------|---------|----------|---------|---------|---------|---------|
    A07 |  char |  no | inter |     4096 |    2048 | 0.50 ||  2.50 |   885920 ||  83118.96 |   43.66 |   21.83 |  1501.16 | 00h01'23 ||     0.00 |  0.0153 |    1.27 |   450.00 |  0.1308 |   10.87 |  0.0642 |    5.34
    A07 |  char |  no | inter |  1048576 |  524288 | 0.50 ||  2.50 |     1750 || 133746.92 |   13.72 |    6.86 | 1222829.00 | 00h02'50 ||     0.00 |  0.0157 |    2.10 |   450.00 |  0.1065 |   14.24 |  0.1009 |   13.49
#---------
#---------
# -> inter-SIMD 8-bit, rate 1/2, gen:
# ------|-------|-----|-------|----------|---------|------||-------|----------||-----------|---------|---------|----------|----------||----------|---------|---------|----------|---------|---------|---------|---------|
#  PROC |  TYPE | GEN |   VEC |        N |       K |    R ||   SNR |      FRA || LD+ST+DEC |    CTHR |    ITHR |  LATENCY | RUNTIME  || BIG FREQ | BIG POW | BIG ENE | LIT FREQ | LIT POW | LIT ENE | RAM POW | RAM ENE |
#       |       |     |       |          |         |      ||  (dB) |          ||      (ms) |  (Mb/s) |  (Mb/s) |     (us) | (hhmmss) ||    (Mhz) |     (W) |     (J) |    (Mhz) |     (W) |     (J) |     (W) |     (J) |
# ------|-------|-----|-------|----------|---------|------||-------|----------||-----------|---------|---------|----------|----------||----------|---------|---------|----------|---------|---------|---------|---------|
    A07 |  char | yes | inter |     4096 |    2048 | 0.50 ||  2.50 |   963264 ||  95192.69 |   41.45 |   20.72 |  1581.17 | 00h01'35 ||     0.00 |  0.0155 |    1.48 |   450.00 |  0.1259 |   11.98 |  0.0739 |    7.03
    A07 |  char | yes | inter |  1048576 |  524288 | 0.50 ||  2.50 |     1750 || 130554.59 |   14.06 |    7.03 | 1193642.00 | 00h02'24 ||     0.00 |  0.0160 |    2.08 |   450.00 |  0.1050 |   13.70 |  0.1025 |   13.38
#---------
#---------
