
"float (ref.) dyn."
# ------|----------|----------|----------|----------|----------||------|-------|------|---------|---------|----------||----------|----------
#   SNR |      FRA |       BE |       FE |      BER |      FER ||   LD |   DEC |   ST |    CTHR |    ITHR |  LATENCY || SIM_CTHR |    ET/RT 
#  (dB) |          |          |          |          |          ||  (%) |   (%) |  (%) |  (Mb/s) |  (Mb/s) |     (us) ||   (Mb/s) | (hhmmss) 
# ------|----------|----------|----------|----------|----------||------|-------|------|---------|---------|----------||----------|----------
#  2.00 |      352 |   719005 |      352 | 7.48e-02 | 1.00e+00 || 18.4 |  63.3 | 18.2 |   37.28 |   31.07 |  3515.91 ||    32.16 | 00h00'00  
#  2.10 |      352 |   703418 |      352 | 7.32e-02 | 1.00e+00 || 18.7 |  64.5 | 16.7 |   34.38 |   28.65 |  3812.78 ||    36.47 | 00h00'00  
#  2.20 |      352 |   687809 |      352 | 7.16e-02 | 1.00e+00 || 20.9 |  62.4 | 16.7 |   27.61 |   23.01 |  4748.00 ||    36.17 | 00h00'00  
#  2.30 |      352 |   670671 |      352 | 6.98e-02 | 1.00e+00 || 19.2 |  64.3 | 16.5 |   34.85 |   29.04 |  3761.18 ||    36.55 | 00h00'00  
#  2.40 |      352 |   649032 |      352 | 6.75e-02 | 1.00e+00 || 17.4 |  64.6 | 18.0 |   35.49 |   29.58 |  3692.91 ||    35.70 | 00h00'00  
#  2.50 |      352 |   621674 |      352 | 6.47e-02 | 1.00e+00 || 22.2 |  60.4 | 17.4 |   32.61 |   27.18 |  4019.42 ||    36.79 | 00h00'00  
   2.60 |      352 |   581576 |      352 | 6.05e-02 | 1.00e+00 || 16.3 |  67.0 | 16.7 |   35.14 |   29.29 |  3729.54 ||    35.09 | 00h00'00  
#  2.70 |      348 |   483285 |      348 | 5.09e-02 | 1.00e+00 || 17.9 |  65.3 | 16.9 |   37.13 |   30.94 |  3529.99 ||    34.76 | 00h00'00  
   2.80 |      352 |   371659 |      345 | 3.87e-02 | 9.80e-01 || 21.0 |  62.6 | 16.4 |   35.22 |   29.35 |  3721.62 ||    34.35 | 00h00'00  
#  2.90 |      368 |   271706 |      324 | 2.70e-02 | 8.80e-01 || 17.3 |  65.5 | 17.2 |   39.03 |   32.52 |  3358.47 ||    37.57 | 00h00'00  
   3.00 |      444 |   169323 |      251 | 1.40e-02 | 5.65e-01 || 16.7 |  66.1 | 17.1 |   43.39 |   36.16 |  3021.05 ||    42.11 | 00h00'00  
#  3.10 |      520 |    79955 |      175 | 5.63e-03 | 3.37e-01 || 18.6 |  64.7 | 16.7 |   38.27 |   31.89 |  3425.34 ||    49.44 | 00h00'00  
   3.20 |     1180 |    48836 |      136 | 1.52e-03 | 1.15e-01 || 21.0 |  62.7 | 16.3 |   35.14 |   29.28 |  3730.33 ||   101.34 | 00h00'00  
#  3.30 |     2396 |    31246 |      117 | 4.78e-04 | 4.88e-02 || 16.4 |  66.4 | 17.2 |   40.14 |   33.45 |  3265.30 ||   161.86 | 00h00'00  
   3.40 |     7880 |    23592 |      105 | 1.10e-04 | 1.33e-02 || 15.4 |  67.0 | 17.6 |   43.22 |   36.02 |  3032.35 ||   281.32 | 00h00'00  
#  3.50 |    27772 |    21853 |      101 | 2.88e-05 | 3.64e-03 || 16.5 |  66.6 | 16.9 |   39.92 |   33.27 |  3283.40 ||   360.56 | 00h00'02  
   3.60 |    90044 |    17199 |      101 | 6.99e-06 | 1.12e-03 || 15.7 |  67.4 | 16.8 |   41.55 |   34.63 |  3154.57 ||   406.01 | 00h00'07  
#  3.70 |   330228 |    14766 |      100 | 1.64e-06 | 3.03e-04 || 15.9 |  66.7 | 17.4 |   41.72 |   34.77 |  3141.37 ||   417.37 | 00h00'25  
   3.80 |  1441652 |    14437 |      100 | 3.67e-07 | 6.94e-05 || 16.2 |  67.2 | 16.7 |   41.45 |   34.54 |  3162.15 ||   423.13 | 00h01'51  
#  3.90 |  7610156 |    19560 |      100 | 9.41e-08 | 1.31e-05 || 15.6 |  67.4 | 17.0 |   41.83 |   34.86 |  3133.61 ||   423.62 | 00h09'48  
   4.00 | 44455968 |    17745 |      100 | 1.46e-08 | 2.25e-06 || 15.4 |  67.5 | 17.1 |   42.33 |   35.27 |  3096.61 ||   423.31 | 00h57'21 


"int-8 Q_{6,1} dyn."
# ------|----------|----------|----------|----------|----------||------|-------|------|---------|---------|----------||----------|----------
#   SNR |      FRA |       BE |       FE |      BER |      FER ||   LD |   DEC |   ST |    CTHR |    ITHR |  LATENCY || SIM_CTHR |    ET/RT 
#  (dB) |          |          |          |          |          ||  (%) |   (%) |  (%) |  (Mb/s) |  (Mb/s) |     (us) ||   (Mb/s) | (hhmmss) 
# ------|----------|----------|----------|----------|----------||------|-------|------|---------|---------|----------||----------|----------  
   2.60 |          |          |          | 1.00e+00 | 1.00e+00 ||


"float (ref.) gen."
# ------|----------|----------|----------|----------|----------||------|-------|------|---------|---------|----------||----------|----------
#   SNR |      FRA |       BE |       FE |      BER |      FER ||   LD |   DEC |   ST |    CTHR |    ITHR |  LATENCY || SIM_CTHR |    ET/RT 
#  (dB) |          |          |          |          |          ||  (%) |   (%) |  (%) |  (Mb/s) |  (Mb/s) |     (us) ||   (Mb/s) | (hhmmss) 
# ------|----------|----------|----------|----------|----------||------|-------|------|---------|---------|----------||----------|----------
#  2.00 |      296 |   621423 |      296 | 7.69e-02 | 1.00e+00 || 13.6 |  72.2 | 14.2 |   36.78 |   30.65 |  3563.44 ||   127.24 | 00h00'00  
#  2.10 |      232 |   477046 |      232 | 7.53e-02 | 1.00e+00 || 13.0 |  72.9 | 14.1 |   39.92 |   33.27 |  3283.00 ||   101.44 | 00h00'00  
#  2.20 |      272 |   547992 |      272 | 7.38e-02 | 1.00e+00 || 13.1 |  72.8 | 14.1 |   38.61 |   32.18 |  3394.37 ||   116.91 | 00h00'00  
#  2.30 |      228 |   450854 |      228 | 7.24e-02 | 1.00e+00 || 14.2 |  71.7 | 14.1 |   40.15 |   33.46 |  3264.67 ||   100.07 | 00h00'00  
#  2.40 |      292 |   564975 |      292 | 7.09e-02 | 1.00e+00 || 12.1 |  73.2 | 14.6 |   37.59 |   31.33 |  3486.49 ||   126.38 | 00h00'00  
#  2.50 |      268 |   508421 |      268 | 6.95e-02 | 1.00e+00 || 12.6 |  73.0 | 14.4 |   40.68 |   33.90 |  3221.93 ||   119.47 | 00h00'00  
   2.60 |      300 |   555323 |      300 | 6.78e-02 | 1.00e+00 || 13.0 |  72.9 | 14.1 |   36.82 |   30.68 |  3560.19 ||   132.90 | 00h00'00  
#  2.70 |      248 |   449429 |      248 | 6.64e-02 | 1.00e+00 || 12.2 |  73.6 | 14.2 |   40.33 |   33.61 |  3249.90 ||   108.29 | 00h00'00  
   2.80 |      264 |   467043 |      264 | 6.48e-02 | 1.00e+00 || 13.1 |  72.9 | 13.9 |   38.67 |   32.22 |  3389.90 ||   113.06 | 00h00'00  
#  2.90 |      292 |   498571 |      292 | 6.25e-02 | 1.00e+00 || 12.7 |  73.3 | 14.0 |   37.41 |   31.18 |  3503.50 ||   124.69 | 00h00'00  
   3.00 |      312 |   497670 |      310 | 5.84e-02 | 9.94e-01 || 12.7 |  74.6 | 12.7 |   32.61 |   27.17 |  4019.48 ||   133.01 | 00h00'00  
#  3.10 |      292 |   385931 |      262 | 4.84e-02 | 8.97e-01 || 11.8 |  75.7 | 12.5 |   33.70 |   28.09 |  3888.98 ||   125.47 | 00h00'00  
   3.20 |      372 |   306028 |      248 | 3.01e-02 | 6.67e-01 || 13.5 |  72.8 | 13.7 |   36.74 |   30.62 |  3567.28 ||   158.56 | 00h00'00  
#  3.30 |      432 |   174127 |      153 | 1.48e-02 | 3.54e-01 || 12.2 |  75.4 | 12.4 |   32.94 |   27.45 |  3979.36 ||   152.90 | 00h00'00  
   3.40 |      920 |   120562 |      133 | 4.80e-03 | 1.45e-01 || 13.2 |  71.5 | 15.3 |   41.11 |   34.26 |  3188.57 ||   228.60 | 00h00'00  
#  3.50 |     3196 |    85680 |      109 | 9.82e-04 | 3.41e-02 || 15.7 |  69.3 | 15.0 |   36.49 |   30.41 |  3591.95 ||   322.46 | 00h00'00  
   3.60 |    15472 |    71968 |      104 | 1.70e-04 | 6.72e-03 || 15.8 |  71.3 | 12.9 |   30.13 |   25.11 |  4350.29 ||   374.63 | 00h00'01  
#  3.70 |    92472 |    56386 |      100 | 2.23e-05 | 1.08e-03 || 16.0 |  71.1 | 12.9 |   31.65 |   26.37 |  4141.37 ||   397.29 | 00h00'07  
   3.80 |   643072 |    46960 |      100 | 2.67e-06 | 1.56e-04 || 15.8 |  71.8 | 12.4 |   30.49 |   25.41 |  4298.37 ||   395.27 | 00h00'53  
#  3.90 |  4421676 |    32313 |      100 | 2.68e-07 | 2.26e-05 || 16.1 |  71.4 | 12.4 |   29.77 |   24.81 |  4402.33 ||   393.90 | 00h06'07  
   4.00 | 35046584 |    14858 |      100 | 1.55e-08 | 2.85e-06 || 15.7 |  71.4 | 12.9 |   30.54 |   25.45 |  4291.49 ||   394.56 | 00h48'30
#  4.10 | 2.47e+08 |     4630 |      100 | 6.85e-10 | 4.04e-07 || 15.9 |  71.9 | 12.2 |   29.85 |   24.88 |  4390.84 ||   394.41 | 05h42'30


"int-8 Q_{6,1} gen."
# ------|----------|----------|----------|----------|----------||------|-------|------|---------|---------|----------||----------|----------
#   SNR |      FRA |       BE |       FE |      BER |      FER ||   LD |   DEC |   ST |    CTHR |    ITHR |  LATENCY || SIM_CTHR |    ET/RT 
#  (dB) |          |          |          |          |          ||  (%) |   (%) |  (%) |  (Mb/s) |  (Mb/s) |     (us) ||   (Mb/s) | (hhmmss) 
# ------|----------|----------|----------|----------|----------||------|-------|------|---------|---------|----------||----------|----------
   2.60 |          |          |          | 1.00e+00 | 1.00e+00 ||

