PROC,TYPE,GEN,VEC,N,K,R,SNR (dB),FRA,LD+ST+DEC (ms),CTHR (Mbit/s),ITHR (Mbit/s),LATENCY (us),CLU_FREQ (MHz),CLU_POW (W),CLU_ENE (J),RAM_POW (W),RAM_ENE (J),EB_CLU (nJ),EB_CLU_RAM (nJ),TB_CLU (ns)
,,,,,,,,,,,,,,,,,,,,
A57,char,no,seq,128,64,0.50,2.50,1332899,6093.89,28.00,14.00,4.57,1100.00,0.7525,4.59,0.0000,0.00,53.733203125,53.733203125,71.40625
A57,char,no,seq,256,128,0.50,2.50,1048729,9958.03,26.96,13.48,9.50,1100.00,0.7404,7.37,0.0000,0.00,54.9515625,54.9515625,74.21875
A57,char,no,seq,512,256,0.50,2.50,699036,14721.14,24.31,12.16,21.06,1100.00,0.7340,10.81,0.0000,0.00,60.38296875,60.38296875,82.265625
A57,char,no,seq,1024,512,0.50,2.50,399077,18946.32,21.57,10.78,47.48,1100.00,0.7308,13.85,0.0000,0.00,67.77028125,67.77028125,92.734375
A57,char,no,seq,2048,1024,0.50,2.50,213346,22085.06,19.78,9.89,103.52,1100.00,0.7388,16.32,0.0000,0.00,74.6880625,74.6880625,101.09375
A57,char,no,seq,4096,2048,0.50,2.50,106522,23624.32,18.47,9.23,221.78,1100.00,0.7289,17.22,0.0000,0.00,78.9333212890625,78.9333212890625,108.291015625
A57,char,no,seq,8192,4096,0.50,2.50,52362,24694.20,17.37,8.69,471.61,1100.00,0.7576,18.71,0.0000,0.00,87.229427734375,87.229427734375,115.13916015625
A57,char,no,seq,16384,8192,0.50,2.50,24703,25426.67,15.92,7.96,1029.29,1100.00,0.7628,19.40,0.0000,0.00,95.8425795898438,95.8425795898438,125.645751953125
A57,char,no,seq,32768,16384,0.50,2.50,11635,25814.73,14.77,7.38,2218.71,1100.00,0.7699,19.88,0.0000,0.00,104.259327941895,104.259327941895,135.419311523438
A57,char,no,seq,65536,32768,0.50,2.50,5560,25938.27,14.05,7.02,4665.16,1100.00,0.7795,20.22,0.0000,0.00,110.976935424805,110.976935424805,142.369384765625
A57,char,no,seq,131072,65536,0.50,2.50,2500,25842.20,12.68,6.34,10336.88,1100.00,0.7735,19.99,0.0000,0.00,122.002817993164,122.002817993164,157.728271484375
A57,char,no,seq,262144,131072,0.50,2.50,1250,33158.44,9.88,4.94,26526.75,1100.00,0.7281,24.14,0.0000,0.00,147.355092430115,147.355092430115,202.383041381836
A57,char,no,seq,524288,262144,0.50,2.50,625,35901.85,9.13,4.56,57442.96,1100.00,0.7197,25.84,0.0000,0.00,157.70606350708,157.70606350708,219.127502441406
A57,char,no,seq,1048576,524288,0.50,2.50,300,38356.98,8.20,4.10,127856.60,1100.00,0.7153,27.44,0.0000,0.00,174.438144645691,174.438144645691,243.867111206055
,,,,,,,,,,,,,,,,,,,,
A57,char,no,seq,128,107,0.83,4.00,1453651,4846.28,38.39,32.09,3.33,1100.00,0.7357,3.57,0.0000,0.00,22.8960841121495,22.8960841121495,31.1214953271028
A57,char,no,seq,256,213,0.83,4.00,1102321,9394.15,30.04,24.99,8.52,1100.00,0.7430,6.98,0.0000,0.00,29.72,29.72,40
A57,char,no,seq,512,427,0.83,4.00,752754,14058.80,27.41,22.86,18.68,1100.00,0.7310,10.28,0.0000,0.00,31.9791100702576,31.9791100702576,43.7470725995316
A57,char,no,seq,1024,853,0.83,4.00,457183,18077.48,25.90,21.57,39.54,1100.00,0.7314,13.22,0.0000,0.00,33.9033481828839,33.9033481828839,46.3540445486518
A57,char,no,seq,2048,1707,0.83,4.00,238931,21476.15,22.78,18.99,89.88,1100.00,0.7288,15.65,0.0000,0.00,38.3740738137083,38.3740738137083,52.6537785588752
A57,char,no,seq,4096,3413,0.83,4.00,118322,23839.57,20.33,16.94,201.48,1100.00,0.7308,17.42,0.0000,0.00,43.1413958394374,43.1413958394374,59.0331087020217
A57,char,no,seq,8192,6827,0.83,4.00,57604,26492.82,17.81,14.84,459.91,1100.00,0.7402,19.61,0.0000,0.00,49.8645645232166,49.8645645232166,67.3663395342024
A57,char,no,seq,16384,13653,0.83,4.00,27305,25540.89,17.52,14.60,935.39,1100.00,0.7588,19.38,0.0000,0.00,51.9866646158354,51.9866646158354,68.5116824141214
A57,char,no,seq,32768,27307,0.83,4.00,12609,26873.58,15.37,12.81,2131.30,1100.00,0.7424,19.95,0.0000,0.00,57.9440114256418,57.9440114256418,78.0495843556597
A57,char,no,seq,65536,54613,0.83,4.00,5896,26007.14,14.86,12.38,4410.98,1100.00,0.7727,20.09,0.0000,0.00,62.4093942101697,62.4093942101697,80.7679490231263
A57,char,no,seq,131072,109227,0.83,4.00,2500,25172.46,13.02,10.85,10068.98,1100.00,0.7584,19.09,0.0000,0.00,69.9123333241781,69.9123333241781,92.183983813526
A57,char,no,seq,262144,218453,0.83,4.00,1250,31617.19,10.36,8.64,25293.75,1100.00,0.7186,22.72,0.0000,0.00,83.2036582239658,83.2036582239658,115.785775429955
A57,char,no,seq,524288,436907,0.83,4.00,625,32193.54,10.18,8.48,51509.66,1100.00,0.7372,23.73,0.0000,0.00,86.9130532401632,86.9130532401632,117.896165545528
A57,char,no,seq,1048576,873813,0.83,4.00,300,38053.77,8.27,6.89,126845.89,1100.00,0.7066,26.89,0.0000,0.00,102.572639539581,102.572639539581,145.163656297171
,,,,,,,,,,,,,,,,,,,,
A57,char,yes,seq,128,64,0.50,2.50,1372446,5038.01,34.87,17.43,3.67,1100.00,0.7646,3.85,0.0000,0.00,43.84503125,43.84503125,57.34375
A57,char,yes,seq,256,128,0.50,2.50,1039196,8332.14,31.93,15.96,8.02,1100.00,0.7575,6.31,0.0000,0.00,47.462109375,47.462109375,62.65625
A57,char,yes,seq,512,256,0.50,2.50,672044,11931.25,28.84,14.42,17.75,1100.00,0.7635,9.11,0.0000,0.00,52.93798828125,52.93798828125,69.3359375
A57,char,yes,seq,1024,512,0.50,2.50,367136,15060.84,24.96,12.48,41.02,1100.00,0.7624,11.48,0.0000,0.00,61.08134375,61.08134375,80.1171875
A57,char,yes,seq,2048,1024,0.50,2.50,185879,16711.83,22.78,11.39,89.91,1100.00,0.7631,12.75,0.0000,0.00,67.0022666015625,67.0022666015625,87.802734375
A57,char,yes,seq,4096,2048,0.50,2.50,92647,18360.03,20.67,10.33,198.17,1100.00,0.7752,14.23,0.0000,0.00,75.01044140625,75.01044140625,96.7626953125
A57,char,yes,seq,8192,4096,0.50,2.50,44280,18976.29,19.12,9.56,428.55,1100.00,0.7894,14.98,0.0000,0.00,82.5921313476562,82.5921313476562,104.62646484375
A57,char,yes,seq,16384,8192,0.50,2.50,20875,19634.68,17.42,8.71,940.58,1100.00,0.7954,15.62,0.0000,0.00,91.3253579101563,91.3253579101563,114.81689453125
A57,char,yes,seq,32768,16384,0.50,2.50,9828,19865.40,16.21,8.11,2021.31,1100.00,0.8055,16.00,0.0000,0.00,99.3753176879883,99.3753176879883,123.370971679688
A57,char,yes,seq,65536,32768,0.50,2.50,4714,20073.02,15.39,7.70,4258.17,1100.00,0.8065,16.19,0.0000,0.00,104.803897247314,104.803897247314,129.949035644531
A57,char,yes,seq,131072,65536,0.50,2.50,2500,23469.41,13.96,6.98,9387.76,1100.00,0.8056,18.91,0.0000,0.00,115.398856445313,115.398856445313,143.245849609375
A57,char,yes,seq,262144,131072,0.50,2.50,1250,31237.27,10.49,5.25,24989.82,1100.00,0.7545,23.57,0.0000,0.00,143.850854415894,143.850854415894,190.657196044922
A57,char,yes,seq,524288,262144,0.50,2.50,625,34765.61,9.43,4.71,55624.96,1100.00,0.7378,25.65,0.0000,0.00,156.555540039062,156.555540039062,212.1923828125
A57,char,yes,seq,1048576,524288,0.50,2.50,300,34094.21,9.23,4.61,113647.36,1100.00,0.7450,25.40,0.0000,0.00,161.490026855469,161.490026855469,216.76513671875
,,,,,,,,,,,,,,,,,,,,
A57,char,yes,seq,128,107,0.83,4.00,1468511,4171.63,45.06,37.67,2.84,1100.00,0.7551,3.15,0.0000,0.00,20.0419065420561,20.0419065420561,26.5420560747664
A57,char,yes,seq,256,213,0.83,4.00,1089749,7997.86,34.88,29.02,7.34,1100.00,0.7608,6.08,0.0000,0.00,26.2172394366197,26.2172394366197,34.4600938967136
A57,char,yes,seq,512,427,0.83,4.00,718502,11410.72,32.24,26.89,15.88,1100.00,0.7639,8.72,0.0000,0.00,28.4092084309134,28.4092084309134,37.1896955503513
A57,char,yes,seq,1024,853,0.83,4.00,417855,14483.98,29.54,24.61,34.66,1100.00,0.7635,11.06,0.0000,0.00,31.0233411488863,31.0233411488863,40.6330597889801
A57,char,yes,seq,2048,1707,0.83,4.00,210135,16532.64,26.03,21.70,78.68,1100.00,0.7674,12.69,0.0000,0.00,35.3714305799649,35.3714305799649,46.0925600468658
A57,char,yes,seq,4096,3413,0.83,4.00,101774,18199.21,22.91,19.09,178.82,1100.00,0.7632,13.89,0.0000,0.00,39.9869393495459,39.9869393495459,52.3937884559039
A57,char,yes,seq,8192,6827,0.83,4.00,48800,18901.03,21.15,17.63,387.32,1100.00,0.7894,14.92,0.0000,0.00,44.7854706313168,44.7854706313168,56.7335579317416
A57,char,yes,seq,16384,13653,0.83,4.00,22830,19374.36,19.31,16.09,848.64,1100.00,0.7976,15.45,0.0000,0.00,49.5770353768403,49.5770353768403,62.1577675236212
A57,char,yes,seq,32768,27307,0.83,4.00,10570,19558.70,17.71,14.76,1850.40,1100.00,0.8021,15.69,0.0000,0.00,54.3525777273227,54.3525777273227,67.7628446918373
A57,char,yes,seq,65536,54613,0.83,4.00,4895,19660.53,16.32,13.60,4016.45,1100.00,0.8179,16.08,0.0000,0.00,60.1515107208906,60.1515107208906,73.5438448721
A57,char,yes,seq,131072,109227,0.83,4.00,2500,21429.88,15.29,12.74,8571.95,1100.00,0.8150,17.47,0.0000,0.00,63.9598199163211,63.9598199163211,78.4783066457927
A57,char,yes,seq,262144,218453,0.83,4.00,1250,29920.77,10.95,9.13,23936.62,1100.00,0.7474,22.36,0.0000,0.00,81.895097746426,81.895097746426,109.57331783038
A57,char,yes,seq,524288,436907,0.83,4.00,625,34560.04,9.48,7.90,55296.06,1100.00,0.7324,25.31,0.0000,0.00,92.6944048596154,92.6944048596154,126.562540769546
A57,char,yes,seq,1048576,873813,0.83,4.00,300,33170.77,9.48,7.90,110569.23,1100.00,0.7413,24.59,0.0000,0.00,93.8015000909806,93.8015000909806,126.536490072819
,,,,,,,,,,,,,,,,,,,,
A57,char,no,intra,128,64,0.50,2.50,1628908,3376.42,61.75,30.88,2.07,1100.00,0.8340,2.82,0.0000,0.00,26.9746875,26.9746875,32.34375
A57,char,no,intra,256,128,0.50,2.50,1482148,5320.29,71.32,35.66,3.59,1100.00,0.8118,4.32,0.0000,0.00,22.768453125,22.768453125,28.046875
A57,char,no,intra,512,256,0.50,2.50,1287237,8632.78,76.34,38.17,6.71,1100.00,0.8156,7.04,0.0000,0.00,21.377640625,21.377640625,26.2109375
A57,char,no,intra,1024,512,0.50,2.50,979960,13171.94,76.18,38.09,13.44,1100.00,0.8115,10.69,0.0000,0.00,21.301875,21.301875,26.25
A57,char,no,intra,2048,1024,0.50,2.50,657025,17419.35,77.25,38.62,26.51,1100.00,0.8143,14.18,0.0000,0.00,21.0811455078125,21.0811455078125,25.888671875
A57,char,no,intra,4096,2048,0.50,2.50,419152,21900.18,78.39,39.20,52.25,1100.00,0.8262,18.09,0.0000,0.00,21.0785888671875,21.0785888671875,25.5126953125
A57,char,no,intra,8192,4096,0.50,2.50,234743,24923.09,77.16,38.58,106.17,1100.00,0.8590,21.41,0.0000,0.00,22.2656323242187,22.2656323242187,25.92041015625
A57,char,no,intra,16384,8192,0.50,2.50,121493,26418.03,75.35,37.67,217.44,1100.00,0.8955,23.66,0.0000,0.00,23.769228515625,23.769228515625,26.54296875
A57,char,no,intra,32768,16384,0.50,2.50,61018,27258.70,73.35,36.68,446.73,1100.00,0.9014,24.57,0.0000,0.00,24.5777845458984,24.5777845458984,27.2662353515625
A57,char,no,intra,65536,32768,0.50,2.50,29966,26941.27,72.89,36.45,899.06,1100.00,0.9194,24.77,0.0000,0.00,25.2257008056641,25.2257008056641,27.4371337890625
A57,char,no,intra,131072,65536,0.50,2.50,15000,28516.74,68.94,34.47,1901.12,1100.00,0.9282,26.47,0.0000,0.00,26.9259580078125,26.9259580078125,29.0087890625
A57,char,no,intra,262144,131072,0.50,2.50,7000,28872.86,63.55,31.78,4124.69,1100.00,0.9101,26.28,0.0000,0.00,28.6398343582153,28.6398343582153,31.4688873291016
A57,char,no,intra,524288,262144,0.50,2.50,3500,30405.15,60.35,30.18,8687.18,1100.00,0.9105,27.68,0.0000,0.00,30.1730247116089,30.1730247116089,33.1389617919922
A57,char,no,intra,1048576,524288,0.50,2.50,1750,34210.75,53.64,26.82,19549.00,1100.00,0.8896,30.43,0.0000,0.00,33.1703002929687,33.1703002929687,37.2867584228516
,,,,,,,,,,,,,,,,,,,,
A57,char,no,intra,128,107,0.83,4.00,1739009,2211.20,100.67,84.15,1.27,1100.00,0.8206,1.81,0.0000,0.00,9.73983177570094,9.73983177570094,11.8691588785047
A57,char,no,intra,256,213,0.83,4.00,1549709,4469.26,88.77,73.86,2.88,1100.00,0.8065,3.60,0.0000,0.00,10.9047887323944,10.9047887323944,13.5211267605634
A57,char,no,intra,512,427,0.83,4.00,1373013,7391.74,95.10,79.32,5.38,1100.00,0.8146,6.02,0.0000,0.00,10.2635784543326,10.2635784543326,12.5995316159251
A57,char,no,intra,1024,853,0.83,4.00,1137199,11537.55,100.93,84.08,10.15,1100.00,0.8407,9.70,0.0000,0.00,10.0036400937866,10.0036400937866,11.8991793669402
A57,char,no,intra,2048,1707,0.83,4.00,788585,16498.91,97.89,81.59,20.92,1100.00,0.8286,13.67,0.0000,0.00,10.1548400702988,10.1548400702988,12.2554188635032
A57,char,no,intra,4096,3413,0.83,4.00,503777,21489.03,96.02,80.01,42.66,1100.00,0.8620,18.52,0.0000,0.00,10.7743685906827,10.7743685906827,12.4992675065924
A57,char,no,intra,8192,6827,0.83,4.00,290048,25215.96,94.23,78.53,86.94,1100.00,0.8915,22.48,0.0000,0.00,11.3530115717006,11.3530115717006,12.7347297495239
A57,char,no,intra,16384,13653,0.83,4.00,146841,26217.34,91.77,76.47,178.54,1100.00,0.9001,23.60,0.0000,0.00,11.7705891745404,11.7705891745404,13.0769794184428
A57,char,no,intra,32768,27307,0.83,4.00,73239,27390.98,87.62,73.01,373.99,1100.00,0.9168,25.11,0.0000,0.00,12.5562687955469,12.5562687955469,13.6957556670451
A57,char,no,intra,65536,54613,0.83,4.00,35138,27709.26,83.11,69.25,788.58,1100.00,0.9170,25.41,0.0000,0.00,13.2409473934777,13.2409473934777,14.4394191859081
A57,char,no,intra,131072,109227,0.83,4.00,15000,24157.05,81.39,67.82,1610.47,1100.00,0.9438,22.80,0.0000,0.00,13.9156214672196,13.9156214672196,14.7442482170159
A57,char,no,intra,262144,218453,0.83,4.00,7500,26879.43,73.14,60.95,3583.92,1100.00,0.9257,24.88,0.0000,0.00,15.1869497969815,15.1869497969815,16.4059088224927
A57,char,no,intra,524288,436907,0.83,4.00,3500,27098.77,67.72,56.43,7742.51,1100.00,0.9238,25.03,0.0000,0.00,16.3708311791754,16.3708311791754,17.7211855154529
A57,char,no,intra,1048576,873813,0.83,4.00,1750,30681.67,59.81,49.84,17532.38,1100.00,0.9009,27.64,0.0000,0.00,18.0758596427382,18.0758596427382,20.0642242676637
,,,,,,,,,,,,,,,,,,,,
A57,char,yes,intra,128,64,0.50,2.50,1698069,2808.82,77.38,38.69,1.65,1100.00,0.7000,1.97,0.0000,0.00,18.046875,18.046875,25.78125
A57,char,yes,intra,256,128,0.50,2.50,1572445,4583.96,87.82,43.91,2.92,1100.00,0.7104,3.26,0.0000,0.00,16.206,16.206,22.8125
A57,char,yes,intra,512,256,0.50,2.50,1381377,7398.70,95.59,47.80,5.36,1100.00,0.7236,5.35,0.0000,0.00,15.150375,15.150375,20.9375
A57,char,yes,intra,1024,512,0.50,2.50,1074590,11883.14,92.60,46.30,11.06,1100.00,0.7444,8.85,0.0000,0.00,16.080203125,16.080203125,21.6015625
A57,char,yes,intra,2048,1024,0.50,2.50,769737,16739.75,94.17,47.09,21.75,1100.00,0.7677,12.85,0.0000,0.00,16.3061279296875,16.3061279296875,21.240234375
A57,char,yes,intra,4096,2048,0.50,2.50,489617,21729.16,92.29,46.15,44.38,1100.00,0.7926,17.22,0.0000,0.00,17.175580078125,17.175580078125,21.669921875
A57,char,yes,intra,8192,4096,0.50,2.50,275797,25455.37,88.76,44.38,92.30,1100.00,0.8314,21.16,0.0000,0.00,18.7349169921875,18.7349169921875,22.5341796875
A57,char,yes,intra,16384,8192,0.50,2.50,142854,27863.47,84.00,42.00,195.05,1100.00,0.8605,23.98,0.0000,0.00,20.4883453369141,20.4883453369141,23.809814453125
A57,char,yes,intra,32768,16384,0.50,2.50,68860,27890.08,80.90,40.45,405.03,1100.00,0.8732,24.35,0.0000,0.00,21.5864377441406,21.5864377441406,24.7210693359375
A57,char,yes,intra,65536,32768,0.50,2.50,34752,28942.68,78.69,39.35,832.83,1100.00,0.8895,25.75,0.0000,0.00,22.607491607666,22.607491607666,25.4159545898438
A57,char,yes,intra,131072,65536,0.50,2.50,15000,26274.11,74.83,37.41,1751.61,1100.00,0.8984,23.61,0.0000,0.00,24.0119388427734,24.0119388427734,26.7274475097656
A57,char,yes,intra,262144,131072,0.50,2.50,7000,26892.19,68.24,34.12,3841.74,1100.00,0.8862,23.83,0.0000,0.00,25.9746550598145,25.9746550598145,29.3101501464844
A57,char,yes,intra,524288,262144,0.50,2.50,3500,29599.25,62.00,31.00,8456.93,1100.00,0.8710,25.78,0.0000,0.00,28.099006767273,28.099006767273,32.260627746582
A57,char,yes,intra,1048576,524288,0.50,2.50,1750,30980.74,59.23,29.62,17703.28,1100.00,0.8766,27.16,0.0000,0.00,29.5995621643066,29.5995621643066,33.7663269042969
,,,,,,,,,,,,,,,,,,,,
A57,char,yes,intra,128,107,0.83,4.00,1765946,1922.12,117.60,98.31,1.09,1100.00,0.7107,1.37,0.0000,0.00,7.23984112149533,7.23984112149533,10.1869158878505
A57,char,yes,intra,256,213,0.83,4.00,1622879,3796.03,109.45,91.06,2.34,1100.00,0.7305,2.77,0.0000,0.00,8.02521126760563,8.02521126760563,10.9859154929577
A57,char,yes,intra,512,427,0.83,4.00,1446105,6194.01,119.54,99.69,4.28,1100.00,0.7542,4.67,0.0000,0.00,7.55966276346604,7.55966276346604,10.0234192037471
A57,char,yes,intra,1024,853,0.83,4.00,1198370,10137.97,121.04,100.83,8.46,1100.00,0.7547,7.65,0.0000,0.00,7.48506682297773,7.48506682297773,9.9179366940211
A57,char,yes,intra,2048,1707,0.83,4.00,890666,15654.42,116.52,97.12,17.58,1100.00,0.7719,12.08,0.0000,0.00,7.94962038664323,7.94962038664323,10.298769771529
A57,char,yes,intra,4096,3413,0.83,4.00,561429,20943.90,109.80,91.49,37.30,1100.00,0.8128,17.02,0.0000,0.00,8.88292997363024,8.88292997363024,10.9288016407852
A57,char,yes,intra,8192,6827,0.83,4.00,321341,24548.54,107.23,89.37,76.39,1100.00,0.8576,21.05,0.0000,0.00,9.59602519408232,9.59602519408232,11.1893950490699
A57,char,yes,intra,16384,13653,0.83,4.00,170937,27608.39,101.44,84.53,161.51,1100.00,0.8732,24.11,0.0000,0.00,10.3296368563686,10.3296368563686,11.8296345125613
A57,char,yes,intra,32768,27307,0.83,4.00,79535,27536.75,94.64,78.87,346.22,1100.00,0.8923,24.57,0.0000,0.00,11.3132935144835,11.3132935144835,12.6788003076134
A57,char,yes,intra,65536,54613,0.83,4.00,39967,29164.75,89.81,74.84,729.72,1100.00,0.9031,26.34,0.0000,0.00,12.066909563657,12.066909563657,13.3616538186879
A57,char,yes,intra,131072,109227,0.83,4.00,15000,22703.91,86.60,72.16,1513.59,1100.00,0.9138,20.75,0.0000,0.00,12.6627898047186,12.6627898047186,13.8572880331786
A57,char,yes,intra,262144,218453,0.83,4.00,7500,25173.06,78.10,65.09,3356.41,1100.00,0.9066,22.82,0.0000,0.00,13.9294095572045,13.9294095572045,15.3644491034685
A57,char,yes,intra,524288,436907,0.83,4.00,3500,26796.68,68.48,57.07,7656.19,1100.00,0.8840,23.69,0.0000,0.00,15.490875541019,15.490875541019,17.5236148654061
A57,char,yes,intra,1048576,873813,0.83,4.00,1750,28032.90,65.46,54.55,16018.80,1100.00,0.8884,24.90,0.0000,0.00,16.2862098870124,16.2862098870124,18.3320687607074
,,,,,,,,,,,,,,,,,,,,
A57,char,no,inter,128,64,0.50,2.50,18706160,11725.31,204.21,102.10,10.03,1100.00,0.8414,9.87,0.0000,0.00,8.241447265625,8.241447265625,9.794921875
A57,char,no,inter,256,128,0.50,2.50,13180784,16996.71,198.53,99.26,20.63,1100.00,0.8923,15.17,0.0000,0.00,8.98835400390625,8.98835400390625,10.0732421875
A57,char,no,inter,512,256,0.50,2.50,8149008,22894.87,182.24,91.12,44.95,1100.00,0.9005,20.62,0.0000,0.00,9.88219604492187,9.88219604492187,10.97412109375
A57,char,no,inter,1024,512,0.50,2.50,3781824,24309.60,159.30,79.65,102.85,1100.00,0.8917,21.68,0.0000,0.00,11.1952325439453,11.1952325439453,12.554931640625
A57,char,no,inter,2048,1024,0.50,2.50,1895728,26662.59,145.61,72.81,225.03,1100.00,0.9259,24.69,0.0000,0.00,12.716996887207,12.716996887207,13.7347412109375
A57,char,no,inter,4096,2048,0.50,2.50,885920,27875.41,130.18,65.09,503.44,1100.00,0.9231,25.73,0.0000,0.00,14.1822956542969,14.1822956542969,15.36376953125
A57,char,no,inter,8192,4096,0.50,2.50,421488,28545.04,120.96,60.48,1083.59,1100.00,0.9345,26.68,0.0000,0.00,15.451276473999,15.451276473999,16.5342712402344
A57,char,no,inter,16384,8192,0.50,2.50,188736,28668.57,107.86,53.93,2430.36,1100.00,0.9177,26.31,0.0000,0.00,17.0161542663574,17.0161542663574,18.5421752929688
A57,char,no,inter,32768,16384,0.50,2.50,82496,26871.11,100.60,50.30,5211.62,1100.00,0.9172,24.65,0.0000,0.00,18.2346262512207,18.2346262512207,19.8807525634766
A57,char,no,inter,65536,32768,0.50,2.50,30624,23835.51,84.20,42.10,12453.25,1100.00,0.8713,20.77,0.0000,0.00,20.6957182407379,20.6957182407379,23.7526893615723
A57,char,no,inter,131072,65536,0.50,2.50,15000,26086.31,75.37,37.68,27825.40,1100.00,0.8526,22.24,0.0000,0.00,22.6249084854126,22.6249084854126,26.5363693237305
A57,char,no,inter,262144,131072,0.50,2.50,7000,25959.05,70.69,35.34,59334.98,1100.00,0.8636,22.42,0.0000,0.00,24.4339412345886,24.4339412345886,28.2931232452393
A57,char,no,inter,524288,262144,0.50,2.50,3500,26890.25,68.24,34.12,122926.87,1100.00,0.8748,23.52,0.0000,0.00,25.6386818590164,25.6386818590164,29.3080496788025
A57,char,no,inter,1048576,524288,0.50,2.50,1750,30545.98,60.07,30.04,279277.50,1100.00,0.8518,26.02,0.0000,0.00,28.3585279583931,28.3585279583931,33.2924723625183
,,,,,,,,,,,,,,,,,,,,
A57,char,no,inter,128,107,0.83,4.00,20592832,9296.52,283.53,237.02,7.22,1100.00,0.9054,8.42,0.0000,0.00,3.81833411214953,3.81833411214953,4.21728971962617
A57,char,no,inter,256,213,0.83,4.00,14286336,16619.38,220.06,183.10,18.61,1100.00,0.8471,14.08,0.0000,0.00,4.62574266431925,4.62574266431925,5.46068075117371
A57,char,no,inter,512,427,0.83,4.00,7631728,19368.22,201.75,168.25,40.61,1100.00,0.8910,17.26,0.0000,0.00,5.29618120608899,5.29618120608899,5.94408665105386
A57,char,no,inter,1024,853,0.83,4.00,4583760,24744.53,189.69,158.01,86.37,1100.00,0.9413,23.29,0.0000,0.00,5.9569226992966,5.9569226992966,6.32839976553341
A57,char,no,inter,2048,1707,0.83,4.00,2104272,26270.25,164.05,136.73,199.75,1100.00,0.9344,24.55,0.0000,0.00,6.83386057410662,6.83386057410662,7.31363503222027
A57,char,no,inter,4096,3413,0.83,4.00,961296,28310.46,139.08,115.89,471.20,1100.00,0.9273,26.25,0.0000,0.00,8.00146059185467,8.00146059185467,8.62877234104893
A57,char,no,inter,8192,6827,0.83,4.00,455600,28049.06,133.06,110.89,985.04,1100.00,0.9460,26.53,0.0000,0.00,8.53090522923685,8.53090522923685,9.01787022118061
A57,char,no,inter,16384,13653,0.83,4.00,207968,27858.47,122.31,101.92,2143.29,1100.00,0.9419,26.24,0.0000,0.00,9.2413977285212,9.2413977285212,9.81144254010108
A57,char,no,inter,32768,27307,0.83,4.00,86624,25534.05,111.17,92.64,4716.30,1100.00,0.9338,23.84,0.0000,0.00,10.0800182645476,10.0800182645476,10.7946222580291
A57,char,no,inter,65536,54613,0.83,4.00,31392,22674.00,90.73,75.61,11556.57,1100.00,0.8879,20.13,0.0000,0.00,11.7429441055701,11.7429441055701,13.2255255159028
A57,char,no,inter,131072,109227,0.83,4.00,15000,25264.03,77.82,64.85,26948.29,1100.00,0.8429,21.30,0.0000,0.00,12.9974237373772,12.9974237373772,15.4198881686762
A57,char,no,inter,262144,218453,0.83,4.00,7500,26544.90,74.07,61.72,56629.12,1100.00,0.8578,22.77,0.0000,0.00,13.8978576444361,13.8978576444361,16.2017459133086
A57,char,no,inter,524288,436907,0.83,4.00,3500,24414.32,75.16,62.63,111608.32,1100.00,0.9093,22.20,0.0000,0.00,14.5175983355726,14.5175983355726,15.9656860613357
A57,char,no,inter,1048576,873813,0.83,4.00,1750,25806.20,71.11,59.26,235942.41,1100.00,0.9114,23.52,0.0000,0.00,15.3807159307827,15.3807159307827,16.8759226802531
,,,,,,,,,,,,,,,,,,,,
A57,char,yes,inter,128,64,0.50,2.50,19644080,11278.83,222.93,111.47,9.19,1100.00,0.8338,9.40,0.0000,0.00,7.483029296875,7.483029296875,8.974609375
A57,char,yes,inter,256,128,0.50,2.50,14383232,17483.71,210.60,105.30,19.45,1100.00,0.8999,15.73,0.0000,0.00,8.54641357421875,8.54641357421875,9.4970703125
A57,char,yes,inter,512,256,0.50,2.50,9026992,23697.11,195.04,97.52,42.00,1100.00,0.8912,21.12,0.0000,0.00,9.13828125,9.13828125,10.25390625
A57,char,yes,inter,1024,512,0.50,2.50,4512336,27842.60,165.96,82.98,98.73,1100.00,0.9005,25.07,0.0000,0.00,10.8528277587891,10.8528277587891,12.052001953125
A57,char,yes,inter,2048,1024,0.50,2.50,2072400,28091.11,151.09,75.54,216.88,1100.00,0.9145,25.69,0.0000,0.00,12.1055151367188,12.1055151367188,13.2373046875
A57,char,yes,inter,4096,2048,0.50,2.50,963264,29692.43,132.88,66.44,493.20,1100.00,0.9183,27.27,0.0000,0.00,13.8215808105469,13.8215808105469,15.05126953125
A57,char,yes,inter,8192,4096,0.50,2.50,451024,29714.16,124.34,62.17,1054.10,1100.00,0.9312,27.67,0.0000,0.00,14.9776904296875,14.9776904296875,16.0842895507812
A57,char,yes,inter,16384,8192,0.50,2.50,198944,28366.26,114.91,57.45,2281.35,1100.00,0.9361,26.55,0.0000,0.00,16.2931193161011,16.2931193161011,17.4053192138672
A57,char,yes,inter,32768,16384,0.50,2.50,87088,28229.66,101.09,50.54,5186.42,1100.00,0.9116,25.74,0.0000,0.00,18.0356615905762,18.0356615905762,19.7846221923828
A57,char,yes,inter,65536,32768,0.50,2.50,32208,25143.99,83.95,41.97,12490.81,1100.00,0.8564,21.53,0.0000,0.00,20.4031556777954,20.4031556777954,23.8243293762207
A57,char,yes,inter,131072,65536,0.50,2.50,15000,26678.21,73.70,36.85,28456.76,1100.00,0.8435,22.50,0.0000,0.00,22.8913088417053,22.8913088417053,27.1384811401367
A57,char,yes,inter,262144,131072,0.50,2.50,7000,25898.79,70.85,35.43,59197.23,1100.00,0.8604,22.28,0.0000,0.00,24.2868884525299,24.2868884525299,28.2274389266968
A57,char,yes,inter,524288,262144,0.50,2.50,3500,27394.89,66.98,33.49,125233.80,1100.00,0.8691,23.81,0.0000,0.00,25.9496439886093,25.9496439886093,29.8580646514893
A57,char,yes,inter,1048576,524288,0.50,2.50,1750,29834.43,61.51,30.75,272771.91,1100.00,0.8649,25.80,0.0000,0.00,28.1239062498808,28.1239062498808,32.5169456005096
,,,,,,,,,,,,,,,,,,,,
A57,char,yes,inter,128,107,0.83,4.00,21203296,9068.35,299.29,250.18,6.84,1100.00,0.9061,8.22,0.0000,0.00,3.62016588785047,3.62016588785047,3.99532710280374
A57,char,yes,inter,256,213,0.83,4.00,14939920,16642.71,229.81,191.21,17.82,1100.00,0.9062,15.08,0.0000,0.00,4.73840492957746,4.73840492957746,5.22887323943662
A57,char,yes,inter,512,427,0.83,4.00,9001600,21846.42,210.96,175.94,38.83,1100.00,0.8746,19.11,0.0000,0.00,4.97083108899297,4.97083108899297,5.68354800936768
A57,char,yes,inter,1024,853,0.83,4.00,4298672,22545.81,195.24,162.64,83.92,1100.00,0.9067,20.44,0.0000,0.00,5.57519519343493,5.57519519343493,6.14888628370457
A57,char,yes,inter,2048,1707,0.83,4.00,2383328,28896.09,168.92,140.79,193.99,1100.00,0.9217,26.63,0.0000,0.00,6.54659428090217,6.54659428090217,7.10273872290568
A57,char,yes,inter,4096,3413,0.83,4.00,1038848,29341.58,145.02,120.84,451.91,1100.00,0.9417,27.63,0.0000,0.00,7.79306414811017,7.79306414811017,8.27552739525344
A57,char,yes,inter,8192,6827,0.83,4.00,480272,29253.96,134.49,112.08,974.58,1100.00,0.9335,27.31,0.0000,0.00,8.32879037278453,8.32879037278453,8.92211073678043
A57,char,yes,inter,16384,13653,0.83,4.00,214064,27488.72,127.59,106.32,2054.62,1100.00,0.9414,25.88,0.0000,0.00,8.85436931443639,8.85436931443639,9.40553358236285
A57,char,yes,inter,32768,27307,0.83,4.00,92992,27539.24,110.65,92.21,4738.34,1100.00,0.9122,25.12,0.0000,0.00,9.89287029882448,9.89287029882448,10.8450671988867
A57,char,yes,inter,65536,54613,0.83,4.00,32256,23677.46,89.28,74.40,11744.77,1100.00,0.8677,20.55,0.0000,0.00,11.6626729544705,11.6626729544705,13.4409046380898
A57,char,yes,inter,262144,218453,0.83,4.00,7500,27436.03,71.66,59.72,58530.19,1100.00,0.8475,23.25,0.0000,0.00,14.1919360300042,14.1919360300042,16.7456472330433
A57,char,yes,inter,524288,436907,0.83,4.00,3500,27280.71,67.26,56.05,124711.80,1100.00,0.8617,23.51,0.0000,0.00,15.3728593928456,15.3728593928456,17.8401524809628
A57,char,yes,inter,1048576,873813,0.83,4.00,1750,28179.24,65.12,54.27,257638.73,1100.00,0.8758,24.68,0.0000,0.00,16.139036594071,16.139036594071,18.4277650080738
