# -> Seq 8-bit, rate 1/2, no gen:
# ------|-------|-----|-------|----------|---------|------||-------|----------||-----------|---------|---------|----------|----------||----------|---------|---------|----------|---------|---------|---------|---------|
#  PROC |  TYPE | GEN |   VEC |        N |       K |    R ||   SNR |      FRA || LD+ST+DEC |    CTHR |    ITHR |  LATENCY | RUNTIME  || BIG FREQ | BIG POW | BIG ENE | LIT FREQ | LIT POW | LIT ENE | RAM POW | RAM ENE |
#       |       |     |       |          |         |      ||  (dB) |          ||      (ms) |  (Mb/s) |  (Mb/s) |     (us) | (hhmmss) ||    (Mhz) |     (W) |     (J) |    (Mhz) |     (W) |     (J) |     (W) |     (J) |
# ------|-------|-----|-------|----------|---------|------||-------|----------||-----------|---------|---------|----------|----------||----------|---------|---------|----------|---------|---------|---------|---------|
    A57 |  char |  no |   seq |   131072 |   65536 | 0.50 ||  2.50 |     2500 ||  45124.30 |    7.26 |    3.63 | 18049.72 | 00h00'46 ||   625.00 |  0.3241 |   14.62 |   450.00 |  0.0136 |    0.61 |  0.0000 |    0.00
    A57 |  char |  no |   seq |   262144 |  131072 | 0.50 ||  2.50 |     1250 ||  57927.48 |    5.66 |    2.83 | 46341.98 | 00h01'01 ||   625.00 |  0.3050 |   17.67 |   450.00 |  0.0134 |    0.78 |  0.0000 |    0.00
    A57 |  char |  no |   seq |   524288 |  262144 | 0.50 ||  2.50 |      625 ||  61052.28 |    5.37 |    2.68 | 97683.64 | 00h01'07 ||   625.00 |  0.3045 |   18.59 |   450.00 |  0.0136 |    0.83 |  0.0000 |    0.00
    A57 |  char |  no |   seq |  1048576 |  524288 | 0.50 ||  2.50 |      300 ||  65885.62 |    4.77 |    2.39 | 219618.75 | 00h01'18 ||   625.00 |  0.3017 |   19.88 |   450.00 |  0.0136 |    0.89 |  0.0000 |    0.00
#---------
#---------
# -> Seq 8-bit, rate 5/6, no gen:
# ------|-------|-----|-------|----------|---------|------||-------|----------||-----------|---------|---------|----------|----------||----------|---------|---------|----------|---------|---------|---------|---------|
#  PROC |  TYPE | GEN |   VEC |        N |       K |    R ||   SNR |      FRA || LD+ST+DEC |    CTHR |    ITHR |  LATENCY | RUNTIME  || BIG FREQ | BIG POW | BIG ENE | LIT FREQ | LIT POW | LIT ENE | RAM POW | RAM ENE |
#       |       |     |       |          |         |      ||  (dB) |          ||      (ms) |  (Mb/s) |  (Mb/s) |     (us) | (hhmmss) ||    (Mhz) |     (W) |     (J) |    (Mhz) |     (W) |     (J) |     (W) |     (J) |
# ------|-------|-----|-------|----------|---------|------||-------|----------||-----------|---------|---------|----------|----------||----------|---------|---------|----------|---------|---------|---------|---------|
    A57 |  char |  no |   seq |   131072 |  109227 | 0.83 ||  4.00 |     2500 ||  44387.95 |    7.38 |    6.15 | 17755.18 | 00h00'45 ||   625.00 |  0.3175 |   14.09 |   450.00 |  0.0135 |    0.60 |  0.0000 |    0.00
    A57 |  char |  no |   seq |   262144 |  218453 | 0.83 ||  4.00 |     1250 ||  53475.00 |    6.13 |    5.11 | 42780.00 | 00h00'56 ||   625.00 |  0.3041 |   16.26 |   450.00 |  0.0135 |    0.72 |  0.0000 |    0.00
    A57 |  char |  no |   seq |   524288 |  436907 | 0.83 ||  4.00 |      625 ||  58172.73 |    5.63 |    4.69 | 93076.38 | 00h01'03 ||   625.00 |  0.3036 |   17.66 |   450.00 |  0.0134 |    0.78 |  0.0000 |    0.00
    A57 |  char |  no |   seq |  1048576 |  873813 | 0.83 ||  4.00 |      300 ||  61964.15 |    5.08 |    4.23 | 206547.17 | 00h01'12 ||   625.00 |  0.3022 |   18.72 |   450.00 |  0.0136 |    0.84 |  0.0000 |    0.00
#---------
#---------
# -> Seq 8-bit, rate 1/2, gen:
# ------|-------|-----|-------|----------|---------|------||-------|----------||-----------|---------|---------|----------|----------||----------|---------|---------|----------|---------|---------|---------|---------|
#  PROC |  TYPE | GEN |   VEC |        N |       K |    R ||   SNR |      FRA || LD+ST+DEC |    CTHR |    ITHR |  LATENCY | RUNTIME  || BIG FREQ | BIG POW | BIG ENE | LIT FREQ | LIT POW | LIT ENE | RAM POW | RAM ENE |
#       |       |     |       |          |         |      ||  (dB) |          ||      (ms) |  (Mb/s) |  (Mb/s) |     (us) | (hhmmss) ||    (Mhz) |     (W) |     (J) |    (Mhz) |     (W) |     (J) |     (W) |     (J) |
# ------|-------|-----|-------|----------|---------|------||-------|----------||-----------|---------|---------|----------|----------||----------|---------|---------|----------|---------|---------|---------|---------|
    A57 |  char | yes |   seq |   131072 |   65536 | 0.50 ||  2.50 |     2500 ||  40853.12 |    8.02 |    4.01 | 16341.25 | 00h00'40 ||   625.00 |  0.3387 |   13.84 |   450.00 |  0.0135 |    0.55 |  0.0000 |    0.00
    A57 |  char | yes |   seq |   262144 |  131072 | 0.50 ||  2.50 |     1250 ||  55598.24 |    5.89 |    2.95 | 44478.59 | 00h00'55 ||   625.00 |  0.3142 |   17.47 |   450.00 |  0.0134 |    0.75 |  0.0000 |    0.00
    A57 |  char | yes |   seq |   524288 |  262144 | 0.50 ||  2.50 |      625 ||  51693.79 |    6.34 |    3.17 | 82710.05 | 00h00'52 ||   625.00 |  0.3247 |   16.79 |   450.00 |  0.0135 |    0.70 |  0.0000 |    0.00
    A57 |  char | yes |   seq |  1048576 |  524288 | 0.50 ||  2.50 |      300 ||  52462.86 |    6.00 |    3.00 | 174876.22 | 00h00'53 ||   625.00 |  0.3260 |   17.10 |   450.00 |  0.0135 |    0.71 |  0.0000 |    0.00
#---------
#---------
# -> Seq 8-bit, rate 5/6, gen:
# ------|-------|-----|-------|----------|---------|------||-------|----------||-----------|---------|---------|----------|----------||----------|---------|---------|----------|---------|---------|---------|---------|
#  PROC |  TYPE | GEN |   VEC |        N |       K |    R ||   SNR |      FRA || LD+ST+DEC |    CTHR |    ITHR |  LATENCY | RUNTIME  || BIG FREQ | BIG POW | BIG ENE | LIT FREQ | LIT POW | LIT ENE | RAM POW | RAM ENE |
#       |       |     |       |          |         |      ||  (dB) |          ||      (ms) |  (Mb/s) |  (Mb/s) |     (us) | (hhmmss) ||    (Mhz) |     (W) |     (J) |    (Mhz) |     (W) |     (J) |     (W) |     (J) |
# ------|-------|-----|-------|----------|---------|------||-------|----------||-----------|---------|---------|----------|----------||----------|---------|---------|----------|---------|---------|---------|---------|
    A57 |  char | yes |   seq |   131072 |  109227 | 0.83 ||  4.00 |     2500 ||  37773.70 |    8.67 |    7.23 | 15109.48 | 00h00'37 ||   625.00 |  0.3382 |   12.78 |   450.00 |  0.0135 |    0.51 |  0.0000 |    0.00
    A57 |  char | yes |   seq |   262144 |  218453 | 0.83 ||  4.00 |     1250 ||  47566.41 |    6.89 |    5.74 | 38053.12 | 00h00'47 ||   625.00 |  0.3201 |   15.22 |   450.00 |  0.0134 |    0.64 |  0.0000 |    0.00
    A57 |  char | yes |   seq |   524288 |  436907 | 0.83 ||  4.00 |      625 ||  59701.39 |    5.49 |    4.57 | 95522.23 | 00h01'00 ||   625.00 |  0.3078 |   18.37 |   450.00 |  0.0134 |    0.80 |  0.0000 |    0.00
    A57 |  char | yes |   seq |  1048576 |  873813 | 0.83 ||  4.00 |      300 ||  63281.46 |    4.97 |    4.14 | 210938.20 | 00h01'03 ||   625.00 |  0.3040 |   19.23 |   450.00 |  0.0135 |    0.85 |  0.0000 |    0.00
#---------
#---------
# -> Intra-SIMD 8-bit, rate 1/2, no gen:
# ------|-------|-----|-------|----------|---------|------||-------|----------||-----------|---------|---------|----------|----------||----------|---------|---------|----------|---------|---------|---------|---------|
#  PROC |  TYPE | GEN |   VEC |        N |       K |    R ||   SNR |      FRA || LD+ST+DEC |    CTHR |    ITHR |  LATENCY | RUNTIME  || BIG FREQ | BIG POW | BIG ENE | LIT FREQ | LIT POW | LIT ENE | RAM POW | RAM ENE |
#       |       |     |       |          |         |      ||  (dB) |          ||      (ms) |  (Mb/s) |  (Mb/s) |     (us) | (hhmmss) ||    (Mhz) |     (W) |     (J) |    (Mhz) |     (W) |     (J) |     (W) |     (J) |
# ------|-------|-----|-------|----------|---------|------||-------|----------||-----------|---------|---------|----------|----------||----------|---------|---------|----------|---------|---------|---------|---------|
    A57 |  char |  no | intra |   131072 |   65536 | 0.50 ||  2.50 |    15000 ||  49928.34 |   39.38 |   19.69 |  3328.56 | 00h00'51 ||   625.00 |  0.3839 |   19.17 |   450.00 |  0.0135 |    0.68 |  0.0000 |    0.00
    A57 |  char |  no | intra |   262144 |  131072 | 0.50 ||  2.50 |     7000 ||  50190.34 |   36.56 |   18.28 |  7170.05 | 00h00'53 ||   625.00 |  0.3811 |   19.13 |   450.00 |  0.0137 |    0.69 |  0.0000 |    0.00
    A57 |  char |  no | intra |   524288 |  262144 | 0.50 ||  2.50 |     3500 ||  53549.52 |   34.27 |   17.13 | 15299.86 | 00h01'00 ||   625.00 |  0.3784 |   20.26 |   450.00 |  0.0137 |    0.74 |  0.0000 |    0.00
    A57 |  char |  no | intra |  1048576 |  524288 | 0.50 ||  2.50 |     1750 ||  56085.40 |   32.72 |   16.36 | 32048.80 | 00h01'09 ||   625.00 |  0.3821 |   21.43 |   450.00 |  0.0139 |    0.78 |  0.0000 |    0.00
#---------
#---------
# -> Intra-SIMD 8-bit, rate 5/6, no gen:
# ------|-------|-----|-------|----------|---------|------||-------|----------||-----------|---------|---------|----------|----------||----------|---------|---------|----------|---------|---------|---------|---------|
#  PROC |  TYPE | GEN |   VEC |        N |       K |    R ||   SNR |      FRA || LD+ST+DEC |    CTHR |    ITHR |  LATENCY | RUNTIME  || BIG FREQ | BIG POW | BIG ENE | LIT FREQ | LIT POW | LIT ENE | RAM POW | RAM ENE |
#       |       |     |       |          |         |      ||  (dB) |          ||      (ms) |  (Mb/s) |  (Mb/s) |     (us) | (hhmmss) ||    (Mhz) |     (W) |     (J) |    (Mhz) |     (W) |     (J) |     (W) |     (J) |
# ------|-------|-----|-------|----------|---------|------||-------|----------||-----------|---------|---------|----------|----------||----------|---------|---------|----------|---------|---------|---------|---------|
    A57 |  char |  no | intra |   131072 |  109227 | 0.83 ||  4.00 |    15000 ||  42539.25 |   46.22 |   38.52 |  2835.95 | 00h00'43 ||   625.00 |  0.3916 |   16.66 |   450.00 |  0.0135 |    0.58 |  0.0000 |    0.00
    A57 |  char |  no | intra |   262144 |  218453 | 0.83 ||  4.00 |     7500 ||  45778.14 |   42.95 |   35.79 |  6103.75 | 00h00'48 ||   625.00 |  0.3880 |   17.76 |   450.00 |  0.0136 |    0.62 |  0.0000 |    0.00
    A57 |  char |  no | intra |   524288 |  436907 | 0.83 ||  4.00 |     3500 ||  49370.17 |   37.17 |   30.97 | 14105.76 | 00h00'54 ||   625.00 |  0.3784 |   18.68 |   450.00 |  0.0137 |    0.68 |  0.0000 |    0.00
    A57 |  char |  no | intra |  1048576 |  873813 | 0.83 ||  4.00 |     1750 ||  51867.18 |   35.38 |   29.48 | 29638.39 | 00h01'02 ||   625.00 |  0.3833 |   19.88 |   450.00 |  0.0140 |    0.72 |  0.0000 |    0.00
#---------
#---------
# -> Intra-SIMD 8-bit, rate 1/2, gen:
# ------|-------|-----|-------|----------|---------|------||-------|----------||-----------|---------|---------|----------|----------||----------|---------|---------|----------|---------|---------|---------|---------|
#  PROC |  TYPE | GEN |   VEC |        N |       K |    R ||   SNR |      FRA || LD+ST+DEC |    CTHR |    ITHR |  LATENCY | RUNTIME  || BIG FREQ | BIG POW | BIG ENE | LIT FREQ | LIT POW | LIT ENE | RAM POW | RAM ENE |
#       |       |     |       |          |         |      ||  (dB) |          ||      (ms) |  (Mb/s) |  (Mb/s) |     (us) | (hhmmss) ||    (Mhz) |     (W) |     (J) |    (Mhz) |     (W) |     (J) |     (W) |     (J) |
# ------|-------|-----|-------|----------|---------|------||-------|----------||-----------|---------|---------|----------|----------||----------|---------|---------|----------|---------|---------|---------|---------|
    A57 |  char | yes | intra |   131072 |   65536 | 0.50 ||  2.50 |    15000 ||  46478.89 |   42.30 |   21.15 |  3098.59 | 00h00'46 ||   625.00 |  0.3702 |   17.21 |   450.00 |  0.0135 |    0.63 |  0.0000 |    0.00
    A57 |  char | yes | intra |   262144 |  131072 | 0.50 ||  2.50 |     7000 ||  47574.39 |   38.57 |   19.29 |  6796.34 | 00h00'47 ||   625.00 |  0.3676 |   17.49 |   450.00 |  0.0135 |    0.64 |  0.0000 |    0.00
    A57 |  char | yes | intra |   524288 |  262144 | 0.50 ||  2.50 |     3500 ||  48262.54 |   38.02 |   19.01 | 13789.30 | 00h00'48 ||   625.00 |  0.3738 |   18.04 |   450.00 |  0.0136 |    0.66 |  0.0000 |    0.00
    A57 |  char | yes | intra |  1048576 |  524288 | 0.50 ||  2.50 |     1750 ||  51424.10 |   35.68 |   17.84 | 29385.20 | 00h00'52 ||   625.00 |  0.3765 |   19.36 |   450.00 |  0.0138 |    0.71 |  0.0000 |    0.00
#---------
#---------
# -> Intra-SIMD 8-bit, rate 5/6, gen:
# ------|-------|-----|-------|----------|---------|------||-------|----------||-----------|---------|---------|----------|----------||----------|---------|---------|----------|---------|---------|---------|---------|
#  PROC |  TYPE | GEN |   VEC |        N |       K |    R ||   SNR |      FRA || LD+ST+DEC |    CTHR |    ITHR |  LATENCY | RUNTIME  || BIG FREQ | BIG POW | BIG ENE | LIT FREQ | LIT POW | LIT ENE | RAM POW | RAM ENE |
#       |       |     |       |          |         |      ||  (dB) |          ||      (ms) |  (Mb/s) |  (Mb/s) |     (us) | (hhmmss) ||    (Mhz) |     (W) |     (J) |    (Mhz) |     (W) |     (J) |     (W) |     (J) |
# ------|-------|-----|-------|----------|---------|------||-------|----------||-----------|---------|---------|----------|----------||----------|---------|---------|----------|---------|---------|---------|---------|
    A57 |  char | yes | intra |   131072 |  109227 | 0.83 ||  4.00 |    15000 ||  40114.51 |   49.01 |   40.84 |  2674.30 | 00h00'40 ||   625.00 |  0.3780 |   15.16 |   450.00 |  0.0136 |    0.54 |  0.0000 |    0.00
    A57 |  char | yes | intra |   262144 |  218453 | 0.83 ||  4.00 |     7500 ||  44279.82 |   44.40 |   37.00 |  5903.98 | 00h00'44 ||   625.00 |  0.3771 |   16.70 |   450.00 |  0.0135 |    0.60 |  0.0000 |    0.00
    A57 |  char | yes | intra |   524288 |  436907 | 0.83 ||  4.00 |     3500 ||  44349.21 |   41.38 |   34.48 | 12671.20 | 00h00'44 ||   625.00 |  0.3788 |   16.80 |   450.00 |  0.0136 |    0.60 |  0.0000 |    0.00
    A57 |  char | yes | intra |  1048576 |  873813 | 0.83 ||  4.00 |     1750 ||  45835.64 |   40.03 |   33.36 | 26191.80 | 00h00'46 ||   625.00 |  0.3860 |   17.69 |   450.00 |  0.0139 |    0.63 |  0.0000 |    0.00
#---------
#---------
# -> Inter-SIMD 8-bit, rate 1/2, no gen:
# ------|-------|-----|-------|----------|---------|------||-------|----------||-----------|---------|---------|----------|----------||----------|---------|---------|----------|---------|---------|---------|---------|
#  PROC |  TYPE | GEN |   VEC |        N |       K |    R ||   SNR |      FRA || LD+ST+DEC |    CTHR |    ITHR |  LATENCY | RUNTIME  || BIG FREQ | BIG POW | BIG ENE | LIT FREQ | LIT POW | LIT ENE | RAM POW | RAM ENE |
#       |       |     |       |          |         |      ||  (dB) |          ||      (ms) |  (Mb/s) |  (Mb/s) |     (us) | (hhmmss) ||    (Mhz) |     (W) |     (J) |    (Mhz) |     (W) |     (J) |     (W) |     (J) |
# ------|-------|-----|-------|----------|---------|------||-------|----------||-----------|---------|---------|----------|----------||----------|---------|---------|----------|---------|---------|---------|---------|
    A57 |  char |  no | inter |   131072 |   65536 | 0.50 ||  2.50 |    15000 ||  43033.54 |   45.69 |   22.84 | 45902.45 | 00h00'45 ||   625.00 |  0.3683 |   15.85 |   450.00 |  0.0139 |    0.60 |  0.0000 |    0.00
    A57 |  char |  no | inter |   262144 |  131072 | 0.50 ||  2.50 |     7000 ||  41937.14 |   43.76 |   21.88 | 95856.33 | 00h00'47 ||   625.00 |  0.3750 |   15.72 |   450.00 |  0.0141 |    0.59 |  0.0000 |    0.00
    A57 |  char |  no | inter |   524288 |  262144 | 0.50 ||  2.50 |     3500 ||  44440.68 |   41.29 |   20.65 | 203157.41 | 00h00'55 ||   625.00 |  0.3768 |   16.74 |   450.00 |  0.0142 |    0.63 |  0.0000 |    0.00
    A57 |  char |  no | inter |  1048576 |  524288 | 0.50 ||  2.50 |     1750 ||  47914.36 |   38.30 |   19.15 | 438074.19 | 00h01'09 ||   625.00 |  0.3771 |   18.07 |   450.00 |  0.0144 |    0.69 |  0.0000 |    0.00
#---------
#---------
# -> Inter-SIMD 8-bit, rate 5/6, no gen:
# ------|-------|-----|-------|----------|---------|------||-------|----------||-----------|---------|---------|----------|----------||----------|---------|---------|----------|---------|---------|---------|---------|
#  PROC |  TYPE | GEN |   VEC |        N |       K |    R ||   SNR |      FRA || LD+ST+DEC |    CTHR |    ITHR |  LATENCY | RUNTIME  || BIG FREQ | BIG POW | BIG ENE | LIT FREQ | LIT POW | LIT ENE | RAM POW | RAM ENE |
#       |       |     |       |          |         |      ||  (dB) |          ||      (ms) |  (Mb/s) |  (Mb/s) |     (us) | (hhmmss) ||    (Mhz) |     (W) |     (J) |    (Mhz) |     (W) |     (J) |     (W) |     (J) |
# ------|-------|-----|-------|----------|---------|------||-------|----------||-----------|---------|---------|----------|----------||----------|---------|---------|----------|---------|---------|---------|---------|
    A57 |  char |  no | inter |   131072 |  109227 | 0.83 ||  4.00 |    15000 ||  40238.60 |   48.86 |   40.72 | 42921.17 | 00h00'42 ||   625.00 |  0.3711 |   14.93 |   450.00 |  0.0141 |    0.57 |  0.0000 |    0.00
    A57 |  char |  no | inter |   262144 |  218453 | 0.83 ||  4.00 |     7500 ||  43458.57 |   45.24 |   37.70 | 92711.62 | 00h00'48 ||   625.00 |  0.3722 |   16.18 |   450.00 |  0.0141 |    0.61 |  0.0000 |    0.00
    A57 |  char |  no | inter |   524288 |  436907 | 0.83 ||  4.00 |     3500 ||  41606.21 |   44.10 |   36.75 | 190199.84 | 00h00'52 ||   625.00 |  0.3847 |   16.01 |   450.00 |  0.0143 |    0.59 |  0.0000 |    0.00
    A57 |  char |  no | inter |  1048576 |  873813 | 0.83 ||  4.00 |     1750 ||  41298.45 |   44.43 |   37.03 | 377585.78 | 00h01'01 ||   625.00 |  0.3998 |   16.51 |   450.00 |  0.0144 |    0.59 |  0.0000 |    0.00
#---------
#---------
# -> inter-SIMD 8-bit, rate 1/2, gen:
# ------|-------|-----|-------|----------|---------|------||-------|----------||-----------|---------|---------|----------|----------||----------|---------|---------|----------|---------|---------|---------|---------|
#  PROC |  TYPE | GEN |   VEC |        N |       K |    R ||   SNR |      FRA || LD+ST+DEC |    CTHR |    ITHR |  LATENCY | RUNTIME  || BIG FREQ | BIG POW | BIG ENE | LIT FREQ | LIT POW | LIT ENE | RAM POW | RAM ENE |
#       |       |     |       |          |         |      ||  (dB) |          ||      (ms) |  (Mb/s) |  (Mb/s) |     (us) | (hhmmss) ||    (Mhz) |     (W) |     (J) |    (Mhz) |     (W) |     (J) |     (W) |     (J) |
# ------|-------|-----|-------|----------|---------|------||-------|----------||-----------|---------|---------|----------|----------||----------|---------|---------|----------|---------|---------|---------|---------|
    A57 |  char | yes | inter |   131072 |   65536 | 0.50 ||  2.50 |    15000 ||  43399.30 |   45.30 |   22.65 | 46292.59 | 00h00'44 ||   625.00 |  0.3662 |   15.89 |   450.00 |  0.0141 |    0.61 |  0.0000 |    0.00
    A57 |  char | yes | inter |   262144 |  131072 | 0.50 ||  2.50 |     7000 ||  42202.43 |   43.48 |   21.74 | 96462.68 | 00h00'44 ||   625.00 |  0.3739 |   15.78 |   450.00 |  0.0141 |    0.59 |  0.0000 |    0.00
    A57 |  char | yes | inter |   524288 |  262144 | 0.50 ||  2.50 |     3500 ||  44986.29 |   40.79 |   20.40 | 205651.58 | 00h00'49 ||   625.00 |  0.3757 |   16.90 |   450.00 |  0.0141 |    0.63 |  0.0000 |    0.00
    A57 |  char | yes | inter |  1048576 |  524288 | 0.50 ||  2.50 |     1750 ||  46970.63 |   39.07 |   19.53 | 429445.75 | 00h00'56 ||   625.00 |  0.3811 |   17.90 |   450.00 |  0.0141 |    0.66 |  0.0000 |    0.00
#---------
#---------
# -> inter-SIMD 8-bit, rate 5/6, gen:
# ------|-------|-----|-------|----------|---------|------||-------|----------||-----------|---------|---------|----------|----------||----------|---------|---------|----------|---------|---------|---------|---------|
#  PROC |  TYPE | GEN |   VEC |        N |       K |    R ||   SNR |      FRA || LD+ST+DEC |    CTHR |    ITHR |  LATENCY | RUNTIME  || BIG FREQ | BIG POW | BIG ENE | LIT FREQ | LIT POW | LIT ENE | RAM POW | RAM ENE |
#       |       |     |       |          |         |      ||  (dB) |          ||      (ms) |  (Mb/s) |  (Mb/s) |     (us) | (hhmmss) ||    (Mhz) |     (W) |     (J) |    (Mhz) |     (W) |     (J) |     (W) |     (J) |
# ------|-------|-----|-------|----------|---------|------||-------|----------||-----------|---------|---------|----------|----------||----------|---------|---------|----------|---------|---------|---------|---------|
    A57 |  char | yes | inter |   262144 |  218453 | 0.83 ||  4.00 |     7500 ||  42714.63 |   46.03 |   38.36 | 91124.54 | 00h00'45 ||   625.00 |  0.3765 |   16.08 |   450.00 |  0.0142 |    0.61 |  0.0000 |    0.00
    A57 |  char | yes | inter |   524288 |  436907 | 0.83 ||  4.00 |     3500 ||  42839.86 |   42.83 |   35.70 | 195839.36 | 00h00'48 ||   625.00 |  0.3815 |   16.34 |   450.00 |  0.0142 |    0.61 |  0.0000 |    0.00
    A57 |  char | yes | inter |  1048576 |  873813 | 0.83 ||  4.00 |     1750 ||  48175.14 |   38.09 |   31.74 | 440458.47 | 00h00'58 ||   625.00 |  0.3693 |   17.79 |   450.00 |  0.0141 |    0.68 |  0.0000 |    0.00
#---------
#---------
