PROC,TYPE,GEN,VEC,N,K,R,SNR (dB),FRA,LD+ST+DEC (ms),CTHR (Mbit/s),ITHR (Mbit/s),LATENCY (us),CLU_FREQ (MHz),CLU_POW (W),CLU_ENE (J),RAM_POW (W),RAM_ENE (J),EB_CLU (nJ),EB_CLU_RAM (nJ),TB_CLU (ns)
,,,,,,,,,,,,,,,,,,,,
A53,char,no,seq,128,64,0.50,2.50,1332899,19867.18,8.59,4.29,14.91,575.00,0.0837,1.66,0.0000,0.00,19.499484375,19.499484375,232.96875
A53,char,no,seq,256,128,0.50,2.50,1048729,33767.88,7.95,3.98,32.20,575.00,0.0825,2.78,0.0000,0.00,20.75390625,20.75390625,251.5625
A53,char,no,seq,512,256,0.50,2.50,699036,49539.34,7.22,3.61,70.87,575.00,0.0814,4.03,0.0000,0.00,22.5344453125,22.5344453125,276.8359375
A53,char,no,seq,1024,512,0.50,2.50,399077,63825.28,6.40,3.20,159.93,575.00,0.0814,5.19,0.0000,0.00,25.42637109375,25.42637109375,312.36328125
A53,char,no,seq,2048,1024,0.50,2.50,213346,74572.14,5.86,2.93,349.54,575.00,0.0810,6.04,0.0000,0.00,27.64916015625,27.64916015625,341.34765625
A53,char,no,seq,4096,2048,0.50,2.50,106522,80424.95,5.43,2.71,755.01,575.00,0.0804,6.47,0.0000,0.00,29.640041015625,29.640041015625,368.6572265625
A53,char,no,seq,8192,4096,0.50,2.50,52362,84511.48,5.08,2.54,1613.98,575.00,0.0814,6.88,0.0000,0.00,32.0747001953125,32.0747001953125,394.0380859375
A53,char,no,seq,16384,8192,0.50,2.50,24703,86615.60,4.67,2.34,3506.28,575.00,0.0820,7.10,0.0000,0.00,35.097041015625,35.097041015625,428.0126953125
A53,char,no,seq,32768,16384,0.50,2.50,11635,87660.48,4.35,2.17,7534.21,575.00,0.0828,7.25,0.0000,0.00,38.0757194824219,38.0757194824219,459.851684570312
A53,char,no,seq,65536,32768,0.50,2.50,5560,88217.84,4.13,2.07,15866.52,575.00,0.0833,7.35,0.0000,0.00,40.3345067138672,40.3345067138672,484.207763671875
A53,char,no,seq,131072,65536,0.50,2.50,2500,85964.91,3.81,1.91,34385.96,575.00,0.0842,7.24,0.0000,0.00,44.1787388916016,44.1787388916016,524.688110351562
A53,char,no,seq,262144,131072,0.50,2.50,1250,92505.34,3.54,1.77,74004.27,575.00,0.0839,7.76,0.0000,0.00,47.3705921401978,47.3705921401978,564.607772827148
A53,char,no,seq,524288,262144,0.50,2.50,625,98513.70,3.33,1.66,157621.92,575.00,0.0841,8.29,0.0000,0.00,50.5676401977539,50.5676401977539,601.279907226562
A53,char,no,seq,1048576,524288,0.50,2.50,300,101423.99,3.10,1.55,338079.97,575.00,0.0844,8.56,0.0000,0.00,54.4241895065308,54.4241895065308,644.836368560791
,,,,,,,,,,,,,,,,,,,,
A53,char,no,seq,128,107,0.83,4.00,1453651,16666.13,11.16,9.33,11.47,575.00,0.0812,1.35,0.0000,0.00,8.70433644859813,8.70433644859813,107.196261682243
A53,char,no,seq,256,213,0.83,4.00,1102321,31643.12,8.92,7.42,28.71,575.00,0.0825,2.61,0.0000,0.00,11.1200704225352,11.1200704225352,134.788732394366
A53,char,no,seq,512,427,0.83,4.00,752754,48385.46,7.97,6.64,64.28,575.00,0.0803,3.89,0.0000,0.00,12.0882529274005,12.0882529274005,150.538641686183
A53,char,no,seq,1024,853,0.83,4.00,457183,63291.82,7.40,6.16,138.44,575.00,0.0802,5.08,0.0000,0.00,13.0162813599062,13.0162813599062,162.297772567409
A53,char,no,seq,2048,1707,0.83,4.00,238931,74099.73,6.60,5.50,310.13,575.00,0.0807,5.98,0.0000,0.00,14.6616818980668,14.6616818980668,181.681312243702
A53,char,no,seq,4096,3413,0.83,4.00,118322,82056.63,5.91,4.92,693.50,575.00,0.0803,6.59,0.0000,0.00,16.3164518019338,16.3164518019338,203.193671256959
A53,char,no,seq,8192,6827,0.83,4.00,57604,85504.36,5.52,4.60,1484.35,575.00,0.0809,6.92,0.0000,0.00,17.5895583711733,17.5895583711733,217.423465651091
A53,char,no,seq,16384,13653,0.83,4.00,27305,87154.39,5.13,4.28,3191.88,575.00,0.0813,7.09,0.0000,0.00,19.0068002636783,19.0068002636783,233.785981103054
A53,char,no,seq,32768,27307,0.83,4.00,12609,87591.66,4.72,3.93,6946.76,575.00,0.0821,7.19,0.0000,0.00,20.8858166770425,20.8858166770425,254.394843812942
A53,char,no,seq,65536,54613,0.83,4.00,5896,89437.37,4.32,3.60,15169.16,575.00,0.0825,7.38,0.0000,0.00,22.9149781187629,22.9149781187629,277.75731053046
A53,char,no,seq,131072,109227,0.83,4.00,2500,80872.76,4.05,3.38,32349.10,575.00,0.0835,6.75,0.0000,0.00,24.7296900033874,24.7296900033874,296.163952136377
A53,char,no,seq,262144,218453,0.83,4.00,1250,87735.44,3.73,3.11,70188.35,575.00,0.0838,7.35,0.0000,0.00,26.9247102580418,26.9247102580418,321.297258449186
A53,char,no,seq,524288,436907,0.83,4.00,625,95992.82,3.41,2.84,153588.52,575.00,0.0840,8.07,0.0000,0.00,29.5290203178251,29.5290203178251,351.535956164584
A53,char,no,seq,1048576,873813,0.83,4.00,300,96750.48,3.25,2.71,322501.62,575.00,0.0838,8.10,0.0000,0.00,30.9283974443044,30.9283974443044,369.073955182631
,,,,,,,,,,,,,,,,,,,,
A53,char,yes,seq,128,64,0.50,2.50,1372446,15808.79,11.11,5.56,11.52,575.00,0.0848,1.34,0.0000,0.00,15.264,15.264,180
A53,char,yes,seq,256,128,0.50,2.50,1039196,25403.40,10.47,5.24,24.45,575.00,0.0837,2.13,0.0000,0.00,15.9880078125,15.9880078125,191.015625
A53,char,yes,seq,512,256,0.50,2.50,672044,37384.77,9.20,4.60,55.63,575.00,0.0838,3.13,0.0000,0.00,18.2101328125,18.2101328125,217.3046875
A53,char,yes,seq,1024,512,0.50,2.50,367136,46550.67,8.08,4.04,126.79,575.00,0.0848,3.95,0.0000,0.00,20.99959375,20.99959375,247.63671875
A53,char,yes,seq,2048,1024,0.50,2.50,185879,52518.25,7.25,3.62,282.54,575.00,0.0858,4.51,0.0000,0.00,23.67376171875,23.67376171875,275.91796875
A53,char,yes,seq,4096,2048,0.50,2.50,92647,58011.90,6.54,3.27,626.16,575.00,0.0858,4.98,0.0000,0.00,26.2326796875,26.2326796875,305.7421875
A53,char,yes,seq,8192,4096,0.50,2.50,44280,59428.42,6.10,3.05,1342.11,575.00,0.0859,5.10,0.0000,0.00,28.1463010253906,28.1463010253906,327.66357421875
A53,char,yes,seq,16384,8192,0.50,2.50,20875,60776.83,5.63,2.81,2911.47,575.00,0.0875,5.32,0.0000,0.00,31.0978546142578,31.0978546142578,355.404052734375
A53,char,yes,seq,32768,16384,0.50,2.50,9828,61852.64,5.21,2.60,6293.51,575.00,0.0881,5.45,0.0000,0.00,33.8414447631836,33.8414447631836,384.125366210938
A53,char,yes,seq,65536,32768,0.50,2.50,4714,62222.95,4.96,2.48,13199.61,575.00,0.0887,5.52,0.0000,0.00,35.7301454772949,35.7301454772949,402.820129394531
A53,char,yes,seq,131072,65536,0.50,2.50,2500,71969.51,4.55,2.28,28787.80,575.00,0.0900,6.48,0.0000,0.00,39.5340270996094,39.5340270996094,439.266967773438
A53,char,yes,seq,262144,131072,0.50,2.50,1250,79836.40,4.10,2.05,63869.12,575.00,0.0905,7.22,0.0000,0.00,44.0990856933594,44.0990856933594,487.28271484375
A53,char,yes,seq,524288,262144,0.50,2.50,625,83042.06,3.95,1.97,132867.30,575.00,0.0904,7.51,0.0000,0.00,45.8191067504883,45.8191067504883,506.848526000977
A53,char,yes,seq,1048576,524288,0.50,2.50,300,86209.76,3.65,1.82,287365.88,575.00,0.0907,7.82,0.0000,0.00,49.713297492981,49.713297492981,548.106918334961
,,,,,,,,,,,,,,,,,,,,
A53,char,yes,seq,128,107,0.83,4.00,1468511,13662.74,13.76,11.50,9.30,575.00,0.0817,1.12,0.0000,0.00,7.10102803738318,7.10102803738318,86.9158878504673
A53,char,yes,seq,256,213,0.83,4.00,1089749,25208.92,11.07,9.21,23.13,575.00,0.0847,2.13,0.0000,0.00,9.19770422535211,9.19770422535211,108.591549295775
A53,char,yes,seq,512,427,0.83,4.00,718502,36721.69,10.02,8.35,51.11,575.00,0.0836,3.07,0.0000,0.00,10.0065480093677,10.0065480093677,119.695550351288
A53,char,yes,seq,1024,853,0.83,4.00,417855,47499.31,9.01,7.50,113.67,575.00,0.0836,3.97,0.0000,0.00,11.1404595545135,11.1404595545135,133.259085580305
A53,char,yes,seq,2048,1707,0.83,4.00,210135,52925.68,8.13,6.78,251.87,575.00,0.0847,4.48,0.0000,0.00,12.4975916813122,12.4975916813122,147.551259519625
A53,char,yes,seq,4096,3413,0.83,4.00,101774,57519.54,7.25,6.04,565.17,575.00,0.0848,4.88,0.0000,0.00,14.0423135071784,14.0423135071784,165.593319660123
A53,char,yes,seq,8192,6827,0.83,4.00,48800,60292.45,6.63,5.53,1235.50,575.00,0.0856,5.16,0.0000,0.00,15.4912553097993,15.4912553097993,180.972608759338
A53,char,yes,seq,16384,13653,0.83,4.00,22830,61192.10,6.11,5.09,2680.34,575.00,0.0861,5.27,0.0000,0.00,16.903045045045,16.903045045045,196.318757782172
A53,char,yes,seq,32768,27307,0.83,4.00,10570,61375.50,5.64,4.70,5806.57,575.00,0.0874,5.36,0.0000,0.00,18.5847664701359,18.5847664701359,212.640348628557
A53,char,yes,seq,65536,54613,0.83,4.00,4895,62072.09,5.17,4.31,12680.71,575.00,0.0882,5.48,0.0000,0.00,20.4793478109608,20.4793478109608,232.192152051709
A53,char,yes,seq,131072,109227,0.83,4.00,2500,68068.95,4.81,4.01,27227.58,575.00,0.0891,6.07,0.0000,0.00,22.2104184679612,22.2104184679612,249.275179213931
A53,char,yes,seq,262144,218453,0.83,4.00,1250,74396.55,4.40,3.67,59517.24,575.00,0.0895,6.66,0.0000,0.00,24.3841603457036,24.3841603457036,272.44871894641
A53,char,yes,seq,524288,436907,0.83,4.00,625,82363.64,3.98,3.32,131781.83,575.00,0.0903,7.44,0.0000,0.00,27.2366870958808,27.2366870958808,301.624441814848
A53,char,yes,seq,1048576,873813,0.83,4.00,300,84535.83,3.72,3.10,281786.09,575.00,0.0903,7.63,0.0000,0.00,29.1198276141463,29.1198276141463,322.478711120114
,,,,,,,,,,,,,,,,,,,,
A53,char,no,intra,128,64,0.50,2.50,1628908,11036.07,18.89,9.45,6.78,575.00,0.0893,0.99,0.0000,0.00,9.46021875,9.46021875,105.9375
A53,char,no,intra,256,128,0.50,2.50,1482148,16729.39,22.68,11.34,11.29,575.00,0.0892,1.49,0.0000,0.00,7.86771875,7.86771875,88.203125
A53,char,no,intra,512,256,0.50,2.50,1287237,26759.63,24.63,12.31,20.79,575.00,0.0914,2.45,0.0000,0.00,7.4226796875,7.4226796875,81.2109375
A53,char,no,intra,1024,512,0.50,2.50,979960,41255.77,24.32,12.16,42.10,575.00,0.0910,3.75,0.0000,0.00,7.4826171875,7.4826171875,82.2265625
A53,char,no,intra,2048,1024,0.50,2.50,657025,53058.49,25.36,12.68,80.76,575.00,0.0926,4.91,0.0000,0.00,7.3031015625,7.3031015625,78.8671875
A53,char,no,intra,4096,2048,0.50,2.50,419152,66934.38,25.65,12.82,159.69,575.00,0.0938,6.28,0.0000,0.00,7.3139267578125,7.3139267578125,77.9736328125
A53,char,no,intra,8192,4096,0.50,2.50,234743,74390.12,25.85,12.93,316.90,575.00,0.0962,7.16,0.0000,0.00,7.4428173828125,7.4428173828125,77.3681640625
A53,char,no,intra,16384,8192,0.50,2.50,121493,79840.16,24.93,12.47,657.16,575.00,0.0999,7.98,0.0000,0.00,8.01395068359375,8.01395068359375,80.2197265625
A53,char,no,intra,32768,16384,0.50,2.50,61018,82250.57,24.31,12.15,1347.97,575.00,0.1041,8.56,0.0000,0.00,8.56467755126953,8.56467755126953,82.2735595703125
A53,char,no,intra,65536,32768,0.50,2.50,29966,81949.46,23.96,11.98,2734.75,575.00,0.1076,8.82,0.0000,0.00,8.98007507324219,8.98007507324219,83.4579467773438
A53,char,no,intra,131072,65536,0.50,2.50,15000,87642.52,22.43,11.22,5842.83,575.00,0.1107,9.70,0.0000,0.00,9.86940431213379,9.86940431213379,89.1545104980469
A53,char,no,intra,262144,131072,0.50,2.50,7000,87551.69,20.96,10.48,12507.38,575.00,0.1121,9.82,0.0000,0.00,10.697000869751,10.697000869751,95.4237365722656
A53,char,no,intra,524288,262144,0.50,2.50,3500,96963.07,18.92,9.46,27703.73,575.00,0.1133,10.99,0.0000,0.00,11.9736961708069,11.9736961708069,105.681343078613
A53,char,no,intra,1048576,524288,0.50,2.50,1750,102795.00,17.85,8.93,58740.00,575.00,0.1139,11.71,0.0000,0.00,12.7610893249512,12.7610893249512,112.037658691406
,,,,,,,,,,,,,,,,,,,,
A53,char,no,intra,128,107,0.83,4.00,1739009,7178.55,31.01,25.92,4.13,575.00,0.0893,0.64,0.0000,0.00,3.44681308411215,3.44681308411215,38.5981308411215
A53,char,no,intra,256,213,0.83,4.00,1549709,14132.24,28.07,23.36,9.12,575.00,0.0893,1.26,0.0000,0.00,3.82354929577465,3.82354929577465,42.8169014084507
A53,char,no,intra,512,427,0.83,4.00,1373013,23128.78,30.39,25.35,16.85,575.00,0.0915,2.12,0.0000,0.00,3.61071428571429,3.61071428571429,39.4613583138173
A53,char,no,intra,1024,853,0.83,4.00,1137199,35548.33,32.76,27.29,31.26,575.00,0.0923,3.28,0.0000,0.00,3.38252989449004,3.38252989449004,36.6471277842907
A53,char,no,intra,2048,1707,0.83,4.00,788585,50594.61,31.92,26.61,64.16,575.00,0.0937,4.74,0.0000,0.00,3.52184651435267,3.52184651435267,37.5864089045108
A53,char,no,intra,4096,3413,0.83,4.00,503777,65230.44,31.63,26.36,129.48,575.00,0.0950,6.20,0.0000,0.00,3.60404336360973,3.60404336360973,37.9372985643129
A53,char,no,intra,8192,6827,0.83,4.00,290048,75373.66,31.52,26.27,259.87,575.00,0.0974,7.34,0.0000,0.00,3.70753449538597,3.70753449538597,38.0650358869196
A53,char,no,intra,16384,13653,0.83,4.00,146841,78227.27,30.75,25.63,532.73,575.00,0.1028,8.04,0.0000,0.00,4.01118025342416,4.01118025342416,39.0192631656046
A53,char,no,intra,32768,27307,0.83,4.00,73239,83626.49,28.70,23.92,1141.83,575.00,0.1085,9.07,0.0000,0.00,4.53687900538324,4.53687900538324,41.8145530450068
A53,char,no,intra,65536,54613,0.83,4.00,35138,84429.02,27.28,22.73,2402.78,575.00,0.1099,9.28,0.0000,0.00,4.83521363045429,4.83521363045429,43.9964843535422
A53,char,no,intra,131072,109227,0.83,4.00,15000,74866.18,26.26,21.88,4991.08,575.00,0.1146,8.58,0.0000,0.00,5.23659688538548,5.23659688538548,45.6945626996988
A53,char,no,intra,262144,218453,0.83,4.00,7500,82486.95,23.84,19.86,10998.26,575.00,0.1156,9.54,0.0000,0.00,5.82001096803431,5.82001096803431,50.3461156404352
A53,char,no,intra,524288,436907,0.83,4.00,3500,88225.62,20.80,17.33,25207.32,575.00,0.1167,10.30,0.0000,0.00,6.73299865646465,6.73299865646465,57.6949327889002
A53,char,no,intra,1048576,873813,0.83,4.00,1750,90778.39,20.21,16.85,51873.37,575.00,0.1170,10.63,0.0000,0.00,6.94563286423983,6.94563286423983,59.3643834550413
,,,,,,,,,,,,,,,,,,,,
A53,char,yes,intra,128,64,0.50,2.50,1698069,5994.55,36.26,18.13,3.53,575.00,0.0924,0.55,0.0000,0.00,5.0964375,5.0964375,55.15625
A53,char,yes,intra,256,128,0.50,2.50,1572445,10773.67,37.36,18.68,6.85,575.00,0.0914,0.99,0.0000,0.00,4.891328125,4.891328125,53.515625
A53,char,yes,intra,512,256,0.50,2.50,1381377,17107.13,41.34,20.67,12.38,575.00,0.0941,1.61,0.0000,0.00,4.5506171875,4.5506171875,48.359375
A53,char,yes,intra,1024,512,0.50,2.50,1074590,28938.27,38.03,19.01,26.93,575.00,0.0960,2.78,0.0000,0.00,5.049375,5.049375,52.59765625
A53,char,yes,intra,2048,1024,0.50,2.50,769737,41891.30,37.63,18.82,54.42,575.00,0.0969,4.06,0.0000,0.00,5.149705078125,5.149705078125,53.14453125
A53,char,yes,intra,4096,2048,0.50,2.50,489617,58193.03,34.46,17.23,118.85,575.00,0.0971,5.65,0.0000,0.00,5.63492919921875,5.63492919921875,58.0322265625
A53,char,yes,intra,8192,4096,0.50,2.50,275797,69254.05,32.62,16.31,251.11,575.00,0.1005,6.96,0.0000,0.00,6.16126831054688,6.16126831054688,61.30615234375
A53,char,yes,intra,16384,8192,0.50,2.50,142854,76314.69,30.67,15.33,534.21,575.00,0.1055,8.05,0.0000,0.00,6.87977966308594,6.87977966308594,65.211181640625
A53,char,yes,intra,32768,16384,0.50,2.50,68860,77207.73,29.23,14.61,1121.23,575.00,0.1087,8.39,0.0000,0.00,7.43882452392578,7.43882452392578,68.4344482421875
A53,char,yes,intra,65536,32768,0.50,2.50,34752,80639.45,28.24,14.12,2320.43,575.00,0.1123,9.05,0.0000,0.00,7.95240139770508,7.95240139770508,70.8139038085938
A53,char,yes,intra,131072,65536,0.50,2.50,15000,75526.70,26.03,13.02,5035.11,575.00,0.1146,8.66,0.0000,0.00,8.80468148803711,8.80468148803711,76.8296813964844
A53,char,yes,intra,262144,131072,0.50,2.50,7000,77055.34,23.81,11.91,11007.91,575.00,0.1151,8.87,0.0000,0.00,9.66652252960205,9.66652252960205,83.9836883544922
A53,char,yes,intra,524288,262144,0.50,2.50,3500,83121.07,22.08,11.04,23748.88,575.00,0.1158,9.62,0.0000,0.00,10.4908764038086,10.4908764038086,90.5947875976562
A53,char,yes,intra,1048576,524288,0.50,2.50,1750,90096.44,20.37,10.18,51483.68,575.00,0.1160,10.46,0.0000,0.00,11.3908898925781,11.3908898925781,98.1973266601562
,,,,,,,,,,,,,,,,,,,,
A53,char,yes,intra,128,107,0.83,4.00,1765946,4484.94,50.40,42.13,2.54,575.00,0.0938,0.42,0.0000,0.00,2.22665420560748,2.22665420560748,23.7383177570093
A53,char,yes,intra,256,213,0.83,4.00,1622879,9504.08,43.71,36.37,5.86,575.00,0.0926,0.88,0.0000,0.00,2.54758685446009,2.54758685446009,27.5117370892019
A53,char,yes,intra,512,427,0.83,4.00,1446105,15321.65,48.32,40.30,10.60,575.00,0.0937,1.44,0.0000,0.00,2.32604215456674,2.32604215456674,24.824355971897
A53,char,yes,intra,1024,853,0.83,4.00,1198370,25588.92,47.96,39.95,21.35,575.00,0.0970,2.48,0.0000,0.00,2.4278429073857,2.4278429073857,25.0293083235639
A53,char,yes,intra,2048,1707,0.83,4.00,890666,40173.46,45.41,37.85,45.10,575.00,0.0972,3.90,0.0000,0.00,2.56808435852373,2.56808435852373,26.4206209724663
A53,char,yes,intra,4096,3413,0.83,4.00,561429,56504.71,40.70,33.91,100.64,575.00,0.0993,5.61,0.0000,0.00,2.92808438324055,2.92808438324055,29.4872546147085
A53,char,yes,intra,8192,6827,0.83,4.00,321341,66356.84,39.67,33.06,206.50,575.00,0.1006,6.68,0.0000,0.00,3.04290317855573,3.04290317855573,30.2475465065182
A53,char,yes,intra,16384,13653,0.83,4.00,170937,75579.24,37.06,30.88,442.15,575.00,0.1076,8.13,0.0000,0.00,3.48460704607046,3.48460704607046,32.3848238482385
A53,char,yes,intra,32768,27307,0.83,4.00,79535,77345.93,33.70,28.08,972.48,575.00,0.1127,8.72,0.0000,0.00,4.0135678031274,4.0135678031274,35.6128465228696
A53,char,yes,intra,65536,54613,0.83,4.00,39967,83155.52,31.50,26.25,2080.60,575.00,0.1144,9.52,0.0000,0.00,4.35831468697929,4.35831468697929,38.0971563547141
A53,char,yes,intra,131072,109227,0.83,4.00,15000,65858.42,29.85,24.88,4390.56,575.00,0.1181,7.78,0.0000,0.00,4.74722491691615,4.74722491691615,40.1966546732951
A53,char,yes,intra,262144,218453,0.83,4.00,7500,77620.56,25.33,21.11,10349.41,575.00,0.1183,9.18,0.0000,0.00,5.60457033320669,5.60457033320669,47.3759115233025
A53,char,yes,intra,524288,436907,0.83,4.00,3500,80935.01,22.67,18.89,23124.29,575.00,0.1184,9.59,0.0000,0.00,6.26658747971536,6.26658747971536,52.9272591192176
A53,char,yes,intra,1048576,873813,0.83,4.00,1750,86506.08,21.21,17.68,49432.05,575.00,0.1186,10.26,0.0000,0.00,6.70926288576618,6.70926288576618,56.5705133707098
,,,,,,,,,,,,,,,,,,,,
A53,char,no,inter,128,64,0.50,2.50,18706160,33312.01,71.88,35.94,28.49,575.00,0.1037,3.45,0.0000,0.00,2.8851689453125,2.8851689453125,27.822265625
A53,char,no,inter,256,128,0.50,2.50,13180784,46973.92,71.83,35.92,57.02,575.00,0.1038,4.88,0.0000,0.00,2.889978515625,2.889978515625,27.841796875
A53,char,no,inter,512,256,0.50,2.50,8149008,63120.75,66.10,33.05,123.93,575.00,0.1061,6.69,0.0000,0.00,3.21019848632813,3.21019848632813,30.25634765625
A53,char,no,inter,1024,512,0.50,2.50,3781824,68091.13,56.87,28.44,288.08,575.00,0.1121,7.63,0.0000,0.00,3.9421103515625,3.9421103515625,35.166015625
A53,char,no,inter,2048,1024,0.50,2.50,1895728,75196.66,51.63,25.82,634.66,575.00,0.1155,8.69,0.0000,0.00,4.47407409667969,4.47407409667969,38.736572265625
A53,char,no,inter,4096,2048,0.50,2.50,885920,81023.54,44.79,22.39,1463.31,575.00,0.1182,9.57,0.0000,0.00,5.27841925048828,5.27841925048828,44.6566772460938
A53,char,no,inter,8192,4096,0.50,2.50,421488,84982.48,40.63,20.31,3226.00,575.00,0.1212,10.30,0.0000,0.00,5.96605224609375,5.96605224609375,49.224853515625
A53,char,no,inter,16384,8192,0.50,2.50,188736,84822.88,36.46,18.23,7190.82,575.00,0.1218,10.33,0.0000,0.00,6.68214321899414,6.68214321899414,54.8616027832031
A53,char,no,inter,32768,16384,0.50,2.50,82496,84180.67,32.11,16.06,16326.74,575.00,0.1188,10.00,0.0000,0.00,7.39905056762695,7.39905056762695,62.2815704345703
A53,char,no,inter,65536,32768,0.50,2.50,30624,70466.86,28.48,14.24,36816.54,575.00,0.1182,8.33,0.0000,0.00,8.30023770904541,8.30023770904541,70.2219772338867
A53,char,no,inter,131072,65536,0.50,2.50,15000,72713.05,27.04,13.52,77560.59,575.00,0.1202,8.74,0.0000,0.00,8.89089862632751,8.89089862632751,73.9675426483154
A53,char,no,inter,262144,131072,0.50,2.50,7000,72546.95,25.29,12.65,165821.59,575.00,0.1206,8.75,0.0000,0.00,9.53582942676544,9.53582942676544,79.0698957443237
A53,char,no,inter,524288,262144,0.50,2.50,3500,80493.02,22.80,11.40,367968.12,575.00,0.1190,9.58,0.0000,0.00,10.4399219226837,10.4399219226837,87.7304363250732
A53,char,no,inter,1048576,524288,0.50,2.50,1750,84954.54,21.60,10.80,776727.19,575.00,0.1199,10.19,0.0000,0.00,11.1019122697115,11.1019122697115,92.5930964946747
,,,,,,,,,,,,,,,,,,,,
A53,char,no,inter,128,107,0.83,4.00,20592832,26246.19,100.43,83.95,20.39,575.00,0.1049,2.75,0.0000,0.00,1.24936390186916,1.24936390186916,11.910046728972
A53,char,no,inter,256,213,0.83,4.00,14286336,45821.52,79.82,66.41,51.32,575.00,0.1050,4.81,0.0000,0.00,1.58116197183099,1.58116197183099,15.0586854460094
A53,char,no,inter,512,427,0.83,4.00,7631728,54076.55,72.26,60.26,113.37,575.00,0.1083,5.86,0.0000,0.00,1.7971269028103,1.7971269028103,16.5939695550351
A53,char,no,inter,1024,853,0.83,4.00,4583760,68926.92,68.10,56.73,240.60,575.00,0.1129,7.78,0.0000,0.00,1.9903092028136,1.9903092028136,17.6289566236811
A53,char,no,inter,2048,1707,0.83,4.00,2104272,74107.52,58.15,48.47,563.48,575.00,0.1186,8.79,0.0000,0.00,2.44686321031049,2.44686321031049,20.6312243702402
A53,char,no,inter,4096,3413,0.83,4.00,961296,81451.46,48.34,40.28,1355.69,575.00,0.1196,9.74,0.0000,0.00,2.96917162320539,2.96917162320539,24.8258496923528
A53,char,no,inter,8192,6827,0.83,4.00,455600,83099.59,44.91,37.43,2918.33,575.00,0.1229,10.21,0.0000,0.00,3.28349528526439,3.28349528526439,26.7168045993848
A53,char,no,inter,16384,13653,0.83,4.00,207968,86725.62,39.29,32.74,6672.23,575.00,0.1230,10.67,0.0000,0.00,3.75688626126126,3.75688626126126,30.5437907419615
A53,char,no,inter,32768,27307,0.83,4.00,86624,86362.08,32.87,27.39,15951.62,575.00,0.1190,10.28,0.0000,0.00,4.34467988977185,4.34467988977185,36.5099150400996
A53,char,no,inter,65536,54613,0.83,4.00,31392,68775.01,29.91,24.93,35053.52,575.00,0.1191,8.19,0.0000,0.00,4.77779355647923,4.77779355647923,40.1158149158625
A53,char,no,inter,131072,109227,0.83,4.00,15000,68676.99,28.63,23.86,73255.46,575.00,0.1212,8.33,0.0000,0.00,5.08033828174353,5.08033828174353,41.9169825226364
A53,char,no,inter,262144,218453,0.83,4.00,7500,75996.56,25.87,21.56,162126.00,575.00,0.1201,9.13,0.0000,0.00,5.57080144241553,5.57080144241553,46.3846914439262
A53,char,no,inter,524288,436907,0.83,4.00,3500,76187.04,24.09,20.07,348283.62,575.00,0.1212,9.23,0.0000,0.00,6.03846681673674,6.03846681673674,49.8223334714253
A53,char,no,inter,1048576,873813,0.83,4.00,1750,81262.13,22.58,18.82,742968.12,575.00,0.1207,9.81,0.0000,0.00,6.41414782710946,6.41414782710946,53.1412413182225
,,,,,,,,,,,,,,,,,,,,
A53,char,yes,inter,128,64,0.50,2.50,19644080,30305.97,82.97,41.48,24.68,575.00,0.1056,3.20,0.0000,0.00,2.545125,2.545125,24.1015625
A53,char,yes,inter,256,128,0.50,2.50,14383232,46726.98,78.80,39.40,51.98,575.00,0.1065,4.98,0.0000,0.00,2.7030615234375,2.7030615234375,25.380859375
A53,char,yes,inter,512,256,0.50,2.50,9026992,64076.14,72.13,36.07,113.57,575.00,0.1083,6.94,0.0000,0.00,3.00283959960937,3.00283959960937,27.72705078125
A53,char,yes,inter,1024,512,0.50,2.50,4512336,75818.27,60.94,30.47,268.84,575.00,0.1153,8.74,0.0000,0.00,3.78384423828125,3.78384423828125,32.8173828125
A53,char,yes,inter,2048,1024,0.50,2.50,2072400,77368.72,54.86,27.43,597.33,575.00,0.1187,9.19,0.0000,0.00,4.32758001708984,4.32758001708984,36.4581298828125
A53,char,yes,inter,4096,2048,0.50,2.50,963264,84165.36,46.88,23.44,1398.00,575.00,0.1203,10.13,0.0000,0.00,5.13242797851563,5.13242797851563,42.66357421875
A53,char,yes,inter,8192,4096,0.50,2.50,451024,90743.09,40.72,20.36,3219.10,575.00,0.1222,11.08,0.0000,0.00,6.00241119384766,6.00241119384766,49.1195678710938
A53,char,yes,inter,16384,8192,0.50,2.50,198944,89155.85,36.56,18.28,7170.33,575.00,0.1227,10.94,0.0000,0.00,6.71233742523193,6.71233742523193,54.7052764892578
A53,char,yes,inter,32768,16384,0.50,2.50,87088,89781.66,31.78,15.89,16494.89,575.00,0.1201,10.78,0.0000,0.00,7.5570537147522,7.5570537147522,62.9230117797852
A53,char,yes,inter,65536,32768,0.50,2.50,32208,71805.80,29.40,14.70,35671.04,575.00,0.1196,8.59,0.0000,0.00,8.13723828125,8.13723828125,68.037109375
A53,char,yes,inter,131072,65536,0.50,2.50,15000,73718.27,26.67,13.34,78632.81,575.00,0.1199,8.84,0.0000,0.00,8.99131194972992,8.99131194972992,74.9900913238525
A53,char,yes,inter,262144,131072,0.50,2.50,7000,73557.77,24.95,12.47,168132.06,575.00,0.1202,8.84,0.0000,0.00,9.63662796592713,9.63662796592713,80.1716136932373
A53,char,yes,inter,524288,262144,0.50,2.50,3500,78136.23,23.48,11.74,357194.16,575.00,0.1204,9.40,0.0000,0.00,10.2534715805054,10.2534715805054,85.1617240905762
A53,char,yes,inter,1048576,524288,0.50,2.50,1750,84033.02,21.84,10.92,768301.94,575.00,0.1206,10.13,0.0000,0.00,11.0456006484032,11.0456006484032,91.588728427887
,,,,,,,,,,,,,,,,,,,,
A53,char,yes,inter,128,107,0.83,4.00,21203296,24473.09,110.90,92.70,18.47,575.00,0.1071,2.62,0.0000,0.00,1.15545385514019,1.15545385514019,10.7885514018692
A53,char,yes,inter,256,213,0.83,4.00,14939920,44028.74,86.87,72.28,47.15,575.00,0.1070,4.71,0.0000,0.00,1.48035504694836,1.48035504694836,13.8350938967136
A53,char,yes,inter,512,427,0.83,4.00,9001600,57829.12,79.70,66.47,102.79,575.00,0.1073,6.21,0.0000,0.00,1.61436870608899,1.61436870608899,15.04537470726
A53,char,yes,inter,1024,853,0.83,4.00,4298672,60915.46,72.26,60.19,226.73,575.00,0.1153,7.02,0.0000,0.00,1.91544321512309,1.91544321512309,16.6126905041032
A53,char,yes,inter,2048,1707,0.83,4.00,2383328,80921.77,60.32,50.27,543.25,575.00,0.1213,9.82,0.0000,0.00,2.4127205990041,2.4127205990041,19.8905243116579
A53,char,yes,inter,4096,3413,0.83,4.00,1038848,84124.60,50.58,42.15,1295.66,575.00,0.1214,10.21,0.0000,0.00,2.88040440961031,2.88040440961031,23.7265602109581
A53,char,yes,inter,8192,6827,0.83,4.00,480272,89849.97,43.79,36.49,2993.30,575.00,0.1234,11.09,0.0000,0.00,3.38154771495532,3.38154771495532,27.4031419364289
A53,char,yes,inter,16384,13653,0.83,4.00,214064,87845.48,39.92,33.27,6565.92,575.00,0.1231,10.81,0.0000,0.00,3.70003274005713,3.70003274005713,30.0571303010327
A53,char,yes,inter,32768,27307,0.83,4.00,92992,89495.17,34.05,28.37,15398.34,575.00,0.1208,10.82,0.0000,0.00,4.25742362764126,4.25742362764126,35.2435730765005
A53,char,yes,inter,65536,54613,0.83,4.00,32256,70123.44,30.15,25.12,34783.45,575.00,0.1208,8.47,0.0000,0.00,4.8086544870269,4.8086544870269,39.8067424422756
A53,char,yes,inter,262144,218453,0.83,4.00,7500,75768.43,25.95,21.62,161639.33,575.00,0.1206,9.13,0.0000,0.00,5.57720173160817,5.57720173160817,46.2454538275968
A53,char,yes,inter,524288,436907,0.83,4.00,3500,76093.16,24.12,20.10,347854.44,575.00,0.1216,9.25,0.0000,0.00,6.05093016133868,6.05093016133868,49.7609388267984
A53,char,yes,inter,1048576,873813,0.83,4.00,1750,82415.60,22.27,18.55,753514.06,575.00,0.1211,9.98,0.0000,0.00,6.52675062241578,6.52675062241578,53.8955460149941
