# -> Seq 8-bit, rate 1/2, no gen:
# ------|-------|-----|-------|----------|---------|------||-------|----------||-----------|---------|---------|----------|----------||----------|---------|---------|----------|---------|---------|---------|---------|
#  PROC |  TYPE | GEN |   VEC |        N |       K |    R ||   SNR |      FRA || LD+ST+DEC |    CTHR |    ITHR |  LATENCY | RUNTIME  || BIG FREQ | BIG POW | BIG ENE | LIT FREQ | LIT POW | LIT ENE | RAM POW | RAM ENE |
#       |       |     |       |          |         |      ||  (dB) |          ||      (ms) |  (Mb/s) |  (Mb/s) |     (us) | (hhmmss) ||    (Mhz) |     (W) |     (J) |    (Mhz) |     (W) |     (J) |     (W) |     (J) |
# ------|-------|-----|-------|----------|---------|------||-------|----------||-----------|---------|---------|----------|----------||----------|---------|---------|----------|---------|---------|---------|---------|
    A15 |  char |  no |   seq |     4096 |    2048 | 0.50 ||  2.50 |   106522 ||  34290.33 |   12.72 |    6.36 |   321.91 | 00h00'34 ||   900.00 |  0.6169 |   21.15 |     0.00 |  0.0104 |    0.36 |  0.0536 |    1.84
#---------
#---------
# -> Seq 8-bit, rate 1/2, gen:
# ------|-------|-----|-------|----------|---------|------||-------|----------||-----------|---------|---------|----------|----------||----------|---------|---------|----------|---------|---------|---------|---------|
#  PROC |  TYPE | GEN |   VEC |        N |       K |    R ||   SNR |      FRA || LD+ST+DEC |    CTHR |    ITHR |  LATENCY | RUNTIME  || BIG FREQ | BIG POW | BIG ENE | LIT FREQ | LIT POW | LIT ENE | RAM POW | RAM ENE |
#       |       |     |       |          |         |      ||  (dB) |          ||      (ms) |  (Mb/s) |  (Mb/s) |     (us) | (hhmmss) ||    (Mhz) |     (W) |     (J) |    (Mhz) |     (W) |     (J) |     (W) |     (J) |
# ------|-------|-----|-------|----------|---------|------||-------|----------||-----------|---------|---------|----------|----------||----------|---------|---------|----------|---------|---------|---------|---------|
    A15 |  char | yes |   seq |     4096 |    2048 | 0.50 ||  2.50 |    92647 ||  34714.24 |   10.93 |    5.47 |   374.69 | 00h00'34 ||   900.00 |  0.6110 |   21.21 |     0.00 |  0.0104 |    0.36 |  0.0526 |    1.83
#---------
#---------
# -> Intra-SIMD 8-bit, rate 1/2, no gen:
# ------|-------|-----|-------|----------|---------|------||-------|----------||-----------|---------|---------|----------|----------||----------|---------|---------|----------|---------|---------|---------|---------|
#  PROC |  TYPE | GEN |   VEC |        N |       K |    R ||   SNR |      FRA || LD+ST+DEC |    CTHR |    ITHR |  LATENCY | RUNTIME  || BIG FREQ | BIG POW | BIG ENE | LIT FREQ | LIT POW | LIT ENE | RAM POW | RAM ENE |
#       |       |     |       |          |         |      ||  (dB) |          ||      (ms) |  (Mb/s) |  (Mb/s) |     (us) | (hhmmss) ||    (Mhz) |     (W) |     (J) |    (Mhz) |     (W) |     (J) |     (W) |     (J) |
# ------|-------|-----|-------|----------|---------|------||-------|----------||-----------|---------|---------|----------|----------||----------|---------|---------|----------|---------|---------|---------|---------|
    A15 |  char |  no | intra |     4096 |    2048 | 0.50 ||  2.50 |   419152 ||  29834.77 |   57.55 |   28.77 |    71.18 | 00h00'29 ||   900.00 |  0.6986 |   20.84 |     0.00 |  0.0105 |    0.31 |  0.0519 |    1.55
#---------
#---------
# -> Intra-SIMD 8-bit, rate 1/2, gen:
# ------|-------|-----|-------|----------|---------|------||-------|----------||-----------|---------|---------|----------|----------||----------|---------|---------|----------|---------|---------|---------|---------|
#  PROC |  TYPE | GEN |   VEC |        N |       K |    R ||   SNR |      FRA || LD+ST+DEC |    CTHR |    ITHR |  LATENCY | RUNTIME  || BIG FREQ | BIG POW | BIG ENE | LIT FREQ | LIT POW | LIT ENE | RAM POW | RAM ENE |
#       |       |     |       |          |         |      ||  (dB) |          ||      (ms) |  (Mb/s) |  (Mb/s) |     (us) | (hhmmss) ||    (Mhz) |     (W) |     (J) |    (Mhz) |     (W) |     (J) |     (W) |     (J) |
# ------|-------|-----|-------|----------|---------|------||-------|----------||-----------|---------|---------|----------|----------||----------|---------|---------|----------|---------|---------|---------|---------|
    A15 |  char | yes | intra |     4096 |    2048 | 0.50 ||  2.50 |   489617 ||  29409.31 |   68.19 |   34.10 |    60.07 | 00h00'29 ||   900.00 |  0.6736 |   19.81 |     0.00 |  0.0105 |    0.31 |  0.0515 |    1.52
#---------
#---------
# -> Inter-SIMD 8-bit, rate 1/2, no gen:
# ------|-------|-----|-------|----------|---------|------||-------|----------||-----------|---------|---------|----------|----------||----------|---------|---------|----------|---------|---------|---------|---------|
#  PROC |  TYPE | GEN |   VEC |        N |       K |    R ||   SNR |      FRA || LD+ST+DEC |    CTHR |    ITHR |  LATENCY | RUNTIME  || BIG FREQ | BIG POW | BIG ENE | LIT FREQ | LIT POW | LIT ENE | RAM POW | RAM ENE |
#       |       |     |       |          |         |      ||  (dB) |          ||      (ms) |  (Mb/s) |  (Mb/s) |     (us) | (hhmmss) ||    (Mhz) |     (W) |     (J) |    (Mhz) |     (W) |     (J) |     (W) |     (J) |
# ------|-------|-----|-------|----------|---------|------||-------|----------||-----------|---------|---------|----------|----------||----------|---------|---------|----------|---------|---------|---------|---------|
    A15 |  char |  no | inter |     4096 |    2048 | 0.50 ||  2.50 |   885920 ||  37121.96 |   97.75 |   48.88 |   670.43 | 00h00'37 ||   900.00 |  0.7560 |   28.06 |     0.00 |  0.0105 |    0.39 |  0.0506 |    1.88
#---------
#---------
# -> inter-SIMD 8-bit, rate 1/2, gen:
# ------|-------|-----|-------|----------|---------|------||-------|----------||-----------|---------|---------|----------|----------||----------|---------|---------|----------|---------|---------|---------|---------|
#  PROC |  TYPE | GEN |   VEC |        N |       K |    R ||   SNR |      FRA || LD+ST+DEC |    CTHR |    ITHR |  LATENCY | RUNTIME  || BIG FREQ | BIG POW | BIG ENE | LIT FREQ | LIT POW | LIT ENE | RAM POW | RAM ENE |
#       |       |     |       |          |         |      ||  (dB) |          ||      (ms) |  (Mb/s) |  (Mb/s) |     (us) | (hhmmss) ||    (Mhz) |     (W) |     (J) |    (Mhz) |     (W) |     (J) |     (W) |     (J) |
# ------|-------|-----|-------|----------|---------|------||-------|----------||-----------|---------|---------|----------|----------||----------|---------|---------|----------|---------|---------|---------|---------|
    A15 |  char | yes | inter |     4096 |    2048 | 0.50 ||  2.50 |   963264 ||  36652.29 |  107.65 |   53.82 |   608.80 | 00h00'36 ||   900.00 |  0.7740 |   28.37 |     0.00 |  0.0105 |    0.38 |  0.0506 |    1.85
#---------
#---------
