PROC,TYPE,GEN,VEC,N,K,R,SNR (dB),FRA,LD+ST+DEC (ms),CTHR (Mbit/s),ITHR (Mbit/s),LATENCY (us),CLU_FREQ (MHz),CLU_POW (W),CLU_ENE (J),RAM_POW (W),RAM_ENE (J),EB_CLU (nJ),EB_CLU_RAM (nJ),TB_CLU (ns)
,,,,,,,,,,,,,,,,,,,,
A15,char,no,seq,128,64,0.50,2.50,1332899,11833.24,14.42,7.21,8.88,1100.00,0.8550,10.12,0.0515,0.61,118.63125,125.776875,138.75
A15,char,no,seq,256,128,0.50,2.50,1048729,16165.09,16.61,8.30,15.41,1100.00,0.8762,14.16,0.0515,0.83,105.486265625,111.6863828125,120.390625
A15,char,no,seq,512,256,0.50,2.50,699036,21123.71,16.94,8.47,30.22,1100.00,0.8775,18.54,0.0516,1.09,103.5861328125,109.6773515625,118.046875
A15,char,no,seq,1024,512,0.50,2.50,399077,25081.53,16.29,8.15,62.85,1100.00,0.8797,22.06,0.0517,1.30,107.986611328125,114.33298828125,122.75390625
A15,char,no,seq,2048,1024,0.50,2.50,213346,28005.38,15.60,7.80,131.27,1100.00,0.8959,25.09,0.0532,1.49,114.848430664063,121.668317382813,128.193359375
A15,char,no,seq,4096,2048,0.50,2.50,106522,29169.80,14.96,7.48,273.84,1100.00,0.9127,26.62,0.0557,1.62,122.03797265625,129.485671875,133.7109375
A15,char,no,seq,8192,4096,0.50,2.50,52362,31105.20,13.79,6.90,594.04,1100.00,0.9170,28.52,0.0534,1.66,132.991865234375,140.7364296875,145.029296875
A15,char,no,seq,16384,8192,0.50,2.50,24703,30391.67,13.32,6.66,1230.28,1100.00,0.9272,28.18,0.0524,1.59,139.24751171875,147.116978515625,150.1806640625
A15,char,no,seq,32768,16384,0.50,2.50,11635,30297.69,12.58,6.29,2604.01,1100.00,0.9362,28.37,0.0519,1.57,148.796030395508,157.044816955566,158.936157226562
A15,char,no,seq,65536,32768,0.50,2.50,5560,30713.75,11.86,5.93,5524.06,1100.00,0.9535,29.28,0.0515,1.58,160.741919250488,169.423837280273,168.580932617188
A15,char,no,seq,131072,65536,0.50,2.50,2500,29106.85,11.26,5.63,11642.74,1100.00,0.9672,28.15,0.0524,1.53,171.827058837891,181.136134399414,177.654113769531
A15,char,no,seq,262144,131072,0.50,2.50,1250,36110.29,9.07,4.54,28888.23,1100.00,0.9252,33.41,0.0523,1.89,203.913806121826,215.440710639954,220.399703979492
A15,char,no,seq,524288,262144,0.50,2.50,625,37026.06,8.85,4.42,59241.70,1100.00,0.9397,34.79,0.0622,2.30,212.362005195618,226.418530387878,225.989151000977
A15,char,no,seq,1048576,524288,0.50,2.50,300,40299.84,7.81,3.90,134332.81,1100.00,0.9193,37.05,0.0684,2.76,235.542587724686,253.068001626968,256.219501495361
,,,,,,,,,,,,,,,,,,,,
A15,char,no,seq,128,107,0.83,4.00,1453651,10109.83,18.40,15.39,6.95,1100.00,0.8218,8.31,0.0510,0.52,53.3785981308411,56.691214953271,64.9532710280374
A15,char,no,seq,256,213,0.83,4.00,1102321,15624.97,18.06,15.03,14.17,1100.00,0.8550,13.36,0.0508,0.79,56.8795774647887,60.2590892018779,66.5258215962441
A15,char,no,seq,512,427,0.83,4.00,752754,20236.82,19.04,15.88,26.88,1100.00,0.8605,17.41,0.0510,1.03,54.1691803278689,57.3796721311475,62.9508196721311
A15,char,no,seq,1024,853,0.83,4.00,457183,24320.02,19.25,16.04,53.20,1100.00,0.8793,21.38,0.0520,1.26,54.8402813599062,58.0834232121923,62.3681125439625
A15,char,no,seq,2048,1707,0.83,4.00,238931,27792.81,17.61,14.67,116.32,1100.00,0.8921,24.79,0.0524,1.46,60.7903175161101,64.3610076157001,68.1429408318688
A15,char,no,seq,4096,3413,0.83,4.00,118322,28977.53,16.72,13.94,244.90,1100.00,0.9032,26.17,0.0565,1.64,64.8091649575154,68.8633255200703,71.7550542045121
A15,char,no,seq,8192,6827,0.83,4.00,57604,29833.21,15.82,13.18,517.90,1100.00,0.9315,27.79,0.0537,1.60,70.6641057565548,74.7378174893804,75.8605536839022
A15,char,no,seq,16384,13653,0.83,4.00,27305,30661.52,14.59,12.16,1122.93,1100.00,0.9426,28.90,0.0525,1.61,77.5268305866843,81.8448431114041,82.2478576137113
A15,char,no,seq,32768,27307,0.83,4.00,12609,30155.46,13.70,11.42,2391.58,1100.00,0.9423,28.42,0.0518,1.56,82.5277706815102,87.0644771670268,87.581206284103
A15,char,no,seq,65536,54613,0.83,4.00,5896,30453.75,12.69,10.57,5165.15,1100.00,0.9556,29.10,0.0518,1.58,90.3780663944482,95.2771704539212,94.5772984454251
A15,char,no,seq,131072,109227,0.83,4.00,2500,27097.47,12.09,10.08,10838.99,1100.00,0.9678,26.23,0.0517,1.40,96.0382920157104,101.168669880158,99.2336143993701
A15,char,no,seq,262144,218453,0.83,4.00,1250,33861.50,9.68,8.06,27089.20,1100.00,0.9220,31.22,0.0533,1.81,114.332338763945,120.94178958403,124.004705817727
A15,char,no,seq,524288,436907,0.83,4.00,625,36292.93,9.03,7.52,58068.68,1100.00,0.9325,33.84,0.0618,2.24,123.937231722083,132.15098069841,132.908559487488
A15,char,no,seq,1048576,873813,0.83,4.00,300,39860.02,7.89,6.58,132866.72,1100.00,0.9149,36.47,0.0680,2.71,139.114160727753,149.453829466945,152.053952046948
,,,,,,,,,,,,,,,,,,,,
A15,char,yes,seq,128,64,0.50,2.50,1372446,11049.85,15.90,7.95,8.05,1100.00,0.8634,9.54,0.0511,0.56,108.59953125,115.026953125,125.78125
A15,char,yes,seq,256,128,0.50,2.50,1039196,15978.58,16.65,8.32,15.38,1100.00,0.8624,13.78,0.0512,0.82,103.62275,109.77475,120.15625
A15,char,yes,seq,512,256,0.50,2.50,672044,20821.07,16.53,8.26,30.98,1100.00,0.8763,18.24,0.0512,1.07,106.0459921875,112.2419921875,121.015625
A15,char,yes,seq,1024,512,0.50,2.50,367136,24959.04,15.06,7.53,67.98,1100.00,0.8689,21.69,0.0513,1.28,115.36683984375,122.1781171875,132.7734375
A15,char,yes,seq,2048,1024,0.50,2.50,185879,27458.32,13.86,6.93,147.72,1100.00,0.8735,23.98,0.0541,1.49,126.00919921875,133.813546875,144.2578125
A15,char,yes,seq,4096,2048,0.50,2.50,92647,28737.86,13.20,6.60,310.19,1100.00,0.8751,25.15,0.0553,1.59,132.542611816406,140.91834765625,151.4599609375
A15,char,yes,seq,8192,4096,0.50,2.50,44280,28959.87,12.53,6.26,654.02,1100.00,0.9035,26.16,0.0531,1.54,144.264421386719,152.743049804688,159.6728515625
A15,char,yes,seq,16384,8192,0.50,2.50,20875,30308.08,11.28,5.64,1451.88,1100.00,0.9209,27.91,0.0521,1.58,163.212437988281,172.446196289063,177.2314453125
A15,char,yes,seq,32768,16384,0.50,2.50,9828,29864.89,10.78,5.39,3038.76,1100.00,0.9284,27.73,0.0517,1.54,172.191454101562,181.780314697266,185.47119140625
A15,char,yes,seq,65536,32768,0.50,2.50,4714,31214.94,9.90,4.95,6621.75,1100.00,0.9384,29.29,0.0514,1.60,189.631658935547,200.018559265137,202.079772949219
A15,char,yes,seq,131072,65536,0.50,2.50,2500,34881.88,9.39,4.70,13952.75,1100.00,0.9519,33.20,0.0517,1.80,202.661479568481,213.668516540527,212.902069091797
A15,char,yes,seq,262144,131072,0.50,2.50,1250,45880.63,7.14,3.57,36704.50,1100.00,0.9248,42.43,0.0552,2.53,258.974621582031,274.43244934082,280.033111572266
A15,char,yes,seq,524288,262144,0.50,2.50,625,49559.74,6.61,3.31,79295.59,1100.00,0.9256,45.87,0.0644,3.19,279.983513275146,299.46378364563,302.488670349121
A15,char,yes,seq,1048576,524288,0.50,2.50,300,51423.37,6.12,3.06,171411.23,1100.00,0.9234,47.49,0.0675,3.47,301.897296489716,323.965812314987,326.940975189209
,,,,,,,,,,,,,,,,,,,,
A15,char,yes,seq,128,107,0.83,4.00,1468511,9586.52,19.61,16.39,6.53,1100.00,0.8340,8.00,0.0511,0.49,50.8973831775701,54.0159158878505,61.0280373831776
A15,char,yes,seq,256,213,0.83,4.00,1089749,14819.65,18.82,15.66,13.60,1100.00,0.8547,12.67,0.0509,0.75,54.5723943661972,57.8223474178404,63.849765258216
A15,char,yes,seq,512,427,0.83,4.00,718502,19549.85,18.82,15.69,27.21,1100.00,0.8658,16.93,0.0512,1.00,55.1719391100703,58.4345901639344,63.7236533957846
A15,char,yes,seq,1024,853,0.83,4.00,417855,24136.60,17.73,14.77,57.76,1100.00,0.8576,20.70,0.0513,1.24,58.0714841735053,61.5452098475967,67.7139507620164
A15,char,yes,seq,2048,1707,0.83,4.00,210135,27196.46,15.82,13.19,129.42,1100.00,0.8599,23.38,0.0550,1.50,65.195230228471,69.3651775043937,75.817223198594
A15,char,yes,seq,4096,3413,0.83,4.00,101774,28861.27,14.44,12.04,283.58,1100.00,0.9034,26.07,0.0549,1.58,75.0618728391445,79.6234145912687,83.0881922062702
A15,char,yes,seq,8192,6827,0.83,4.00,48800,29255.57,13.66,11.39,599.50,1100.00,0.8909,26.06,0.0533,1.56,78.232686392266,82.9131243591622,87.8130950637176
A15,char,yes,seq,16384,13653,0.83,4.00,22830,29314.57,12.76,10.63,1284.04,1100.00,0.9348,27.40,0.0523,1.53,87.9162522522523,92.834972826485,94.0481945359994
A15,char,yes,seq,32768,27307,0.83,4.00,10570,30446.22,11.38,9.48,2880.44,1100.00,0.9409,28.65,0.0517,1.57,99.249496319625,104.70299718021,105.483575639946
A15,char,yes,seq,65536,54613,0.83,4.00,4895,30433.47,10.54,8.78,6217.26,1100.00,0.9426,28.69,0.0516,1.57,107.307587497482,113.181841173347,113.842125501254
A15,char,yes,seq,131072,109227,0.83,4.00,2500,34623.19,9.46,7.89,13849.28,1100.00,0.9432,32.65,0.0517,1.79,119.591684253893,126.146911221584,126.793558369268
A15,char,yes,seq,262144,218453,0.83,4.00,1250,43393.70,7.55,6.29,34714.96,1100.00,0.9249,40.14,0.0557,2.42,146.978372940633,155.829811336992,158.912718067502
A15,char,yes,seq,524288,436907,0.83,4.00,625,48174.09,6.80,5.67,77078.54,1100.00,0.9267,44.64,0.0638,3.07,163.487156346774,174.742665761821,176.418642869077
A15,char,yes,seq,1048576,873813,0.83,4.00,300,51183.49,6.15,5.12,170611.64,1100.00,0.9207,47.12,0.0679,3.47,179.766308063625,193.023756002715,195.249601459351
,,,,,,,,,,,,,,,,,,,,
A15,char,no,intra,128,64,0.50,2.50,1628908,7403.78,28.16,14.08,4.55,1100.00,0.8410,6.23,0.0508,0.38,59.78984375,63.40140625,71.09375
A15,char,no,intra,256,128,0.50,2.50,1482148,9201.26,41.24,20.62,6.21,1100.00,0.8602,7.92,0.0511,0.47,41.733140625,44.2122890625,48.515625
A15,char,no,intra,512,256,0.50,2.50,1287237,12211.55,53.97,26.99,9.49,1100.00,0.8892,10.86,0.0508,0.62,32.962921875,34.84609375,37.0703125
A15,char,no,intra,1024,512,0.50,2.50,979960,16654.62,60.25,30.13,17.00,1100.00,0.9779,16.29,0.0513,0.86,32.4693359375,34.17265625,33.203125
A15,char,no,intra,2048,1024,0.50,2.50,657025,20152.43,66.77,33.39,30.67,1100.00,0.9414,18.97,0.0524,1.06,28.196033203125,29.765474609375,29.951171875
A15,char,no,intra,4096,2048,0.50,2.50,419152,24403.11,70.35,35.18,58.22,1100.00,0.9912,24.19,0.0548,1.34,28.1775703125,29.73541015625,28.427734375
A15,char,no,intra,8192,4096,0.50,2.50,234743,25984.81,74.01,37.00,110.69,1100.00,1.0348,26.89,0.0570,1.48,27.9643583984375,29.5047221679687,27.02392578125
A15,char,no,intra,16384,8192,0.50,2.50,121493,27555.29,72.24,36.12,226.81,1100.00,1.0476,28.87,0.0575,1.58,29.0046577148438,30.5966468505859,27.686767578125
A15,char,no,intra,32768,16384,0.50,2.50,61018,28774.37,69.49,34.74,471.57,1100.00,1.0705,30.80,0.0549,1.58,30.8115042114258,32.3916551513672,28.7823486328125
A15,char,no,intra,65536,32768,0.50,2.50,29966,28525.59,68.85,34.42,951.93,1100.00,1.0981,31.32,0.0541,1.54,31.9004618225098,33.4720991821289,29.0505981445312
A15,char,no,intra,131072,65536,0.50,2.50,15000,31655.71,62.11,31.05,2110.38,1100.00,1.0974,34.74,0.0533,1.69,35.3383027954102,37.0546610412598,32.2018432617188
A15,char,no,intra,262144,131072,0.50,2.50,7000,35163.16,52.19,26.09,5023.31,1100.00,1.0731,37.73,0.0534,1.88,41.1263577346802,43.1729027938843,38.3248138427734
A15,char,no,intra,524288,262144,0.50,2.50,3500,38037.66,48.24,24.12,10867.90,1100.00,1.0500,39.94,0.0757,2.88,43.5306358337402,46.6689873886108,41.4577484130859
A15,char,no,intra,1048576,524288,0.50,2.50,1750,45056.80,40.73,20.36,25746.74,1100.00,1.0187,45.90,0.0978,4.41,50.0263291130066,54.8290924263,49.1080093383789
,,,,,,,,,,,,,,,,,,,,
A15,char,no,intra,128,107,0.83,4.00,1739009,6148.15,36.20,30.27,3.54,1100.00,0.8517,5.24,0.0506,0.31,28.177738317757,29.8517943925234,33.0841121495327
A15,char,no,intra,256,213,0.83,4.00,1549709,8251.26,48.08,40.00,5.32,1100.00,0.8659,7.14,0.0507,0.42,21.6271737089202,22.8934835680751,24.9765258215962
A15,char,no,intra,512,427,0.83,4.00,1373013,11059.11,63.57,53.01,8.05,1100.00,0.8787,9.72,0.0508,0.56,16.5656557377049,17.5233606557377,18.8524590163934
A15,char,no,intra,1024,853,0.83,4.00,1137199,14626.41,79.62,66.32,12.86,1100.00,0.9165,13.41,0.0510,0.75,13.8173388042204,14.586225087925,15.0762016412661
A15,char,no,intra,2048,1707,0.83,4.00,788585,18689.82,86.41,72.02,23.70,1100.00,0.9299,17.38,0.0521,0.97,12.9107381370826,13.6340949033392,13.884007029877
A15,char,no,intra,4096,3413,0.83,4.00,503777,22741.05,90.74,75.61,45.14,1100.00,1.0195,23.18,0.0528,1.20,13.4838060357457,14.1821336067975,13.2259009668913
A15,char,no,intra,8192,6827,0.83,4.00,290048,25732.89,92.34,76.95,88.72,1100.00,1.0376,26.70,0.0570,1.47,13.4840884722426,14.2248296469899,12.9954592060935
A15,char,no,intra,16384,13653,0.83,4.00,146841,26963.38,89.23,74.35,183.62,1100.00,1.0746,28.97,0.0590,1.59,14.4523586025049,15.2458530725848,13.4490588149125
A15,char,no,intra,32768,27307,0.83,4.00,73239,28670.59,83.71,69.76,391.47,1100.00,1.0881,31.20,0.0553,1.59,15.5988760024902,16.3916504193064,14.3358845717215
A15,char,no,intra,65536,54613,0.83,4.00,35138,28723.77,80.17,66.81,817.46,1100.00,1.0956,31.47,0.0544,1.56,16.3991938915643,17.2134656583597,14.9682310072693
A15,char,no,intra,131072,109227,0.83,4.00,15000,26579.03,73.97,61.64,1771.94,1100.00,1.0958,29.13,0.0539,1.43,17.7766655863477,18.6510607999854,16.2225457075631
A15,char,no,intra,262144,218453,0.83,4.00,7500,32243.24,60.98,50.81,4299.10,1100.00,1.0788,34.78,0.0538,1.74,21.230512192554,22.2892826374552,19.6797480464906
A15,char,no,intra,524288,436907,0.83,4.00,3500,35131.15,52.23,43.53,10037.47,1100.00,1.0503,36.90,0.0766,2.69,24.1295166728846,25.8893195645755,22.9739280899596
A15,char,no,intra,1048576,873813,0.83,4.00,1750,42651.04,43.02,35.85,24372.03,1100.00,1.0148,43.28,0.0971,4.14,28.304380964806,31.0126539167991,27.8915854994146
,,,,,,,,,,,,,,,,,,,,
A15,char,yes,intra,128,64,0.50,2.50,1698069,6562.97,33.12,16.56,3.86,1100.00,0.7941,5.21,0.0506,0.33,47.89415625,50.94596875,60.3125
A15,char,yes,intra,256,128,0.50,2.50,1572445,8474.08,47.50,23.75,5.39,1100.00,0.8366,7.09,0.0509,0.43,35.228703125,37.3720703125,42.109375
A15,char,yes,intra,512,256,0.50,2.50,1381377,11068.79,63.90,31.95,8.01,1100.00,0.8757,9.69,0.0510,0.56,27.39983203125,28.99557421875,31.2890625
A15,char,yes,intra,1024,512,0.50,2.50,1074590,15161.35,72.58,36.29,14.11,1100.00,0.8775,13.30,0.0516,0.78,24.182666015625,25.604689453125,27.55859375
A15,char,yes,intra,2048,1024,0.50,2.50,769737,19308.11,81.65,40.82,25.08,1100.00,0.9247,17.85,0.0511,0.99,22.64792578125,23.8994765625,24.4921875
A15,char,yes,intra,4096,2048,0.50,2.50,489617,23201.06,86.44,43.22,47.39,1100.00,0.9768,22.66,0.0538,1.25,22.60280859375,23.8477216796875,23.1396484375
A15,char,yes,intra,8192,4096,0.50,2.50,275797,26902.08,83.98,41.99,97.54,1100.00,1.0221,27.50,0.0572,1.54,24.3397543945313,25.7018852539063,23.8134765625
A15,char,yes,intra,16384,8192,0.50,2.50,142854,30581.75,76.53,38.27,214.08,1100.00,1.0370,31.71,0.0577,1.77,27.0997265625,28.60758984375,26.1328125
A15,char,yes,intra,32768,16384,0.50,2.50,68860,32108.25,70.27,35.14,466.28,1100.00,1.0497,33.70,0.0547,1.76,29.8739084472656,31.4306416015625,28.45947265625
A15,char,yes,intra,65536,32768,0.50,2.50,34752,29716.62,76.64,38.32,855.11,1100.00,1.0798,32.09,0.0540,1.60,28.1783379516602,29.5875158081055,26.0958862304688
A15,char,yes,intra,131072,65536,0.50,2.50,15000,27308.87,71.99,36.00,1820.59,1100.00,1.0880,29.71,0.0538,1.47,30.224638671875,31.7192026062012,27.7799987792969
A15,char,yes,intra,262144,131072,0.50,2.50,7000,31169.19,58.87,29.44,4452.74,1100.00,1.0674,33.27,0.0536,1.67,36.2614034729004,38.0822871398926,33.9717102050781
A15,char,yes,intra,524288,262144,0.50,2.50,3500,38038.44,48.24,24.12,10868.13,1100.00,1.0223,38.89,0.0829,3.15,42.3831531486511,45.8200732269287,41.458625793457
A15,char,yes,intra,1048576,524288,0.50,2.50,1750,42196.51,43.49,21.74,24112.29,1100.00,1.0017,42.27,0.1035,4.37,46.0687272891998,50.8287485275269,45.9905433654785
,,,,,,,,,,,,,,,,,,,,
A15,char,yes,intra,128,107,0.83,4.00,1765946,5667.88,39.88,33.34,3.21,1100.00,0.7792,4.42,0.0509,0.29,23.376,24.903,30
A15,char,yes,intra,256,213,0.83,4.00,1622879,7625.25,54.48,45.33,4.70,1100.00,0.8143,6.21,0.0511,0.39,17.9681220657277,19.0956807511737,22.0657276995305
A15,char,yes,intra,512,427,0.83,4.00,1446105,9663.93,76.62,63.90,6.68,1100.00,0.8689,8.40,0.0512,0.50,13.5930960187354,14.3940702576112,15.6440281030445
A15,char,yes,intra,1024,853,0.83,4.00,1198370,13324.23,92.10,76.72,11.12,1100.00,0.9246,12.32,0.0511,0.68,12.0534021101993,12.7195592028136,13.0363423212192
A15,char,yes,intra,2048,1707,0.83,4.00,890666,17970.84,101.50,84.60,20.18,1100.00,0.9046,16.26,0.0519,0.93,10.6940995899238,11.3076567076743,11.8219097832455
A15,char,yes,intra,4096,3413,0.83,4.00,561429,22400.29,102.66,85.54,39.90,1100.00,0.9871,22.11,0.0537,1.20,11.539786111925,12.1675710518605,11.6905947846469
A15,char,yes,intra,8192,6827,0.83,4.00,321341,24523.47,107.34,89.46,76.32,1100.00,1.0176,24.95,0.0563,1.38,11.3758945363996,12.0052802109272,11.1791416434744
A15,char,yes,intra,16384,13653,0.83,4.00,170937,27849.62,100.56,83.80,162.92,1100.00,1.0566,29.43,0.0594,1.65,12.6083111404087,13.3171259063942,11.9329085182744
A15,char,yes,intra,32768,27307,0.83,4.00,79535,28443.85,91.63,76.36,357.63,1100.00,1.0696,30.42,0.0555,1.58,14.0081681620097,14.7350317867214,13.0966418866957
A15,char,yes,intra,65536,54613,0.83,4.00,39967,29006.82,90.30,75.25,725.77,1100.00,1.1043,32.03,0.0547,1.59,14.6754034936737,15.4023296650981,13.289326717082
A15,char,yes,intra,131072,109227,0.83,4.00,15000,23368.48,84.13,70.11,1557.90,1100.00,1.1006,25.72,0.0545,1.27,15.6978104314867,16.4751415858716,14.2629569611909
A15,char,yes,intra,262144,218453,0.83,4.00,7500,30387.90,64.70,53.92,4051.72,1100.00,1.0774,32.74,0.0541,1.64,19.9828939314177,20.9863045140145,18.5473305470742
A15,char,yes,intra,524288,436907,0.83,4.00,3500,33898.97,54.13,45.11,9685.42,1100.00,1.0440,35.39,0.0783,2.65,23.1435488101587,24.8793149709206,22.1681502013014
A15,char,yes,intra,1048576,873813,0.83,4.00,1750,40480.03,45.33,37.78,23131.45,1100.00,1.0117,40.95,0.1034,4.18,26.7815745073603,29.5187641921098,26.4718538176933
,,,,,,,,,,,,,,,,,,,,
A15,char,no,inter,128,64,0.50,2.50,18706160,14083.81,170.01,85.01,12.05,1100.00,0.9528,13.42,0.0511,0.72,11.2121484375,11.8134716796875,11.767578125
A15,char,no,inter,256,128,0.50,2.50,13180784,17880.03,188.72,94.36,21.70,1100.00,0.9886,17.68,0.0507,0.91,10.474912109375,11.0121142578125,10.595703125
A15,char,no,inter,512,256,0.50,2.50,8149008,22846.56,182.62,91.31,44.86,1100.00,1.0032,22.92,0.0508,1.16,10.9871953125,11.543564453125,10.9521484375
A15,char,no,inter,1024,512,0.50,2.50,3781824,23847.20,162.39,81.20,100.89,1100.00,1.0741,25.61,0.0508,1.21,13.2282652587891,13.8539014892578,12.315673828125
A15,char,no,inter,2048,1024,0.50,2.50,1895728,27728.04,140.02,70.01,234.03,1100.00,1.0746,29.80,0.0511,1.42,15.3496483154297,16.079563659668,14.2840576171875
A15,char,no,inter,4096,2048,0.50,2.50,885920,28880.33,125.65,62.82,521.59,1100.00,1.0926,31.55,0.0510,1.47,17.3916392211914,18.2034400634766,15.9176635742188
A15,char,no,inter,8192,4096,0.50,2.50,421488,28972.10,119.18,59.59,1099.80,1100.00,1.1082,32.11,0.0513,1.49,18.5973870849609,19.458283996582,16.7816162109375
A15,char,no,inter,16384,8192,0.50,2.50,188736,28364.41,109.02,54.51,2404.58,1100.00,1.0978,31.14,0.0513,1.45,20.1396783752441,21.0808019866943,18.3454895019531
A15,char,no,inter,32768,16384,0.50,2.50,82496,30700.49,88.05,44.03,5954.32,1100.00,1.0608,32.57,0.0647,1.99,24.0949350585937,25.5645262145996,22.7139282226562
A15,char,no,inter,65536,32768,0.50,2.50,30624,30666.45,65.45,32.72,16022.18,1100.00,0.9744,29.88,0.1038,3.18,29.7775501098633,32.949665977478,30.5598831176758
A15,char,no,inter,131072,65536,0.50,2.50,15000,31216.28,62.98,31.49,33297.37,1100.00,0.9805,30.61,0.1205,3.76,31.1356270647049,34.9620860767365,31.754846572876
A15,char,no,inter,262144,131072,0.50,2.50,7000,31575.02,58.12,29.06,72171.48,1100.00,1.0039,31.70,0.1251,3.95,34.5482581958771,38.8534550285339,34.4140434265137
A15,char,no,inter,524288,262144,0.50,2.50,3500,33950.94,54.05,27.02,155204.28,1100.00,1.0077,34.21,0.1339,4.55,37.2885115041733,42.2432913894653,37.0035839080811
A15,char,no,inter,1048576,524288,0.50,2.50,1750,35682.42,51.43,25.71,326239.28,1100.00,0.9989,35.64,0.1419,5.06,38.8479729642868,44.3665707855225,38.8907527923584
,,,,,,,,,,,,,,,,,,,,
A15,char,no,inter,128,107,0.83,4.00,20592832,12269.93,214.82,179.58,9.53,1100.00,0.9925,12.18,0.0509,0.63,5.52483936915888,5.80817873831776,5.56658878504673
A15,char,no,inter,256,213,0.83,4.00,14286336,17426.12,209.87,174.62,19.52,1100.00,0.9701,16.90,0.0508,0.89,5.55644131455399,5.84740845070422,5.72769953051643
A15,char,no,inter,512,427,0.83,4.00,7631728,19889.38,196.46,163.84,41.70,1100.00,1.0299,20.48,0.0509,1.01,6.28612851288056,6.59680327868853,6.1036299765808
A15,char,no,inter,1024,853,0.83,4.00,4583760,26763.28,175.38,146.09,93.42,1100.00,1.0561,28.27,0.0510,1.37,7.22896116647128,7.57805407385698,6.84495896834701
A15,char,no,inter,2048,1707,0.83,4.00,2104272,28049.00,153.64,128.06,213.27,1100.00,1.0777,30.23,0.0509,1.43,8.41538807117751,8.81284863796134,7.80865553602812
A15,char,no,inter,4096,3413,0.83,4.00,961296,29350.74,134.15,111.78,488.52,1100.00,1.1012,32.32,0.0511,1.50,9.85127131555816,10.3084089510694,8.94594198652212
A15,char,no,inter,8192,6827,0.83,4.00,455600,29123.18,128.15,106.80,1022.76,1100.00,1.1013,32.07,0.0510,1.49,10.3116814486597,10.7892041526293,9.36319027391241
A15,char,no,inter,16384,13653,0.83,4.00,207968,31177.70,109.29,91.07,2398.65,1100.00,1.0852,33.83,0.0511,1.59,11.9159478686003,12.4770471462316,10.9804163920018
A15,char,no,inter,32768,27307,0.83,4.00,86624,31235.68,90.87,75.73,5769.43,1100.00,1.0462,32.68,0.0724,2.26,13.8150878575091,14.7711310240964,13.2050161130846
A15,char,no,inter,65536,54613,0.83,4.00,31392,30359.79,67.76,56.47,15473.90,1100.00,0.9694,29.43,0.1031,3.13,17.1666987026898,18.9924534337063,17.708581290169
A15,char,no,inter,131072,109227,0.83,4.00,15000,30540.13,64.38,53.65,32576.14,1100.00,0.9906,30.25,0.1186,3.62,18.4649424386827,20.6756654078204,18.6401599421389
A15,char,no,inter,262144,218453,0.83,4.00,7500,32340.15,60.79,50.66,68992.33,1100.00,1.0032,32.44,0.1329,4.30,19.8020585251748,22.4253575463029,19.7388940641694
A15,char,no,inter,524288,436907,0.83,4.00,3500,32978.04,55.64,46.37,150756.73,1100.00,0.9928,32.74,0.1353,4.46,21.4106322318022,24.3284994164948,21.5659067604776
A15,char,no,inter,1048576,873813,0.83,4.00,1750,34948.53,52.51,43.76,319529.44,1100.00,1.0085,35.25,0.1454,5.08,23.0487987876125,26.3718482112305,22.8545352380887
,,,,,,,,,,,,,,,,,,,,
A15,char,yes,inter,128,64,0.50,2.50,19644080,13392.92,187.74,93.87,10.91,1100.00,0.9514,12.74,0.0510,0.68,10.136498046875,10.6798671875,10.654296875
A15,char,yes,inter,256,128,0.50,2.50,14383232,18067.87,203.79,101.90,20.10,1100.00,0.9860,17.81,0.0512,0.92,9.67705078125,10.17955078125,9.814453125
A15,char,yes,inter,512,256,0.50,2.50,9026992,22701.32,203.59,101.80,40.24,1100.00,1.0258,23.29,0.0508,1.15,10.07768359375,10.57675390625,9.82421875
A15,char,yes,inter,1024,512,0.50,2.50,4512336,25782.06,179.22,89.61,91.42,1100.00,1.0678,27.53,0.0508,1.31,11.9162934570313,12.4832045898438,11.15966796875
A15,char,yes,inter,2048,1024,0.50,2.50,2072400,27096.04,156.64,78.32,209.20,1100.00,1.1014,29.84,0.0510,1.38,14.0632861328125,14.714482421875,12.7685546875
A15,char,yes,inter,4096,2048,0.50,2.50,963264,29073.52,135.71,67.85,482.92,1100.00,1.1144,32.40,0.0509,1.48,16.4235244140625,17.1736656494141,14.737548828125
A15,char,yes,inter,8192,4096,0.50,2.50,451024,29784.58,124.05,62.03,1056.60,1100.00,1.1271,33.57,0.0509,1.52,18.1715982055664,18.9922302246094,16.1224365234375
A15,char,yes,inter,16384,8192,0.50,2.50,198944,29866.52,109.14,54.57,2402.00,1100.00,1.1107,33.17,0.0525,1.57,20.3544723510742,21.3165771484375,18.3258056640625
A15,char,yes,inter,32768,16384,0.50,2.50,87088,30145.66,94.66,47.33,5538.43,1100.00,1.0758,32.43,0.0688,2.07,22.7288932571411,24.1824607009888,21.1274337768555
A15,char,yes,inter,65536,32768,0.50,2.50,32208,30806.68,68.52,34.26,15303.87,1100.00,0.9775,30.11,0.1072,3.30,28.5330446720123,31.6621928958893,29.1898155212402
A15,char,yes,inter,131072,65536,0.50,2.50,15000,32148.67,61.16,30.58,34291.92,1100.00,0.9708,31.21,0.1231,3.96,31.7483863220215,35.7741654281616,32.7033233642578
A15,char,yes,inter,262144,131072,0.50,2.50,7000,31405.16,58.43,29.22,71783.21,1100.00,0.9876,31.02,0.1319,4.14,33.8044634799957,38.3192556357384,34.2289018630981
A15,char,yes,inter,524288,262144,0.50,2.50,3500,36304.72,50.54,25.27,165964.44,1100.00,0.9671,35.11,0.1389,5.04,38.267185669899,43.7633205986023,39.5690059661865
A15,char,yes,inter,1048576,524288,0.50,2.50,1750,39167.68,46.85,23.43,358104.47,1100.00,0.9655,37.82,0.1415,5.54,41.2165958625078,47.2571430552006,42.6893794536591
,,,,,,,,,,,,,,,,,,,,
A15,char,yes,inter,128,107,0.83,4.00,21203296,11554.90,234.88,196.35,8.72,1100.00,0.9058,10.47,0.0514,0.59,4.61365420560748,4.87545794392523,5.09345794392523
A15,char,yes,inter,256,213,0.83,4.00,14939920,16850.26,226.98,188.85,18.05,1100.00,0.9997,16.84,0.0511,0.86,5.29477259389671,5.56541666666667,5.29636150234742
A15,char,yes,inter,512,427,0.83,4.00,9001600,22149.50,208.08,173.53,39.37,1100.00,1.0505,23.27,0.0510,1.13,6.05359850702576,6.34749048594848,5.76258782201405
A15,char,yes,inter,1024,853,0.83,4.00,4298672,23940.38,183.87,153.16,89.11,1100.00,1.0874,26.03,0.0511,1.22,7.09981052168816,7.4334506887456,6.52916178194607
A15,char,yes,inter,2048,1707,0.83,4.00,2383328,29463.87,165.66,138.08,197.80,1100.00,1.0838,31.93,0.0509,1.50,7.8491373755126,8.2177672817809,7.24223784417106
A15,char,yes,inter,4096,3413,0.83,4.00,1038848,29466.98,144.40,120.32,453.84,1100.00,1.1187,32.97,0.0512,1.51,9.29737049516554,9.72288704951655,8.31087020216818
A15,char,yes,inter,8192,6827,0.83,4.00,480272,30256.24,130.04,108.37,1007.97,1100.00,1.1175,33.81,0.0510,1.54,10.3120557620478,10.7826730719936,9.22779039109419
A15,char,yes,inter,16384,13653,0.83,4.00,214064,29224.61,120.01,100.01,2184.36,1100.00,1.1154,32.60,0.0512,1.50,11.1533872775214,11.6653591518348,9.99945067018238
A15,char,yes,inter,32768,27307,0.83,4.00,92992,31826.23,95.74,79.79,5475.95,1100.00,1.0523,33.49,0.0759,2.41,13.1887935900135,14.14007120427,12.5333019006116
A15,char,yes,inter,65536,54613,0.83,4.00,32256,30395.35,69.55,57.96,15077.06,1100.00,0.9709,29.51,0.1058,3.22,16.7523272320693,18.5778460508487,17.2544311793895
A15,char,yes,inter,262144,218453,0.83,4.00,7500,32948.74,59.67,49.73,70290.65,1100.00,0.9774,32.21,0.1327,4.37,19.6558531211519,22.3244961630763,20.1103469625045
A15,char,yes,inter,524288,436907,0.83,4.00,3500,35047.36,52.36,43.63,160216.50,1100.00,0.9650,33.82,0.1390,4.87,22.1169668974175,25.3027268961129,22.9191366812617
A15,char,yes,inter,1048576,873813,0.83,4.00,1750,38488.65,47.68,39.73,351896.25,1100.00,0.9599,36.95,0.1464,5.63,24.1602901861582,27.8451182758067,25.1695907762874
