# -> Seq 8-bit, rate 1/2, no gen:
# ------|-------|-----|-------|--------|--------|------||-------|----------||-----------|---------|---------|----------|----------||----------|---------|---------|----------|---------|---------|---------|---------|
#  PROC |  TYPE | GEN |   VEC |      N |      K |    R ||   SNR |      FRA || LD+ST+DEC |    CTHR |    ITHR |  LATENCY | RUNTIME  || BIG FREQ | BIG POW | BIG ENE | LIT FREQ | LIT POW | LIT ENE | RAM POW | RAM ENE |
#       |       |     |       |        |        |      ||  (dB) |          ||      (ms) |  (Mb/s) |  (Mb/s) |     (us) | (hhmmss) ||    (Mhz) |     (W) |     (J) |    (Mhz) |     (W) |     (J) |     (W) |     (J) |
# ------|-------|-----|-------|--------|--------|------||-------|----------||-----------|---------|---------|----------|----------||----------|---------|---------|----------|---------|---------|---------|---------|
    A15 |  char |  no |   seq |    128 |     64 | 0.50 ||  2.50 |  1332899 ||   8567.15 |   19.91 |    9.96 |     6.43 | 00h00'08 ||  1600.00 |  1.7379 |   14.89 |     0.00 |  0.0203 |    0.17 |  0.0512 |    0.44
    A15 |  char |  no |   seq |    256 |    128 | 0.50 ||  2.50 |  1048729 ||  11490.55 |   23.36 |   11.68 |    10.96 | 00h00'11 ||  1600.00 |  1.7809 |   20.46 |     0.00 |  0.0208 |    0.24 |  0.0509 |    0.58
    A15 |  char |  no |   seq |    512 |    256 | 0.50 ||  2.50 |   699036 ||  14833.90 |   24.13 |   12.06 |    21.22 | 00h00'14 ||  1600.00 |  1.8311 |   27.16 |     0.00 |  0.0206 |    0.31 |  0.0510 |    0.76
    A15 |  char |  no |   seq |   1024 |    512 | 0.50 ||  2.50 |   399077 ||  17395.01 |   23.49 |   11.75 |    43.59 | 00h00'17 ||  1600.00 |  1.8433 |   32.06 |     0.00 |  0.0207 |    0.36 |  0.0510 |    0.89
    A15 |  char |  no |   seq |   2048 |   1024 | 0.50 ||  2.50 |   213346 ||  19457.96 |   22.46 |   11.23 |    91.20 | 00h00'19 ||  1600.00 |  1.8636 |   36.26 |     0.00 |  0.0205 |    0.40 |  0.0586 |    1.14
    A15 |  char |  no |   seq |   4096 |   2048 | 0.50 ||  2.50 |   106522 ||  19994.98 |   21.82 |   10.91 |   187.71 | 00h00'20 ||  1600.00 |  1.8728 |   37.45 |     0.00 |  0.0201 |    0.40 |  0.0576 |    1.15
    A15 |  char |  no |   seq |   8192 |   4096 | 0.50 ||  2.50 |    52362 ||  20669.40 |   20.75 |   10.38 |   394.74 | 00h00'20 ||  1600.00 |  1.9348 |   39.99 |     0.00 |  0.0204 |    0.42 |  0.0543 |    1.12
    A15 |  char |  no |   seq |  16384 |   8192 | 0.50 ||  2.50 |    24703 ||  20857.45 |   19.40 |    9.70 |   844.33 | 00h00'21 ||  1600.00 |  1.9415 |   40.50 |     0.00 |  0.0202 |    0.42 |  0.0528 |    1.10
    A15 |  char |  no |   seq |  32768 |  16384 | 0.50 ||  2.50 |    11635 ||  20803.54 |   18.33 |    9.16 |  1788.01 | 00h00'21 ||  1600.00 |  1.9976 |   41.56 |     0.00 |  0.0200 |    0.42 |  0.0522 |    1.09
    A15 |  char |  no |   seq |  65536 |  32768 | 0.50 ||  2.50 |     5560 ||  20940.37 |   17.40 |    8.70 |  3766.25 | 00h00'21 ||  1600.00 |  1.9955 |   41.79 |     0.00 |  0.0199 |    0.42 |  0.0516 |    1.08
    A15 |  char |  no |   seq |   131072 |   65536 | 0.50 ||  2.50 |     2500 ||  20135.47 |   16.27 |    8.14 |  8054.19 | 00h00'21 ||  1600.00 |  2.0386 |   41.05 |     0.00 |  0.0207 |    0.42 |  0.0518 |    1.04
    A15 |  char |  no |   seq |   262144 |  131072 | 0.50 ||  2.50 |     1250 ||  24935.00 |   13.14 |    6.57 | 19948.00 | 00h00'27 ||  1600.00 |  1.9537 |   48.71 |     0.00 |  0.0206 |    0.51 |  0.0520 |    1.30
    A15 |  char |  no |   seq |   524288 |  262144 | 0.50 ||  2.50 |      625 ||  25406.50 |   12.90 |    6.45 | 40650.40 | 00h00'29 ||  1600.00 |  1.9684 |   50.01 |     0.00 |  0.0207 |    0.52 |  0.0617 |    1.57
    A15 |  char |  no |   seq |  1048576 |  524288 | 0.50 ||  2.50 |      300 ||  28030.22 |   11.22 |    5.61 | 93434.08 | 00h00'36 ||  1600.00 |  1.9271 |   54.02 |     0.00 |  0.0201 |    0.56 |  0.0717 |    2.01
#---------
#---------
# -> Seq 8-bit, rate 5/6, no gen:
# ------|-------|-----|-------|--------|--------|------||-------|----------||-----------|---------|---------|----------|----------||----------|---------|---------|----------|---------|---------|---------|---------|
#  PROC |  TYPE | GEN |   VEC |      N |      K |    R ||   SNR |      FRA || LD+ST+DEC |    CTHR |    ITHR |  LATENCY | RUNTIME  || BIG FREQ | BIG POW | BIG ENE | LIT FREQ | LIT POW | LIT ENE | RAM POW | RAM ENE |
#       |       |     |       |        |        |      ||  (dB) |          ||      (ms) |  (Mb/s) |  (Mb/s) |     (us) | (hhmmss) ||    (Mhz) |     (W) |     (J) |    (Mhz) |     (W) |     (J) |     (W) |     (J) |
# ------|-------|-----|-------|--------|--------|------||-------|----------||-----------|---------|---------|----------|----------||----------|---------|---------|----------|---------|---------|---------|---------|
    A15 |  char |  no |   seq |    128 |    107 | 0.83 ||  4.00 |  1453651 ||   7561.71 |   24.61 |   20.57 |     5.20 | 00h00'07 ||  1600.00 |  1.6779 |   12.69 |     0.00 |  0.0197 |    0.15 |  0.0506 |    0.38
    A15 |  char |  no |   seq |    256 |    213 | 0.83 ||  4.00 |  1102321 ||  11253.50 |   25.08 |   20.86 |    10.21 | 00h00'11 ||  1600.00 |  1.7564 |   19.77 |     0.00 |  0.0197 |    0.22 |  0.0506 |    0.57
    A15 |  char |  no |   seq |    512 |    427 | 0.83 ||  4.00 |   752754 ||  14319.37 |   26.92 |   22.45 |    19.02 | 00h00'14 ||  1600.00 |  1.8293 |   26.20 |     0.00 |  0.0198 |    0.28 |  0.0505 |    0.72
    A15 |  char |  no |   seq |   1024 |    853 | 0.83 ||  4.00 |   457183 ||  17087.03 |   27.40 |   22.82 |    37.37 | 00h00'17 ||  1600.00 |  1.8495 |   31.60 |     0.00 |  0.0197 |    0.34 |  0.0511 |    0.87
    A15 |  char |  no |   seq |   2048 |   1707 | 0.83 ||  4.00 |   238931 ||  19191.46 |   25.50 |   21.25 |    80.32 | 00h00'19 ||  1600.00 |  1.8490 |   35.49 |     0.00 |  0.0198 |    0.38 |  0.0541 |    1.04
    A15 |  char |  no |   seq |   4096 |   3413 | 0.83 ||  4.00 |   118322 ||  20078.92 |   24.14 |   20.11 |   169.70 | 00h00'20 ||  1600.00 |  1.9095 |   38.34 |     0.00 |  0.0198 |    0.40 |  0.0582 |    1.17
    A15 |  char |  no |   seq |   8192 |   6827 | 0.83 ||  4.00 |    57604 ||  20465.38 |   23.06 |   19.22 |   355.28 | 00h00'20 ||  1600.00 |  1.8854 |   38.59 |     0.00 |  0.0197 |    0.40 |  0.0542 |    1.11
    A15 |  char |  no |   seq |  16384 |  13653 | 0.83 ||  4.00 |    27305 ||  20681.70 |   21.63 |   18.03 |   757.43 | 00h00'20 ||  1600.00 |  1.9606 |   40.55 |     0.00 |  0.0199 |    0.41 |  0.0528 |    1.09
    A15 |  char |  no |   seq |  32768 |  27307 | 0.83 ||  4.00 |    12609 ||  20972.41 |   19.70 |   16.42 |  1663.29 | 00h00'21 ||  1600.00 |  1.9725 |   41.37 |     0.00 |  0.0198 |    0.42 |  0.0519 |    1.09
    A15 |  char |  no |   seq |  65536 |  54613 | 0.83 ||  4.00 |     5896 ||  20866.95 |   18.52 |   15.43 |  3539.17 | 00h00'21 ||  1600.00 |  2.0173 |   42.09 |     0.00 |  0.0200 |    0.42 |  0.0515 |    1.07
    A15 |  char |  no |   seq |   131072 |  109227 | 0.83 ||  4.00 |     2500 ||  18622.91 |   17.60 |   14.66 |  7449.16 | 00h00'19 ||  1600.00 |  2.0427 |   38.04 |     0.00 |  0.0204 |    0.38 |  0.0516 |    0.96
    A15 |  char |  no |   seq |   262144 |  218453 | 0.83 ||  4.00 |     1250 ||  23429.47 |   13.99 |   11.65 | 18743.58 | 00h00'25 ||  1600.00 |  1.9365 |   45.37 |     0.00 |  0.0199 |    0.47 |  0.0556 |    1.30
    A15 |  char |  no |   seq |   524288 |  436907 | 0.83 ||  4.00 |      625 ||  25100.56 |   13.05 |   10.88 | 40160.90 | 00h00'28 ||  1600.00 |  1.9538 |   49.04 |     0.00 |  0.0198 |    0.50 |  0.0625 |    1.57
    A15 |  char |  no |   seq |  1048576 |  873813 | 0.83 ||  4.00 |      300 ||  27587.00 |   11.40 |    9.50 | 91956.66 | 00h00'34 ||  1600.00 |  1.9097 |   52.68 |     0.00 |  0.0200 |    0.55 |  0.0716 |    1.98
#---------
#---------
# -> Seq 8-bit, rate 1/2, gen:
# ------|-------|-----|-------|--------|--------|------||-------|----------||-----------|---------|---------|----------|----------||----------|---------|---------|----------|---------|---------|---------|---------|
#  PROC |  TYPE | GEN |   VEC |      N |      K |    R ||   SNR |      FRA || LD+ST+DEC |    CTHR |    ITHR |  LATENCY | RUNTIME  || BIG FREQ | BIG POW | BIG ENE | LIT FREQ | LIT POW | LIT ENE | RAM POW | RAM ENE |
#       |       |     |       |        |        |      ||  (dB) |          ||      (ms) |  (Mb/s) |  (Mb/s) |     (us) | (hhmmss) ||    (Mhz) |     (W) |     (J) |    (Mhz) |     (W) |     (J) |     (W) |     (J) |
# ------|-------|-----|-------|--------|--------|------||-------|----------||-----------|---------|---------|----------|----------||----------|---------|---------|----------|---------|---------|---------|---------|
    A15 |  char | yes |   seq |    128 |     64 | 0.50 ||  2.50 |  1372446 ||   8243.79 |   21.31 |   10.65 |     6.01 | 00h00'08 ||  1600.00 |  1.7572 |   14.49 |     0.00 |  0.0197 |    0.16 |  0.0504 |    0.42
    A15 |  char | yes |   seq |    256 |    128 | 0.50 ||  2.50 |  1039196 ||  11355.47 |   23.43 |   11.71 |    10.93 | 00h00'11 ||  1600.00 |  1.7797 |   20.21 |     0.00 |  0.0197 |    0.22 |  0.0507 |    0.58
    A15 |  char | yes |   seq |    512 |    256 | 0.50 ||  2.50 |   672044 ||  14581.46 |   23.60 |   11.80 |    21.70 | 00h00'14 ||  1600.00 |  1.8135 |   26.44 |     0.00 |  0.0199 |    0.29 |  0.0505 |    0.74
    A15 |  char | yes |   seq |   1024 |    512 | 0.50 ||  2.50 |   367136 ||  17214.66 |   21.84 |   10.92 |    46.89 | 00h00'17 ||  1600.00 |  1.8100 |   31.16 |     0.00 |  0.0198 |    0.34 |  0.0504 |    0.87
    A15 |  char | yes |   seq |   2048 |   1024 | 0.50 ||  2.50 |   185879 ||  18904.98 |   20.14 |   10.07 |   101.71 | 00h00'18 ||  1600.00 |  1.7972 |   33.98 |     0.00 |  0.0197 |    0.37 |  0.0557 |    1.05
    A15 |  char | yes |   seq |   4096 |   2048 | 0.50 ||  2.50 |    92647 ||  19779.04 |   19.19 |    9.59 |   213.49 | 00h00'19 ||  1600.00 |  1.8172 |   35.94 |     0.00 |  0.0197 |    0.39 |  0.0564 |    1.12
    A15 |  char | yes |   seq |   8192 |   4096 | 0.50 ||  2.50 |    44280 ||  21306.52 |   17.02 |    8.51 |   481.18 | 00h00'21 ||  1600.00 |  1.9020 |   40.53 |     0.00 |  0.0197 |    0.42 |  0.0533 |    1.14
    A15 |  char | yes |   seq |  16384 |   8192 | 0.50 ||  2.50 |    20875 ||  20955.68 |   16.32 |    8.16 |  1003.87 | 00h00'20 ||  1600.00 |  1.9073 |   39.97 |     0.00 |  0.0197 |    0.41 |  0.0524 |    1.10
    A15 |  char | yes |   seq |  32768 |  16384 | 0.50 ||  2.50 |     9828 ||  21050.33 |   15.30 |    7.65 |  2141.87 | 00h00'21 ||  1600.00 |  1.9232 |   40.48 |     0.00 |  0.0197 |    0.42 |  0.0516 |    1.09
    A15 |  char | yes |   seq |  65536 |  32768 | 0.50 ||  2.50 |     4714 ||  20569.22 |   15.02 |    7.51 |  4363.43 | 00h00'20 ||  1600.00 |  1.9817 |   40.76 |     0.00 |  0.0198 |    0.41 |  0.0512 |    1.05
    A15 |  char | yes |   seq |   131072 |   65536 | 0.50 ||  2.50 |     2500 ||  23906.16 |   13.71 |    6.85 |  9562.47 | 00h00'23 ||  1600.00 |  1.9874 |   47.51 |     0.00 |  0.0198 |    0.47 |  0.0539 |    1.29
    A15 |  char | yes |   seq |   262144 |  131072 | 0.50 ||  2.50 |     1250 ||  30503.60 |   10.74 |    5.37 | 24402.88 | 00h00'30 ||  1600.00 |  1.9405 |   59.19 |     0.00 |  0.0198 |    0.61 |  0.0549 |    1.67
    A15 |  char | yes |   seq |   524288 |  262144 | 0.50 ||  2.50 |      625 ||  34086.95 |    9.61 |    4.81 | 54539.12 | 00h00'34 ||  1600.00 |  1.9280 |   65.72 |     0.00 |  0.0199 |    0.68 |  0.0661 |    2.25
    A15 |  char | yes |   seq |  1048576 |  524288 | 0.50 ||  2.50 |      300 ||  36110.24 |    8.71 |    4.36 | 120367.48 | 00h00'36 ||  1600.00 |  1.9118 |   69.04 |     0.00 |  0.0197 |    0.71 |  0.0708 |    2.56
#---------
#---------
# -> Seq 8-bit, rate 5/6, gen:
# ------|-------|-----|-------|--------|--------|------||-------|----------||-----------|---------|---------|----------|----------||----------|---------|---------|----------|---------|---------|---------|---------|
#  PROC |  TYPE | GEN |   VEC |      N |      K |    R ||   SNR |      FRA || LD+ST+DEC |    CTHR |    ITHR |  LATENCY | RUNTIME  || BIG FREQ | BIG POW | BIG ENE | LIT FREQ | LIT POW | LIT ENE | RAM POW | RAM ENE |
#       |       |     |       |        |        |      ||  (dB) |          ||      (ms) |  (Mb/s) |  (Mb/s) |     (us) | (hhmmss) ||    (Mhz) |     (W) |     (J) |    (Mhz) |     (W) |     (J) |     (W) |     (J) |
# ------|-------|-----|-------|--------|--------|------||-------|----------||-----------|---------|---------|----------|----------||----------|---------|---------|----------|---------|---------|---------|---------|
    A15 |  char | yes |   seq |    128 |    107 | 0.83 ||  4.00 |  1468511 ||   7048.70 |   26.67 |   22.29 |     4.80 | 00h00'07 ||  1600.00 |  1.6962 |   11.96 |     0.00 |  0.0197 |    0.14 |  0.0504 |    0.36
    A15 |  char | yes |   seq |    256 |    213 | 0.83 ||  4.00 |  1089749 ||  10549.22 |   26.45 |   22.00 |     9.68 | 00h00'10 ||  1600.00 |  1.7464 |   18.42 |     0.00 |  0.0197 |    0.21 |  0.0507 |    0.53
    A15 |  char | yes |   seq |    512 |    427 | 0.83 ||  4.00 |   718502 ||  13727.07 |   26.80 |   22.35 |    19.11 | 00h00'13 ||  1600.00 |  1.7882 |   24.55 |     0.00 |  0.0197 |    0.27 |  0.0506 |    0.69
    A15 |  char | yes |   seq |   1024 |    853 | 0.83 ||  4.00 |   417855 ||  16746.65 |   25.55 |   21.28 |    40.08 | 00h00'16 ||  1600.00 |  1.7962 |   30.08 |     0.00 |  0.0198 |    0.33 |  0.0531 |    0.89
    A15 |  char | yes |   seq |   2048 |   1707 | 0.83 ||  4.00 |   210135 ||  18740.31 |   22.96 |   19.14 |    89.18 | 00h00'18 ||  1600.00 |  1.7951 |   33.64 |     0.00 |  0.0197 |    0.37 |  0.0552 |    1.04
    A15 |  char | yes |   seq |   4096 |   3413 | 0.83 ||  4.00 |   101774 ||  19627.38 |   21.24 |   17.70 |   192.85 | 00h00'19 ||  1600.00 |  1.8101 |   35.53 |     0.00 |  0.0197 |    0.39 |  0.0573 |    1.12
    A15 |  char | yes |   seq |   8192 |   6827 | 0.83 ||  4.00 |    48800 ||  20077.74 |   19.91 |   16.59 |   411.43 | 00h00'20 ||  1600.00 |  1.8337 |   36.82 |     0.00 |  0.0197 |    0.40 |  0.0537 |    1.08
    A15 |  char | yes |   seq |  16384 |  13653 | 0.83 ||  4.00 |    22830 ||  20100.13 |   18.61 |   15.51 |   880.43 | 00h00'20 ||  1600.00 |  1.9034 |   38.26 |     0.00 |  0.0197 |    0.40 |  0.0522 |    1.05
    A15 |  char | yes |   seq |  32768 |  27307 | 0.83 ||  4.00 |    10570 ||  20571.67 |   16.84 |   14.03 |  1946.23 | 00h00'20 ||  1600.00 |  1.9494 |   40.10 |     0.00 |  0.0197 |    0.40 |  0.0516 |    1.06
    A15 |  char | yes |   seq |  65536 |  54613 | 0.83 ||  4.00 |     4895 ||  20659.80 |   15.53 |   12.94 |  4220.59 | 00h00'20 ||  1600.00 |  2.0092 |   41.51 |     0.00 |  0.0199 |    0.41 |  0.0514 |    1.06
    A15 |  char | yes |   seq |   131072 |  109227 | 0.83 ||  4.00 |     2500 ||  23583.56 |   13.89 |   11.58 |  9433.42 | 00h00'23 ||  1600.00 |  1.9708 |   46.48 |     0.00 |  0.0198 |    0.47 |  0.0514 |    1.21
    A15 |  char | yes |   seq |   262144 |  218453 | 0.83 ||  4.00 |     1250 ||  29106.82 |   11.26 |    9.38 | 23285.45 | 00h00'29 ||  1600.00 |  1.9336 |   56.28 |     0.00 |  0.0198 |    0.58 |  0.0524 |    1.53
    A15 |  char | yes |   seq |   524288 |  436907 | 0.83 ||  4.00 |      625 ||  33275.71 |    9.85 |    8.21 | 53241.13 | 00h00'33 ||  1600.00 |  1.9284 |   64.17 |     0.00 |  0.0198 |    0.66 |  0.0657 |    2.19
    A15 |  char | yes |   seq |  1048576 |  873813 | 0.83 ||  4.00 |      300 ||  35910.26 |    8.76 |    7.30 | 119700.85 | 00h00'36 ||  1600.00 |  1.9059 |   68.44 |     0.00 |  0.0198 |    0.71 |  0.0699 |    2.51
#---------
#---------
# -> Intra-SIMD 8-bit, rate 1/2, no gen:
# ------|-------|-----|-------|--------|--------|------||-------|----------||-----------|---------|---------|----------|----------||----------|---------|---------|----------|---------|---------|---------|---------|
#  PROC |  TYPE | GEN |   VEC |      N |      K |    R ||   SNR |      FRA || LD+ST+DEC |    CTHR |    ITHR |  LATENCY | RUNTIME  || BIG FREQ | BIG POW | BIG ENE | LIT FREQ | LIT POW | LIT ENE | RAM POW | RAM ENE |
#       |       |     |       |        |        |      ||  (dB) |          ||      (ms) |  (Mb/s) |  (Mb/s) |     (us) | (hhmmss) ||    (Mhz) |     (W) |     (J) |    (Mhz) |     (W) |     (J) |     (W) |     (J) |
# ------|-------|-----|-------|--------|--------|------||-------|----------||-----------|---------|---------|----------|----------||----------|---------|---------|----------|---------|---------|---------|---------|
    A15 |  char |  no | intra |    128 |     64 | 0.50 ||  2.50 |  1628908 ||   5715.18 |   36.48 |   18.24 |     3.51 | 00h00'05 ||  1600.00 |  1.7497 |   10.00 |     0.00 |  0.0197 |    0.11 |  0.0509 |    0.29
    A15 |  char |  no | intra |    256 |    128 | 0.50 ||  2.50 |  1482148 ||   6857.74 |   55.33 |   27.66 |     4.63 | 00h00'06 ||  1600.00 |  1.7253 |   11.83 |     0.00 |  0.0197 |    0.13 |  0.0504 |    0.35
    A15 |  char |  no | intra |    512 |    256 | 0.50 ||  2.50 |  1287237 ||   8794.93 |   74.94 |   37.47 |     6.83 | 00h00'08 ||  1600.00 |  1.8203 |   16.01 |     0.00 |  0.0197 |    0.17 |  0.0507 |    0.45
    A15 |  char |  no | intra |   1024 |    512 | 0.50 ||  2.50 |   979960 ||  11810.60 |   84.96 |   42.48 |    12.05 | 00h00'11 ||  1600.00 |  1.8709 |   22.10 |     0.00 |  0.0198 |    0.23 |  0.0506 |    0.60
    A15 |  char |  no | intra |   2048 |   1024 | 0.50 ||  2.50 |   657025 ||  14010.12 |   96.04 |   48.02 |    21.32 | 00h00'14 ||  1600.00 |  1.9160 |   26.84 |     0.00 |  0.0198 |    0.28 |  0.0540 |    0.76
    A15 |  char |  no | intra |   4096 |   2048 | 0.50 ||  2.50 |   419152 ||  16818.53 |  102.08 |   51.04 |    40.13 | 00h00'16 ||  1600.00 |  2.1803 |   36.67 |     0.00 |  0.0198 |    0.33 |  0.0566 |    0.95
    A15 |  char |  no | intra |   8192 |   4096 | 0.50 ||  2.50 |   234743 ||  18008.97 |  106.78 |   53.39 |    76.72 | 00h00'18 ||  1600.00 |  2.0921 |   37.68 |     0.00 |  0.0202 |    0.36 |  0.0588 |    1.06
    A15 |  char |  no | intra |  16384 |   8192 | 0.50 ||  2.50 |   121493 ||  18966.71 |  104.95 |   52.47 |   156.11 | 00h00'19 ||  1600.00 |  2.2086 |   41.89 |     0.00 |  0.0204 |    0.39 |  0.0592 |    1.12
    A15 |  char |  no | intra |  32768 |  16384 | 0.50 ||  2.50 |    61018 ||  19592.12 |  102.05 |   51.03 |   321.09 | 00h00'19 ||  1600.00 |  2.2370 |   43.83 |     0.00 |  0.0202 |    0.40 |  0.0566 |    1.11
    A15 |  char |  no | intra |  65536 |  32768 | 0.50 ||  2.50 |    29966 ||  19670.80 |   99.84 |   49.92 |   656.44 | 00h00'20 ||  1600.00 |  2.3108 |   45.46 |     0.00 |  0.0206 |    0.40 |  0.0551 |    1.08
    A15 |  char |  no | intra |   131072 |   65536 | 0.50 ||  2.50 |    15000 ||  21926.32 |   89.67 |   44.83 |  1461.75 | 00h00'23 ||  1600.00 |  2.3056 |   50.55 |     0.00 |  0.0204 |    0.45 |  0.0540 |    1.19
    A15 |  char |  no | intra |   262144 |  131072 | 0.50 ||  2.50 |     7000 ||  24490.28 |   74.93 |   37.46 |  3498.61 | 00h00'26 ||  1600.00 |  2.2582 |   55.30 |     0.00 |  0.0202 |    0.49 |  0.0536 |    1.31
    A15 |  char |  no | intra |   524288 |  262144 | 0.50 ||  2.50 |     3500 ||  27509.28 |   66.71 |   33.35 |  7859.80 | 00h00'31 ||  1600.00 |  2.1549 |   59.28 |     0.00 |  0.0202 |    0.56 |  0.0815 |    2.24
    A15 |  char |  no | intra |  1048576 |  524288 | 0.50 ||  2.50 |     1750 ||  33377.89 |   54.98 |   27.49 | 19073.08 | 00h00'41 ||  1600.00 |  2.0750 |   69.26 |     0.00 |  0.0202 |    0.68 |  0.1090 |    3.64
#---------
#---------
# -> Intra-SIMD 8-bit, rate 5/6, no gen:
# ------|-------|-----|-------|--------|--------|------||-------|----------||-----------|---------|---------|----------|----------||----------|---------|---------|----------|---------|---------|---------|---------|
#  PROC |  TYPE | GEN |   VEC |      N |      K |    R ||   SNR |      FRA || LD+ST+DEC |    CTHR |    ITHR |  LATENCY | RUNTIME  || BIG FREQ | BIG POW | BIG ENE | LIT FREQ | LIT POW | LIT ENE | RAM POW | RAM ENE |
#       |       |     |       |        |        |      ||  (dB) |          ||      (ms) |  (Mb/s) |  (Mb/s) |     (us) | (hhmmss) ||    (Mhz) |     (W) |     (J) |    (Mhz) |     (W) |     (J) |     (W) |     (J) |
# ------|-------|-----|-------|--------|--------|------||-------|----------||-----------|---------|---------|----------|----------||----------|---------|---------|----------|---------|---------|---------|---------|
    A15 |  char |  no | intra |    128 |    107 | 0.83 ||  4.00 |  1739009 ||   4853.57 |   45.86 |   38.34 |     2.79 | 00h00'04 ||  1600.00 |  1.6319 |    7.92 |     0.00 |  0.0200 |    0.10 |  0.0507 |    0.25
    A15 |  char |  no | intra |    256 |    213 | 0.83 ||  4.00 |  1549709 ||   6365.74 |   62.32 |   51.85 |     4.11 | 00h00'06 ||  1600.00 |  1.7651 |   11.24 |     0.00 |  0.0199 |    0.13 |  0.0504 |    0.32
    A15 |  char |  no | intra |    512 |    427 | 0.83 ||  4.00 |  1373013 ||   8222.15 |   85.50 |   71.30 |     5.99 | 00h00'08 ||  1600.00 |  1.8662 |   15.34 |     0.00 |  0.0197 |    0.16 |  0.0509 |    0.42
    A15 |  char |  no | intra |   1024 |    853 | 0.83 ||  4.00 |  1137199 ||  10408.17 |  111.88 |   93.20 |     9.15 | 00h00'10 ||  1600.00 |  1.8262 |   19.01 |     0.00 |  0.0198 |    0.21 |  0.0508 |    0.53
    A15 |  char |  no | intra |   2048 |   1707 | 0.83 ||  4.00 |   788585 ||  13262.29 |  121.78 |  101.50 |    16.82 | 00h00'13 ||  1600.00 |  2.0262 |   26.87 |     0.00 |  0.0197 |    0.26 |  0.0534 |    0.71
    A15 |  char |  no | intra |   4096 |   3413 | 0.83 ||  4.00 |   503777 ||  15870.10 |  130.02 |  108.34 |    31.50 | 00h00'15 ||  1600.00 |  2.0478 |   32.50 |     0.00 |  0.0198 |    0.31 |  0.0535 |    0.85
    A15 |  char |  no | intra |   8192 |   6827 | 0.83 ||  4.00 |   290048 ||  18294.87 |  129.88 |  108.24 |    63.08 | 00h00'18 ||  1600.00 |  2.1604 |   39.52 |     0.00 |  0.0204 |    0.37 |  0.0590 |    1.08
    A15 |  char |  no | intra |  16384 |  13653 | 0.83 ||  4.00 |   146841 ||  18564.71 |  129.59 |  107.99 |   126.43 | 00h00'18 ||  1600.00 |  2.2659 |   42.07 |     0.00 |  0.0206 |    0.38 |  0.0596 |    1.11
    A15 |  char |  no | intra |  32768 |  27307 | 0.83 ||  4.00 |    73239 ||  19616.23 |  122.34 |  101.95 |   267.84 | 00h00'19 ||  1600.00 |  2.2689 |   44.51 |     0.00 |  0.0205 |    0.40 |  0.0575 |    1.13
    A15 |  char |  no | intra |  65536 |  54613 | 0.83 ||  4.00 |    35138 ||  20106.76 |  114.53 |   95.44 |   572.22 | 00h00'20 ||  1600.00 |  2.3064 |   46.37 |     0.00 |  0.0204 |    0.41 |  0.0552 |    1.11
    A15 |  char |  no | intra |   131072 |  109227 | 0.83 ||  4.00 |    15000 ||  18314.81 |  107.35 |   89.46 |  1220.99 | 00h00'19 ||  1600.00 |  2.3198 |   42.49 |     0.00 |  0.0205 |    0.38 |  0.0550 |    1.01
    A15 |  char |  no | intra |   262144 |  218453 | 0.83 ||  4.00 |     7500 ||  22643.49 |   86.83 |   72.36 |  3019.13 | 00h00'24 ||  1600.00 |  2.2639 |   51.26 |     0.00 |  0.0204 |    0.46 |  0.0544 |    1.23
    A15 |  char |  no | intra |   524288 |  436907 | 0.83 ||  4.00 |     3500 ||  25000.86 |   73.40 |   61.16 |  7143.10 | 00h00'28 ||  1600.00 |  2.1727 |   54.32 |     0.00 |  0.0205 |    0.51 |  0.0823 |    2.06
    A15 |  char |  no | intra |  1048576 |  873813 | 0.83 ||  4.00 |     1750 ||  31183.12 |   58.85 |   49.04 | 17818.93 | 00h00'37 ||  1600.00 |  2.0762 |   64.74 |     0.00 |  0.0201 |    0.63 |  0.1094 |    3.41
#---------
#---------
# -> Intra-SIMD 8-bit, rate 1/2, gen:
# ------|-------|-----|-------|--------|--------|------||-------|----------||-----------|---------|---------|----------|----------||----------|---------|---------|----------|---------|---------|---------|---------|
#  PROC |  TYPE | GEN |   VEC |      N |      K |    R ||   SNR |      FRA || LD+ST+DEC |    CTHR |    ITHR |  LATENCY | RUNTIME  || BIG FREQ | BIG POW | BIG ENE | LIT FREQ | LIT POW | LIT ENE | RAM POW | RAM ENE |
#       |       |     |       |        |        |      ||  (dB) |          ||      (ms) |  (Mb/s) |  (Mb/s) |     (us) | (hhmmss) ||    (Mhz) |     (W) |     (J) |    (Mhz) |     (W) |     (J) |     (W) |     (J) |
# ------|-------|-----|-------|--------|--------|------||-------|----------||-----------|---------|---------|----------|----------||----------|---------|---------|----------|---------|---------|---------|---------|
    A15 |  char | yes | intra |    128 |     64 | 0.50 ||  2.50 |  1698069 ||   5189.11 |   41.89 |   20.94 |     3.06 | 00h00'05 ||  1600.00 |  1.6734 |    8.68 |     0.00 |  0.0202 |    0.10 |  0.0507 |    0.26
    A15 |  char | yes | intra |    256 |    128 | 0.50 ||  2.50 |  1572445 ||   6710.99 |   59.98 |   29.99 |     4.27 | 00h00'06 ||  1600.00 |  1.7426 |   11.69 |     0.00 |  0.0197 |    0.13 |  0.0504 |    0.34
    A15 |  char | yes | intra |    512 |    256 | 0.50 ||  2.50 |  1381377 ||   7989.37 |   88.53 |   44.26 |     5.78 | 00h00'07 ||  1600.00 |  1.7705 |   14.15 |     0.00 |  0.0199 |    0.16 |  0.0508 |    0.41
    A15 |  char | yes | intra |   1024 |    512 | 0.50 ||  2.50 |  1074590 ||  10837.10 |  101.54 |   50.77 |    10.08 | 00h00'10 ||  1600.00 |  1.8231 |   19.76 |     0.00 |  0.0197 |    0.21 |  0.0506 |    0.55
    A15 |  char | yes | intra |   2048 |   1024 | 0.50 ||  2.50 |   769737 ||  13529.01 |  116.52 |   58.26 |    17.58 | 00h00'13 ||  1600.00 |  1.9233 |   26.02 |     0.00 |  0.0201 |    0.27 |  0.0527 |    0.71
    A15 |  char | yes | intra |   4096 |   2048 | 0.50 ||  2.50 |   489617 ||  16098.62 |  124.57 |   62.29 |    32.88 | 00h00'16 ||  1600.00 |  2.0027 |   32.24 |     0.00 |  0.0199 |    0.32 |  0.0546 |    0.88
    A15 |  char | yes | intra |   8192 |   4096 | 0.50 ||  2.50 |   275797 ||  18619.58 |  121.34 |   60.67 |    67.51 | 00h00'18 ||  1600.00 |  2.1602 |   40.22 |     0.00 |  0.0201 |    0.37 |  0.0556 |    1.03
    A15 |  char | yes | intra |  16384 |   8192 | 0.50 ||  2.50 |   142854 ||  21347.74 |  109.64 |   54.82 |   149.44 | 00h00'21 ||  1600.00 |  2.1938 |   46.83 |     0.00 |  0.0204 |    0.44 |  0.0594 |    1.27
    A15 |  char | yes | intra |  32768 |  16384 | 0.50 ||  2.50 |    68860 ||  21753.96 |  103.72 |   51.86 |   315.92 | 00h00'21 ||  1600.00 |  2.2266 |   48.44 |     0.00 |  0.0203 |    0.44 |  0.0562 |    1.22
    A15 |  char | yes | intra |  65536 |  32768 | 0.50 ||  2.50 |    34752 ||  20294.05 |  112.23 |   56.11 |   583.97 | 00h00'20 ||  1600.00 |  2.2642 |   45.95 |     0.00 |  0.0202 |    0.41 |  0.0554 |    1.12
    A15 |  char | yes | intra |   131072 |   65536 | 0.50 ||  2.50 |    15000 ||  19014.70 |  103.40 |   51.70 |  1267.65 | 00h00'19 ||  1600.00 |  2.2933 |   43.61 |     0.00 |  0.0207 |    0.39 |  0.0545 |    1.04
    A15 |  char | yes | intra |   262144 |  131072 | 0.50 ||  2.50 |     7000 ||  21533.35 |   85.22 |   42.61 |  3076.19 | 00h00'21 ||  1600.00 |  2.2539 |   48.53 |     0.00 |  0.0204 |    0.44 |  0.0548 |    1.18
    A15 |  char | yes | intra |   524288 |  262144 | 0.50 ||  2.50 |     3500 ||  28118.18 |   65.26 |   32.63 |  8033.77 | 00h00'28 ||  1600.00 |  2.0838 |   58.59 |     0.00 |  0.0204 |    0.57 |  0.0921 |    2.59
    A15 |  char | yes | intra |  1048576 |  524288 | 0.50 ||  2.50 |     1750 ||  31892.97 |   57.54 |   28.77 | 18224.55 | 00h00'32 ||  1600.00 |  2.0328 |   64.83 |     0.00 |  0.0202 |    0.64 |  0.1132 |    3.61
#---------
#---------
# -> Intra-SIMD 8-bit, rate 5/6, gen:
# ------|-------|-----|-------|--------|--------|------||-------|----------||-----------|---------|---------|----------|----------||----------|---------|---------|----------|---------|---------|---------|---------|
#  PROC |  TYPE | GEN |   VEC |      N |      K |    R ||   SNR |      FRA || LD+ST+DEC |    CTHR |    ITHR |  LATENCY | RUNTIME  || BIG FREQ | BIG POW | BIG ENE | LIT FREQ | LIT POW | LIT ENE | RAM POW | RAM ENE |
#       |       |     |       |        |        |      ||  (dB) |          ||      (ms) |  (Mb/s) |  (Mb/s) |     (us) | (hhmmss) ||    (Mhz) |     (W) |     (J) |    (Mhz) |     (W) |     (J) |     (W) |     (J) |
# ------|-------|-----|-------|--------|--------|------||-------|----------||-----------|---------|---------|----------|----------||----------|---------|---------|----------|---------|---------|---------|---------|
    A15 |  char | yes | intra |    128 |    107 | 0.83 ||  4.00 |  1765946 ||   4594.20 |   49.20 |   41.13 |     2.60 | 00h00'04 ||  1600.00 |  1.5797 |    7.26 |     0.00 |  0.0197 |    0.09 |  0.0507 |    0.23
    A15 |  char | yes | intra |    256 |    213 | 0.83 ||  4.00 |  1622879 ||   6063.87 |   68.51 |   57.01 |     3.74 | 00h00'06 ||  1600.00 |  1.6853 |   10.22 |     0.00 |  0.0197 |    0.12 |  0.0506 |    0.31
    A15 |  char | yes | intra |    512 |    427 | 0.83 ||  4.00 |  1446105 ||   7230.77 |  102.40 |   85.40 |     5.00 | 00h00'07 ||  1600.00 |  1.8131 |   13.11 |     0.00 |  0.0200 |    0.14 |  0.0504 |    0.36
    A15 |  char | yes | intra |   1024 |    853 | 0.83 ||  4.00 |  1198370 ||   9871.53 |  124.31 |  103.55 |     8.24 | 00h00'09 ||  1600.00 |  1.8754 |   18.51 |     0.00 |  0.0198 |    0.20 |  0.0519 |    0.51
    A15 |  char | yes | intra |   2048 |   1707 | 0.83 ||  4.00 |   890666 ||  12766.96 |  142.88 |  119.09 |    14.33 | 00h00'12 ||  1600.00 |  1.9170 |   24.47 |     0.00 |  0.0199 |    0.25 |  0.0519 |    0.66
    A15 |  char | yes | intra |   4096 |   3413 | 0.83 ||  4.00 |   561429 ||  15964.90 |  144.04 |  120.02 |    28.44 | 00h00'15 ||  1600.00 |  2.0559 |   32.82 |     0.00 |  0.0199 |    0.32 |  0.0543 |    0.87
    A15 |  char | yes | intra |   8192 |   6827 | 0.83 ||  4.00 |   321341 ||  17425.50 |  151.07 |  125.90 |    54.23 | 00h00'17 ||  1600.00 |  2.1768 |   37.93 |     0.00 |  0.0202 |    0.35 |  0.0572 |    1.00
    A15 |  char | yes | intra |  16384 |  13653 | 0.83 ||  4.00 |   170937 ||  19364.64 |  144.63 |  120.52 |   113.29 | 00h00'19 ||  1600.00 |  2.2164 |   42.92 |     0.00 |  0.0205 |    0.40 |  0.0595 |    1.15
    A15 |  char | yes | intra |  32768 |  27307 | 0.83 ||  4.00 |    79535 ||  19256.20 |  135.34 |  112.79 |   242.11 | 00h00'19 ||  1600.00 |  2.2731 |   43.77 |     0.00 |  0.0204 |    0.39 |  0.0583 |    1.12
    A15 |  char | yes | intra |  65536 |  54613 | 0.83 ||  4.00 |    39967 ||  20301.59 |  129.02 |  107.51 |   507.96 | 00h00'20 ||  1600.00 |  2.3468 |   47.64 |     0.00 |  0.0205 |    0.42 |  0.0557 |    1.13
    A15 |  char | yes | intra |   131072 |  109227 | 0.83 ||  4.00 |    15000 ||  16082.38 |  122.25 |  101.88 |  1072.16 | 00h00'16 ||  1600.00 |  2.3213 |   37.33 |     0.00 |  0.0205 |    0.33 |  0.0554 |    0.89
    A15 |  char | yes | intra |   262144 |  218453 | 0.83 ||  4.00 |     7500 ||  20873.57 |   94.19 |   78.49 |  2783.14 | 00h00'20 ||  1600.00 |  2.2688 |   47.36 |     0.00 |  0.0204 |    0.43 |  0.0556 |    1.16
    A15 |  char | yes | intra |   524288 |  436907 | 0.83 ||  4.00 |     3500 ||  25222.75 |   72.75 |   60.63 |  7206.50 | 00h00'25 ||  1600.00 |  2.1223 |   53.53 |     0.00 |  0.0207 |    0.52 |  0.0886 |    2.23
    A15 |  char | yes | intra |  1048576 |  873813 | 0.83 ||  4.00 |     1750 ||  30466.19 |   60.23 |   50.19 | 17409.25 | 00h00'30 ||  1600.00 |  2.0446 |   62.29 |     0.00 |  0.0202 |    0.61 |  0.1163 |    3.54
#---------
#---------
# -> Inter-SIMD 8-bit, rate 1/2, no gen:
# ------|-------|-----|-------|--------|--------|------||-------|----------||-----------|---------|---------|----------|----------||----------|---------|---------|----------|---------|---------|---------|---------|
#  PROC |  TYPE | GEN |   VEC |      N |      K |    R ||   SNR |      FRA || LD+ST+DEC |    CTHR |    ITHR |  LATENCY | RUNTIME  || BIG FREQ | BIG POW | BIG ENE | LIT FREQ | LIT POW | LIT ENE | RAM POW | RAM ENE |
#       |       |     |       |        |        |      ||  (dB) |          ||      (ms) |  (Mb/s) |  (Mb/s) |     (us) | (hhmmss) ||    (Mhz) |     (W) |     (J) |    (Mhz) |     (W) |     (J) |     (W) |     (J) |
# ------|-------|-----|-------|--------|--------|------||-------|----------||-----------|---------|---------|----------|----------||----------|---------|---------|----------|---------|---------|---------|---------|
    A15 |  char |  no | inter |    128 |     64 | 0.50 ||  2.50 | 18706160 ||  10274.22 |  233.05 |  116.52 |     8.79 | 00h00'10 ||  1600.00 |  2.0772 |   21.34 |     0.00 |  0.0203 |    0.21 |  0.0504 |    0.52
    A15 |  char |  no | inter |    256 |    128 | 0.50 ||  2.50 | 13180784 ||  12684.29 |  266.02 |  133.01 |    15.40 | 00h00'12 ||  1600.00 |  1.9997 |   25.36 |     0.00 |  0.0201 |    0.25 |  0.0507 |    0.64
    A15 |  char |  no | inter |    512 |    256 | 0.50 ||  2.50 |  8149008 ||  16754.82 |  249.02 |  124.51 |    32.90 | 00h00'16 ||  1600.00 |  2.2124 |   37.07 |     0.00 |  0.0204 |    0.34 |  0.0507 |    0.85
    A15 |  char |  no | inter |   1024 |    512 | 0.50 ||  2.50 |  3781824 ||  16673.66 |  232.26 |  116.13 |    70.54 | 00h00'16 ||  1600.00 |  2.2589 |   37.66 |     0.00 |  0.0204 |    0.34 |  0.0506 |    0.84
    A15 |  char |  no | inter |   2048 |   1024 | 0.50 ||  2.50 |  1895728 ||  18649.98 |  208.17 |  104.09 |   157.41 | 00h00'18 ||  1600.00 |  2.2783 |   42.49 |     0.00 |  0.0204 |    0.38 |  0.0508 |    0.95
    A15 |  char |  no | inter |   4096 |   2048 | 0.50 ||  2.50 |   885920 ||  20427.16 |  177.64 |   88.82 |   368.92 | 00h00'20 ||  1600.00 |  2.2799 |   46.57 |     0.00 |  0.0204 |    0.42 |  0.0509 |    1.04
    A15 |  char |  no | inter |   8192 |   4096 | 0.50 ||  2.50 |   421488 ||  20551.51 |  168.01 |   84.00 |   780.15 | 00h00'20 ||  1600.00 |  2.3276 |   47.84 |     0.00 |  0.0204 |    0.42 |  0.0506 |    1.04
    A15 |  char |  no | inter |  16384 |   8192 | 0.50 ||  2.50 |   188736 ||  20273.85 |  152.52 |   76.26 |  1718.71 | 00h00'20 ||  1600.00 |  2.3173 |   46.98 |     0.00 |  0.0205 |    0.42 |  0.0518 |    1.05
    A15 |  char |  no | inter |  32768 |  16384 | 0.50 ||  2.50 |    82496 ||  21402.45 |  126.30 |   63.15 |  4150.98 | 00h00'21 ||  1600.00 |  2.2353 |   47.84 |     0.00 |  0.0204 |    0.44 |  0.0666 |    1.43
    A15 |  char |  no | inter |  65536 |  32768 | 0.50 ||  2.50 |    30624 ||  23374.89 |   85.86 |   42.93 | 12212.58 | 00h00'24 ||  1600.00 |  1.9513 |   45.61 |     0.00 |  0.0201 |    0.47 |  0.1135 |    2.65
    A15 |  char |  no | inter |   131072 |   65536 | 0.50 ||  2.50 |    15000 ||  24158.50 |   81.38 |   40.69 | 25769.07 | 00h00'25 ||  1600.00 |  1.9617 |   47.39 |     0.00 |  0.0202 |    0.49 |  0.1331 |    3.22
    A15 |  char |  no | inter |   262144 |  131072 | 0.50 ||  2.50 |     7000 ||  24301.46 |   75.51 |   37.76 | 55546.20 | 00h00'27 ||  1600.00 |  2.0027 |   48.67 |     0.00 |  0.0203 |    0.49 |  0.1397 |    3.40
    A15 |  char |  no | inter |   524288 |  262144 | 0.50 ||  2.50 |     3500 ||  26158.35 |   70.15 |   35.08 | 119581.01 | 00h00'33 ||  1600.00 |  2.0133 |   52.66 |     0.00 |  0.0203 |    0.53 |  0.1485 |    3.88
    A15 |  char |  no | inter |  1048576 |  524288 | 0.50 ||  2.50 |     1750 ||  28756.21 |   63.81 |   31.91 | 262913.97 | 00h00'42 ||  1600.00 |  1.9613 |   56.40 |     0.00 |  0.0204 |    0.59 |  0.1530 |    4.40
#---------
#---------
# -> Inter-SIMD 8-bit, rate 5/6, no gen:
# ------|-------|-----|-------|--------|--------|------||-------|----------||-----------|---------|---------|----------|----------||----------|---------|---------|----------|---------|---------|---------|---------|
#  PROC |  TYPE | GEN |   VEC |      N |      K |    R ||   SNR |      FRA || LD+ST+DEC |    CTHR |    ITHR |  LATENCY | RUNTIME  || BIG FREQ | BIG POW | BIG ENE | LIT FREQ | LIT POW | LIT ENE | RAM POW | RAM ENE |
#       |       |     |       |        |        |      ||  (dB) |          ||      (ms) |  (Mb/s) |  (Mb/s) |     (us) | (hhmmss) ||    (Mhz) |     (W) |     (J) |    (Mhz) |     (W) |     (J) |     (W) |     (J) |
# ------|-------|-----|-------|--------|--------|------||-------|----------||-----------|---------|---------|----------|----------||----------|---------|---------|----------|---------|---------|---------|---------|
    A15 |  char |  no | inter |    128 |    107 | 0.83 ||  4.00 | 20592832 ||   9010.31 |  292.54 |  244.55 |     7.00 | 00h00'09 ||  1600.00 |  2.0459 |   18.43 |     0.00 |  0.0204 |    0.18 |  0.0507 |    0.46
    A15 |  char |  no | inter |    256 |    213 | 0.83 ||  4.00 | 14286336 ||  12515.32 |  292.23 |  243.14 |    14.02 | 00h00'12 ||  1600.00 |  2.1381 |   26.76 |     0.00 |  0.0203 |    0.25 |  0.0507 |    0.64
    A15 |  char |  no | inter |    512 |    427 | 0.83 ||  4.00 |  7631728 ||  14091.95 |  277.28 |  231.25 |    29.54 | 00h00'14 ||  1600.00 |  2.0993 |   29.58 |     0.00 |  0.0200 |    0.28 |  0.0508 |    0.72
    A15 |  char |  no | inter |   1024 |    853 | 0.83 ||  4.00 |  4583760 ||  19255.75 |  243.76 |  203.05 |    67.21 | 00h00'19 ||  1600.00 |  2.2543 |   43.41 |     0.00 |  0.0204 |    0.39 |  0.0509 |    0.98
    A15 |  char |  no | inter |   2048 |   1707 | 0.83 ||  4.00 |  2104272 ||  18515.23 |  232.76 |  194.00 |   140.78 | 00h00'18 ||  1600.00 |  2.2885 |   42.37 |     0.00 |  0.0204 |    0.38 |  0.0506 |    0.94
    A15 |  char |  no | inter |   4096 |   3413 | 0.83 ||  4.00 |   961296 ||  20475.16 |  192.30 |  160.24 |   340.79 | 00h00'20 ||  1600.00 |  2.3289 |   47.68 |     0.00 |  0.0205 |    0.42 |  0.0509 |    1.04
    A15 |  char |  no | inter |   8192 |   6827 | 0.83 ||  4.00 |   455600 ||  20828.84 |  179.19 |  149.33 |   731.48 | 00h00'20 ||  1600.00 |  2.3137 |   48.19 |     0.00 |  0.0205 |    0.43 |  0.0509 |    1.06
    A15 |  char |  no | inter |  16384 |  13653 | 0.83 ||  4.00 |   207968 ||  21618.84 |  157.61 |  131.34 |  1663.24 | 00h00'21 ||  1600.00 |  2.2900 |   49.51 |     0.00 |  0.0205 |    0.44 |  0.0516 |    1.12
    A15 |  char |  no | inter |  32768 |  27307 | 0.83 ||  4.00 |    86624 ||  21157.23 |  134.16 |  111.80 |  3907.87 | 00h00'21 ||  1600.00 |  2.2171 |   46.91 |     0.00 |  0.0201 |    0.43 |  0.0682 |    1.44
    A15 |  char |  no | inter |  65536 |  54613 | 0.83 ||  4.00 |    31392 ||  23799.89 |   86.44 |   72.03 | 12130.42 | 00h00'24 ||  1600.00 |  1.9295 |   45.92 |     0.00 |  0.0200 |    0.48 |  0.1142 |    2.72
    A15 |  char |  no | inter |   131072 |  109227 | 0.83 ||  4.00 |    15000 ||  23139.07 |   84.97 |   70.81 | 24681.67 | 00h00'24 ||  1600.00 |  1.9939 |   46.14 |     0.00 |  0.0203 |    0.47 |  0.1333 |    3.08
    A15 |  char |  no | inter |   262144 |  218453 | 0.83 ||  4.00 |     7500 ||  25393.14 |   77.43 |   64.52 | 54172.02 | 00h00'28 ||  1600.00 |  1.9778 |   50.22 |     0.00 |  0.0202 |    0.51 |  0.1437 |    3.65
    A15 |  char |  no | inter |   524288 |  436907 | 0.83 ||  4.00 |     3500 ||  26168.55 |   70.12 |   58.44 | 119627.67 | 00h00'32 ||  1600.00 |  1.9761 |   51.71 |     0.00 |  0.0202 |    0.53 |  0.1505 |    3.94
    A15 |  char |  no | inter |  1048576 |  873813 | 0.83 ||  4.00 |     1750 ||  27643.62 |   66.38 |   55.32 | 252741.66 | 00h00'40 ||  1600.00 |  1.9941 |   55.12 |     0.00 |  0.0201 |    0.56 |  0.1592 |    4.40
#---------
#---------
# -> inter-SIMD 8-bit, rate 1/2, gen:
# ------|-------|-----|-------|--------|--------|------||-------|----------||-----------|---------|---------|----------|----------||----------|---------|---------|----------|---------|---------|---------|---------|
#  PROC |  TYPE | GEN |   VEC |      N |      K |    R ||   SNR |      FRA || LD+ST+DEC |    CTHR |    ITHR |  LATENCY | RUNTIME  || BIG FREQ | BIG POW | BIG ENE | LIT FREQ | LIT POW | LIT ENE | RAM POW | RAM ENE |
#       |       |     |       |        |        |      ||  (dB) |          ||      (ms) |  (Mb/s) |  (Mb/s) |     (us) | (hhmmss) ||    (Mhz) |     (W) |     (J) |    (Mhz) |     (W) |     (J) |     (W) |     (J) |
# ------|-------|-----|-------|--------|--------|------||-------|----------||-----------|---------|---------|----------|----------||----------|---------|---------|----------|---------|---------|---------|---------|
    A15 |  char | yes | inter |    128 |     64 | 0.50 ||  2.50 | 19644080 ||   9739.62 |  258.17 |  129.08 |     7.93 | 00h00'09 ||  1600.00 |  1.9113 |   18.62 |     0.00 |  0.0200 |    0.19 |  0.0506 |    0.49
    A15 |  char | yes | inter |    256 |    128 | 0.50 ||  2.50 | 14383232 ||  12618.62 |  291.80 |  145.90 |    14.04 | 00h00'12 ||  1600.00 |  2.0377 |   25.71 |     0.00 |  0.0199 |    0.25 |  0.0506 |    0.64
    A15 |  char | yes | inter |    512 |    256 | 0.50 ||  2.50 |  9026992 ||  17026.56 |  271.45 |  135.72 |    30.18 | 00h00'17 ||  1600.00 |  2.1801 |   37.12 |     0.00 |  0.0200 |    0.34 |  0.0507 |    0.86
    A15 |  char | yes | inter |   1024 |    512 | 0.50 ||  2.50 |  4512336 ||  17790.76 |  259.72 |  129.86 |    63.08 | 00h00'17 ||  1600.00 |  2.2220 |   39.53 |     0.00 |  0.0205 |    0.37 |  0.0509 |    0.90
    A15 |  char | yes | inter |   2048 |   1024 | 0.50 ||  2.50 |  2072400 ||  18810.89 |  225.63 |  112.81 |   145.23 | 00h00'18 ||  1600.00 |  2.3128 |   43.51 |     0.00 |  0.0205 |    0.39 |  0.0508 |    0.96
    A15 |  char | yes | inter |   4096 |   2048 | 0.50 ||  2.50 |   963264 ||  20026.85 |  197.01 |   98.51 |   332.65 | 00h00'20 ||  1600.00 |  2.3491 |   47.05 |     0.00 |  0.0204 |    0.41 |  0.0509 |    1.02
    A15 |  char | yes | inter |   8192 |   4096 | 0.50 ||  2.50 |   451024 ||  20408.33 |  181.04 |   90.52 |   723.98 | 00h00'20 ||  1600.00 |  2.3744 |   48.46 |     0.00 |  0.0207 |    0.42 |  0.0509 |    1.04
    A15 |  char | yes | inter |  16384 |   8192 | 0.50 ||  2.50 |   198944 ||  19855.13 |  164.16 |   82.08 |  1596.84 | 00h00'19 ||  1600.00 |  2.3656 |   46.97 |     0.00 |  0.0206 |    0.41 |  0.0513 |    1.02
    A15 |  char | yes | inter |  32768 |  16384 | 0.50 ||  2.50 |    87088 ||  21073.56 |  135.42 |   67.71 |  3871.68 | 00h00'21 ||  1600.00 |  2.2610 |   47.65 |     0.00 |  0.0205 |    0.43 |  0.0697 |    1.47
    A15 |  char | yes | inter |  65536 |  32768 | 0.50 ||  2.50 |    32208 ||  24221.96 |   87.14 |   43.57 | 12032.77 | 00h00'24 ||  1600.00 |  1.9417 |   47.03 |     0.00 |  0.0199 |    0.48 |  0.1166 |    2.82
    A15 |  char | yes | inter |   131072 |   65536 | 0.50 ||  2.50 |    15000 ||  25430.56 |   77.31 |   38.66 | 27125.93 | 00h00'26 ||  1600.00 |  1.9199 |   48.82 |     0.00 |  0.0200 |    0.51 |  0.1312 |    3.34
    A15 |  char | yes | inter |   262144 |  131072 | 0.50 ||  2.50 |     7000 ||  25216.01 |   72.77 |   36.39 | 57636.60 | 00h00'26 ||  1600.00 |  1.9371 |   48.84 |     0.00 |  0.0201 |    0.51 |  0.1460 |    3.68
    A15 |  char | yes | inter |   524288 |  262144 | 0.50 ||  2.50 |     3500 ||  29753.81 |   61.67 |   30.84 | 136017.44 | 00h00'32 ||  1600.00 |  1.9001 |   56.54 |     0.00 |  0.0200 |    0.60 |  0.1507 |    4.48
    A15 |  char | yes | inter |  1048576 |  524288 | 0.50 ||  2.50 |     1750 ||  32027.23 |   57.30 |   28.65 | 292820.38 | 00h00'37 ||  1600.00 |  1.8922 |   60.60 |     0.00 |  0.0202 |    0.65 |  0.1587 |    5.08
#---------
#---------
# -> inter-SIMD 8-bit, rate 5/6, gen:
# ------|-------|-----|-------|--------|--------|------||-------|----------||-----------|---------|---------|----------|----------||----------|---------|---------|----------|---------|---------|---------|---------|
#  PROC |  TYPE | GEN |   VEC |      N |      K |    R ||   SNR |      FRA || LD+ST+DEC |    CTHR |    ITHR |  LATENCY | RUNTIME  || BIG FREQ | BIG POW | BIG ENE | LIT FREQ | LIT POW | LIT ENE | RAM POW | RAM ENE |
#       |       |     |       |        |        |      ||  (dB) |          ||      (ms) |  (Mb/s) |  (Mb/s) |     (us) | (hhmmss) ||    (Mhz) |     (W) |     (J) |    (Mhz) |     (W) |     (J) |     (W) |     (J) |
# ------|-------|-----|-------|--------|--------|------||-------|----------||-----------|---------|---------|----------|----------||----------|---------|---------|----------|---------|---------|---------|---------|
    A15 |  char | yes | inter |    128 |    107 | 0.83 ||  4.00 | 21203296 ||   8494.84 |  319.49 |  267.07 |     6.41 | 00h00'08 ||  1600.00 |  1.8516 |   15.73 |     0.00 |  0.0198 |    0.17 |  0.0506 |    0.43
    A15 |  char | yes | inter |    256 |    213 | 0.83 ||  4.00 | 14939920 ||  12034.56 |  317.80 |  264.42 |    12.89 | 00h00'12 ||  1600.00 |  2.1439 |   25.80 |     0.00 |  0.0201 |    0.24 |  0.0507 |    0.61
    A15 |  char | yes | inter |    512 |    427 | 0.83 ||  4.00 |  9001600 ||  17136.13 |  268.95 |  224.30 |    30.46 | 00h00'17 ||  1600.00 |  2.1612 |   37.04 |     0.00 |  0.0203 |    0.35 |  0.0508 |    0.87
    A15 |  char | yes | inter |   1024 |    853 | 0.83 ||  4.00 |  4298672 ||  17246.06 |  255.24 |  212.61 |    64.19 | 00h00'17 ||  1600.00 |  2.2422 |   38.67 |     0.00 |  0.0202 |    0.35 |  0.0509 |    0.88
    A15 |  char | yes | inter |   2048 |   1707 | 0.83 ||  4.00 |  2383328 ||  20040.39 |  243.56 |  203.01 |   134.54 | 00h00'20 ||  1600.00 |  2.2976 |   46.05 |     0.00 |  0.0204 |    0.41 |  0.0507 |    1.02
    A15 |  char | yes | inter |   4096 |   3413 | 0.83 ||  4.00 |  1038848 ||  20037.75 |  212.36 |  176.95 |   308.61 | 00h00'20 ||  1600.00 |  2.3623 |   47.33 |     0.00 |  0.0204 |    0.41 |  0.0509 |    1.02
    A15 |  char | yes | inter |   8192 |   6827 | 0.83 ||  4.00 |   480272 ||  20299.05 |  193.82 |  161.53 |   676.25 | 00h00'20 ||  1600.00 |  2.3684 |   48.08 |     0.00 |  0.0206 |    0.42 |  0.0510 |    1.03
    A15 |  char | yes | inter |  16384 |  13653 | 0.83 ||  4.00 |   214064 ||  20135.73 |  174.18 |  145.15 |  1505.03 | 00h00'20 ||  1600.00 |  2.3624 |   47.57 |     0.00 |  0.0207 |    0.42 |  0.0510 |    1.03
    A15 |  char | yes | inter |  32768 |  27307 | 0.83 ||  4.00 |    92992 ||  21531.71 |  141.52 |  117.93 |  3704.70 | 00h00'21 ||  1600.00 |  2.2312 |   48.04 |     0.00 |  0.0201 |    0.43 |  0.0735 |    1.58
    A15 |  char | yes | inter |  65536 |  54613 | 0.83 ||  4.00 |    32256 ||  23652.92 |   89.37 |   74.48 | 11732.60 | 00h00'24 ||  1600.00 |  1.9390 |   45.86 |     0.00 |  0.0201 |    0.47 |  0.1186 |    2.81
    A15 |  char | yes | inter |   262144 |  218453 | 0.83 ||  4.00 |     7500 ||  26829.50 |   73.28 |   61.07 | 57236.27 | 00h00'28 ||  1600.00 |  1.9183 |   51.47 |     0.00 |  0.0201 |    0.54 |  0.1471 |    3.95
    A15 |  char | yes | inter |   524288 |  436907 | 0.83 ||  4.00 |     3500 ||  28929.48 |   63.43 |   52.86 | 132249.06 | 00h00'32 ||  1600.00 |  1.8956 |   54.84 |     0.00 |  0.0202 |    0.58 |  0.1533 |    4.43
    A15 |  char | yes | inter |  1048576 |  873813 | 0.83 ||  4.00 |     1750 ||  32708.29 |   56.10 |   46.75 | 299047.22 | 00h00'39 ||  1600.00 |  1.8548 |   60.67 |     0.00 |  0.0201 |    0.66 |  0.1563 |    5.11
#---------
#---------
