# -> Seq 8-bit, rate 1/2, no gen:
# ------|-------|-----|-------|----------|---------|------||-------|----------||-----------|---------|---------|----------|----------||----------|---------|---------|----------|---------|---------|---------|---------|
#  PROC |  TYPE | GEN |   VEC |        N |       K |    R ||   SNR |      FRA || LD+ST+DEC |    CTHR |    ITHR |  LATENCY | RUNTIME  || BIG FREQ | BIG POW | BIG ENE | LIT FREQ | LIT POW | LIT ENE | RAM POW | RAM ENE |
#       |       |     |       |          |         |      ||  (dB) |          ||      (ms) |  (Mb/s) |  (Mb/s) |     (us) | (hhmmss) ||    (Mhz) |     (W) |     (J) |    (Mhz) |     (W) |     (J) |     (W) |     (J) |
# ------|-------|-----|-------|----------|---------|------||-------|----------||-----------|---------|---------|----------|----------||----------|---------|---------|----------|---------|---------|---------|---------|
    A15 |  char |  no |   seq |     4096 |    2048 | 0.50 ||  2.50 |   106522 ||  20574.38 |   21.21 |   10.60 |   193.15 | 00h00'20 ||  1500.00 |  1.6575 |   34.10 |     0.00 |  0.0105 |    0.22 |  0.0566 |    1.16
#---------
#---------
# -> Seq 8-bit, rate 1/2, gen:
# ------|-------|-----|-------|----------|---------|------||-------|----------||-----------|---------|---------|----------|----------||----------|---------|---------|----------|---------|---------|---------|---------|
#  PROC |  TYPE | GEN |   VEC |        N |       K |    R ||   SNR |      FRA || LD+ST+DEC |    CTHR |    ITHR |  LATENCY | RUNTIME  || BIG FREQ | BIG POW | BIG ENE | LIT FREQ | LIT POW | LIT ENE | RAM POW | RAM ENE |
#       |       |     |       |          |         |      ||  (dB) |          ||      (ms) |  (Mb/s) |  (Mb/s) |     (us) | (hhmmss) ||    (Mhz) |     (W) |     (J) |    (Mhz) |     (W) |     (J) |     (W) |     (J) |
# ------|-------|-----|-------|----------|---------|------||-------|----------||-----------|---------|---------|----------|----------||----------|---------|---------|----------|---------|---------|---------|---------|
    A15 |  char | yes |   seq |     4096 |    2048 | 0.50 ||  2.50 |    92647 ||  20811.22 |   18.23 |    9.12 |   224.63 | 00h00'20 ||  1500.00 |  1.6253 |   33.82 |     0.00 |  0.0105 |    0.22 |  0.0559 |    1.16
#---------
#---------
# -> Intra-SIMD 8-bit, rate 1/2, no gen:
# ------|-------|-----|-------|----------|---------|------||-------|----------||-----------|---------|---------|----------|----------||----------|---------|---------|----------|---------|---------|---------|---------|
#  PROC |  TYPE | GEN |   VEC |        N |       K |    R ||   SNR |      FRA || LD+ST+DEC |    CTHR |    ITHR |  LATENCY | RUNTIME  || BIG FREQ | BIG POW | BIG ENE | LIT FREQ | LIT POW | LIT ENE | RAM POW | RAM ENE |
#       |       |     |       |          |         |      ||  (dB) |          ||      (ms) |  (Mb/s) |  (Mb/s) |     (us) | (hhmmss) ||    (Mhz) |     (W) |     (J) |    (Mhz) |     (W) |     (J) |     (W) |     (J) |
# ------|-------|-----|-------|----------|---------|------||-------|----------||-----------|---------|---------|----------|----------||----------|---------|---------|----------|---------|---------|---------|---------|
    A15 |  char |  no | intra |     4096 |    2048 | 0.50 ||  2.50 |   419152 ||  17498.83 |   98.11 |   49.06 |    41.75 | 00h00'17 ||  1500.00 |  1.8298 |   32.02 |     0.00 |  0.0105 |    0.18 |  0.0508 |    0.89
#---------
#---------
# -> Intra-SIMD 8-bit, rate 1/2, gen:
# ------|-------|-----|-------|----------|---------|------||-------|----------||-----------|---------|---------|----------|----------||----------|---------|---------|----------|---------|---------|---------|---------|
#  PROC |  TYPE | GEN |   VEC |        N |       K |    R ||   SNR |      FRA || LD+ST+DEC |    CTHR |    ITHR |  LATENCY | RUNTIME  || BIG FREQ | BIG POW | BIG ENE | LIT FREQ | LIT POW | LIT ENE | RAM POW | RAM ENE |
#       |       |     |       |          |         |      ||  (dB) |          ||      (ms) |  (Mb/s) |  (Mb/s) |     (us) | (hhmmss) ||    (Mhz) |     (W) |     (J) |    (Mhz) |     (W) |     (J) |     (W) |     (J) |
# ------|-------|-----|-------|----------|---------|------||-------|----------||-----------|---------|---------|----------|----------||----------|---------|---------|----------|---------|---------|---------|---------|
    A15 |  char | yes | intra |     4096 |    2048 | 0.50 ||  2.50 |   489617 ||  17699.11 |  113.31 |   56.65 |    36.15 | 00h00'17 ||  1500.00 |  1.7650 |   31.24 |     0.00 |  0.0105 |    0.18 |  0.0551 |    0.98
#---------
#---------
# -> Inter-SIMD 8-bit, rate 1/2, no gen:
# ------|-------|-----|-------|----------|---------|------||-------|----------||-----------|---------|---------|----------|----------||----------|---------|---------|----------|---------|---------|---------|---------|
#  PROC |  TYPE | GEN |   VEC |        N |       K |    R ||   SNR |      FRA || LD+ST+DEC |    CTHR |    ITHR |  LATENCY | RUNTIME  || BIG FREQ | BIG POW | BIG ENE | LIT FREQ | LIT POW | LIT ENE | RAM POW | RAM ENE |
#       |       |     |       |          |         |      ||  (dB) |          ||      (ms) |  (Mb/s) |  (Mb/s) |     (us) | (hhmmss) ||    (Mhz) |     (W) |     (J) |    (Mhz) |     (W) |     (J) |     (W) |     (J) |
# ------|-------|-----|-------|----------|---------|------||-------|----------||-----------|---------|---------|----------|----------||----------|---------|---------|----------|---------|---------|---------|---------|
    A15 |  char |  no | inter |     4096 |    2048 | 0.50 ||  2.50 |   885920 ||  22175.53 |  163.64 |   81.82 |   400.50 | 00h00'22 ||  1500.00 |  2.0319 |   45.06 |     0.00 |  0.0105 |    0.23 |  0.0505 |    1.12
#---------
#---------
# -> inter-SIMD 8-bit, rate 1/2, gen:
# ------|-------|-----|-------|----------|---------|------||-------|----------||-----------|---------|---------|----------|----------||----------|---------|---------|----------|---------|---------|---------|---------|
#  PROC |  TYPE | GEN |   VEC |        N |       K |    R ||   SNR |      FRA || LD+ST+DEC |    CTHR |    ITHR |  LATENCY | RUNTIME  || BIG FREQ | BIG POW | BIG ENE | LIT FREQ | LIT POW | LIT ENE | RAM POW | RAM ENE |
#       |       |     |       |          |         |      ||  (dB) |          ||      (ms) |  (Mb/s) |  (Mb/s) |     (us) | (hhmmss) ||    (Mhz) |     (W) |     (J) |    (Mhz) |     (W) |     (J) |     (W) |     (J) |
# ------|-------|-----|-------|----------|---------|------||-------|----------||-----------|---------|---------|----------|----------||----------|---------|---------|----------|---------|---------|---------|---------|
    A15 |  char | yes | inter |     4096 |    2048 | 0.50 ||  2.50 |   963264 ||  21477.09 |  183.71 |   91.85 |   356.74 | 00h00'21 ||  1500.00 |  2.0880 |   44.85 |     0.00 |  0.0105 |    0.22 |  0.0504 |    1.08
#---------
#---------
