;Seq 8-bit, rate 1/2, no gen
#     0       1     2       3        4        5      6        7          8         9     10        11         12         13          14        15          16        17        18         19         20          21        22        23         24        25        26        27        28
# ------ ------- ----- ------- -------- -------- ------  ------- ---------- --------- ------ --------- ---------- ----------  ---------- --------- ----------- --------- --------- ---------- ----------  ---------- --------- --------- ---------- --------- --------- --------- --------- 
#  PROC    TYPE   GEN     VEC        N        K      R      SNR        FRA        BE     FE     BE/FE        BER        FER        LOAD     STORE      DECODE      CTHR      ITHR    LATENCY      ET/RT    BIG FREQ   BIG POW   BIG ENE   LIT FREQ   LIT POW   LIT ENE   RAM POW   RAM ENE  
#                                                          (dB)                                                                    (ms)      (ms)        (ms)    (Mb/s)    (Mb/s)       (us)   (hhmmss)       (Mhz)       (W)       (J)      (Mhz)       (W)       (J)       (W)       (J)  
# ------ ------- ----- ------- -------- -------- ------  ------- ---------- --------- ------ --------- ---------- ----------  ---------- --------- ----------- --------- --------- ---------- ----------  ---------- --------- --------- ---------- --------- --------- --------- --------- 
    A53    char    no     seq      128       64   0.50     2.50    1365984         0      0      0.00   1.14e-08   7.32e-07      596.54    582.89    26749.79      6.26      3.13      20.45   00h00'30      450.00    0.0167      0.47     450.00    0.0640      1.79    0.0000      0.00  
    A53    char    no     seq      256      128   0.50     2.50     684488         0      0      0.00   1.14e-08   1.46e-06      346.47    455.26    28197.23      6.04      3.02      42.37   00h00'30      450.00    0.0167      0.49     450.00    0.0634      1.84    0.0000      0.00  
    A53    char    no     seq      512      256   0.50     2.50     314702         0      0      0.00   1.24e-08   3.18e-06      217.20    260.74    29025.72      5.46      2.73      93.75   00h00'30      450.00    0.0167      0.49     450.00    0.0627      1.85    0.0000      0.00  
    A53    char    no     seq     1024      512   0.50     2.50     143295         0      0      0.00   1.36e-08   6.98e-06      127.62    150.65    29465.71      4.93      2.47     207.57   00h00'30      450.00    0.0167      0.50     450.00    0.0619      1.84    0.0000      0.00  
    A53    char    no     seq     2048     1024   0.50     2.50      66002         0      0      0.00   1.48e-08   1.52e-05       91.38    104.75    29652.34      4.53      2.26     452.24   00h00'30      450.00    0.0167      0.50     450.00    0.0617      1.84    0.0000      0.00  
    A53    char    no     seq     4096     2048   0.50     2.50      30739         0      0      0.00   1.59e-08   3.25e-05       73.75     79.49    29745.58      4.21      2.11     972.67   00h00'30      450.00    0.0168      0.50     450.00    0.0617      1.85    0.0000      0.00  
    A53    char    no     seq     8192     4096   0.50     2.50      14400         0      0      0.00   1.70e-08   6.94e-05       74.74     64.48    29782.75      3.94      1.97    2077.91   00h00'30      450.00    0.0167      0.50     450.00    0.0620      1.85    0.0000      0.00  
    A53    char    no     seq    16384     8192   0.50     2.50       6641         0      0      0.00   1.84e-08   1.51e-04       66.82     58.31    29809.75      3.63      1.82    4507.59   00h00'30      450.00    0.0168      0.50     450.00    0.0626      1.88    0.0000      0.00  
    A53    char    no     seq    32768    16384   0.50     2.50       3092         0      0      0.00   1.97e-08   3.23e-04       56.56     55.54    29826.11      3.38      1.69    9682.48   00h00'31      450.00    0.0171      0.51     450.00    0.0632      1.89    0.0000      0.00  
    A53    char    no     seq    65536    32768   0.50     2.50       1473         0      0      0.00   2.07e-08   6.79e-04       51.91     51.19    29842.42      3.22      1.61   20329.61   00h00'32      450.00    0.0174      0.52     450.00    0.0637      1.91    0.0000      0.00  


;Seq 8-bit, rate 5/6, no gen
# ------ ------- ----- ------- -------- -------- ------  ------- ---------- --------- ------ --------- ---------- ----------  ---------- --------- ----------- --------- --------- ---------- ----------  ---------- --------- --------- ---------- --------- --------- --------- --------- 
#  PROC    TYPE   GEN     VEC        N        K      R      SNR        FRA        BE     FE     BE/FE        BER        FER        LOAD     STORE      DECODE      CTHR      ITHR    LATENCY      ET/RT    BIG FREQ   BIG POW   BIG ENE   LIT FREQ   LIT POW   LIT ENE   RAM POW   RAM ENE  
#                                                          (dB)                                                                    (ms)      (ms)        (ms)    (Mb/s)    (Mb/s)       (us)   (hhmmss)       (Mhz)       (W)       (J)      (Mhz)       (W)       (J)       (W)       (J)  
# ------ ------- ----- ------- -------- -------- ------  ------- ---------- --------- ------ --------- ---------- ----------  ---------- --------- ----------- --------- --------- ---------- ----------  ---------- --------- --------- ---------- --------- --------- --------- --------- 
    A53    char    no     seq      128      107   0.83     4.00    1717749         0      0      0.00   5.44e-09   5.82e-07      750.09    776.16    25891.40      8.02      6.70      15.96   00h00'30      450.00    0.0167      0.46     450.00    0.0626      1.72    0.0000      0.00  
    A53    char    no     seq      256      213   0.83     4.00     758727         0      0      0.00   6.19e-09   1.32e-06      376.63    476.91    28043.38      6.72      5.59      38.09   00h00'30      450.00    0.0167      0.48     450.00    0.0630      1.82    0.0000      0.00  
    A53    char    no     seq      512      427   0.83     4.00     351342         0      0      0.00   6.67e-09   2.85e-06      227.72    287.67    28937.36      6.11      5.09      83.83   00h00'30      450.00    0.0167      0.49     450.00    0.0616      1.81    0.0000      0.00  
    A53    char    no     seq     1024      853   0.83     4.00     166292         0      0      0.00   7.05e-09   6.01e-06      141.34    153.44    29401.92      5.73      4.78     178.58   00h00'30      450.00    0.0167      0.50     450.00    0.0616      1.83    0.0000      0.00  
    A53    char    no     seq     2048     1707   0.83     4.00      74617         0      0      0.00   7.85e-09   1.34e-05      103.01    102.25    29625.52      5.12      4.27     399.79   00h00'30      450.00    0.0167      0.50     450.00    0.0617      1.84    0.0000      0.00  
    A53    char    no     seq     4096     3413   0.83     4.00      33541         0      0      0.00   8.74e-09   2.98e-05       86.48     88.56    29720.47      4.60      3.83     891.31   00h00'30      450.00    0.0167      0.50     450.00    0.0616      1.84    0.0000      0.00  
    A53    char    no     seq     8192     6827   0.83     4.00      15695         0      0      0.00   9.33e-09   6.37e-05       84.19     72.22    29763.49      4.30      3.58    1906.33   00h00'30      450.00    0.0167      0.50     450.00    0.0618      1.85    0.0000      0.00  
    A53    char    no     seq    16384    13653   0.83     4.00       7303         0      0      0.00   1.00e-08   1.37e-04       71.99     65.25    29795.72      4.00      3.33    4098.72   00h00'30      450.00    0.0168      0.50     450.00    0.0621      1.86    0.0000      0.00  
    A53    char    no     seq    32768    27307   0.83     4.00       3354         0      0      0.00   1.09e-08   2.98e-04       61.15     58.59    29821.19      3.67      3.06    8926.93   00h00'30      450.00    0.0169      0.51     450.00    0.0628      1.88    0.0000      0.00  
    A53    char    no     seq    65536    54613   0.83     4.00       1543         0      0      0.00   1.19e-08   6.48e-04       53.96     52.67    29843.22      3.38      2.81   19410.14   00h00'31      450.00    0.0169      0.51     450.00    0.0628      1.88    0.0000      0.00  


;Seq 8-bit, rate 1/2, gen
# ------ ------- ----- ------- -------- -------- ------  ------- ---------- --------- ------ --------- ---------- ----------  ---------- --------- ----------- --------- --------- ---------- ----------  ---------- --------- --------- ---------- --------- --------- --------- --------- 
#  PROC    TYPE   GEN     VEC        N        K      R      SNR        FRA        BE     FE     BE/FE        BER        FER        LOAD     STORE      DECODE      CTHR      ITHR    LATENCY      ET/RT    BIG FREQ   BIG POW   BIG ENE   LIT FREQ   LIT POW   LIT ENE   RAM POW   RAM ENE  
#                                                          (dB)                                                                    (ms)      (ms)        (ms)    (Mb/s)    (Mb/s)       (us)   (hhmmss)       (Mhz)       (W)       (J)      (Mhz)       (W)       (J)       (W)       (J)  
# ------ ------- ----- ------- -------- -------- ------  ------- ---------- --------- ------ --------- ---------- ----------  ---------- --------- ----------- --------- --------- ---------- ----------  ---------- --------- --------- ---------- --------- --------- --------- --------- 
    A53    char   yes     seq      128       64   0.50     2.50    1726990         0      0      0.00   9.05e-09   5.79e-07      783.69    769.22    25846.24      8.07      4.03      15.87   00h00'30      450.00    0.0168      0.46     450.00    0.0648      1.78    0.0000      0.00  
    A53    char   yes     seq      256      128   0.50     2.50     879512         0      0      0.00   8.88e-09   1.14e-06      412.50    532.84    27776.22      7.84      3.92      32.66   00h00'30      450.00    0.0167      0.48     450.00    0.0639      1.83    0.0000      0.00  
    A53    char   yes     seq      512      256   0.50     2.50     403522         0      0      0.00   9.68e-09   2.48e-06      261.87    277.59    28806.78      7.04      3.52      72.73   00h00'30      450.00    0.0167      0.49     450.00    0.0645      1.89    0.0000      0.00  
    A53    char   yes     seq     1024      512   0.50     2.50     180042         0      0      0.00   1.08e-08   5.55e-06      163.05    189.05    29325.85      6.21      3.11     164.84   00h00'30      450.00    0.0168      0.50     450.00    0.0649      1.92    0.0000      0.00  
    A53    char   yes     seq     2048     1024   0.50     2.50      82058         0      0      0.00   1.19e-08   1.22e-05      112.11    130.52    29576.57      5.64      2.82     363.39   00h00'30      450.00    0.0167      0.50     450.00    0.0650      1.94    0.0000      0.00  
    A53    char   yes     seq     4096     2048   0.50     2.50      37236         0      0      0.00   1.31e-08   2.69e-05       88.94     96.57    29696.57      5.10      2.55     802.51   00h00'30      450.00    0.0168      0.50     450.00    0.0650      1.94    0.0000      0.00  
    A53    char   yes     seq     8192     4096   0.50     2.50      17363         0      0      0.00   1.41e-08   5.76e-05       90.50     79.49    29744.06      4.75      2.38    1722.86   00h00'30      450.00    0.0167      0.50     450.00    0.0658      1.97    0.0000      0.00  
    A53    char   yes     seq    16384     8192   0.50     2.50       7984         0      0      0.00   1.53e-08   1.25e-04       79.88     71.18    29778.56      4.37      2.19    3748.70   00h00'30      450.00    0.0167      0.50     450.00    0.0671      2.01    0.0000      0.00  
    A53    char   yes     seq    32768    16384   0.50     2.50       3723         0      0      0.00   1.64e-08   2.69e-04       68.59     66.84    29803.30      4.07      2.04    8041.56   00h00'30      450.00    0.0165      0.49     450.00    0.0670      2.01    0.0000      0.00  
    A53    char   yes     seq    65536    32768   0.50     2.50       1755         0      0      0.00   1.74e-08   5.70e-04       61.23     61.27    29816.31      3.84      1.92   17059.15   00h00'30      450.00    0.0168      0.50     450.00    0.0679      2.03    0.0000      0.00  


;Seq 8-bit, rate 5/6, gen
# ------ ------- ----- ------- -------- -------- ------  ------- ---------- --------- ------ --------- ---------- ----------  ---------- --------- ----------- --------- --------- ---------- ----------  ---------- --------- --------- ---------- --------- --------- --------- --------- 
#  PROC    TYPE   GEN     VEC        N        K      R      SNR        FRA        BE     FE     BE/FE        BER        FER        LOAD     STORE      DECODE      CTHR      ITHR    LATENCY      ET/RT    BIG FREQ   BIG POW   BIG ENE   LIT FREQ   LIT POW   LIT ENE   RAM POW   RAM ENE  
#                                                          (dB)                                                                    (ms)      (ms)        (ms)    (Mb/s)    (Mb/s)       (us)   (hhmmss)       (Mhz)       (W)       (J)      (Mhz)       (W)       (J)       (W)       (J)  
# ------ ------- ----- ------- -------- -------- ------  ------- ---------- --------- ------ --------- ---------- ----------  ---------- --------- ----------- --------- --------- ---------- ----------  ---------- --------- --------- ---------- --------- --------- --------- --------- 
    A53    char   yes     seq      128      107   0.83     4.00    2054243         0      0      0.00   4.55e-09   4.87e-07      838.79    888.91    25218.25      9.76      8.16      13.12   00h00'30      450.00    0.0167      0.45     450.00    0.0628      1.69    0.0000      0.00  
    A53    char   yes     seq      256      213   0.83     4.00     911040         0      0      0.00   5.15e-09   1.10e-06      425.47    569.64    27673.21      8.14      6.77      31.47   00h00'30      450.00    0.0167      0.48     450.00    0.0648      1.86    0.0000      0.00  
    A53    char   yes     seq      512      427   0.83     4.00     435906         0      0      0.00   5.37e-09   2.29e-06      290.38    351.41    28693.72      7.61      6.34      67.30   00h00'30      450.00    0.0168      0.49     450.00    0.0639      1.87    0.0000      0.00  
    A53    char   yes     seq     1024      853   0.83     4.00     202207         0      0      0.00   5.80e-09   4.95e-06      178.37    185.30    29278.86      6.99      5.82     146.59   00h00'30      450.00    0.0167      0.50     450.00    0.0638      1.89    0.0000      0.00  
    A53    char   yes     seq     2048     1707   0.83     4.00      91820         0      0      0.00   6.38e-09   1.09e-05      124.94    140.09    29539.26      6.31      5.26     324.59   00h00'30      450.00    0.0167      0.50     450.00    0.0648      1.93    0.0000      0.00  
    A53    char   yes     seq     4096     3413   0.83     4.00      41155         0      0      0.00   7.12e-09   2.43e-05      115.82    119.19    29639.63      5.64      4.70     725.91   00h00'30      450.00    0.0167      0.50     450.00    0.0649      1.94    0.0000      0.00  
    A53    char   yes     seq     8192     6827   0.83     4.00      18887         0      0      0.00   7.76e-09   5.29e-05      101.30     88.36    29723.64      5.17      4.31    1583.80   00h00'30      450.00    0.0168      0.50     450.00    0.0653      1.95    0.0000      0.00  
    A53    char   yes     seq    16384    13653   0.83     4.00       8680         0      0      0.00   8.44e-09   1.15e-04       85.42     75.34    29768.40      4.75      3.96    3448.06   00h00'30      450.00    0.0171      0.51     450.00    0.0661      1.98    0.0000      0.00  
    A53    char   yes     seq    32768    27307   0.83     4.00       4017         0      0      0.00   9.12e-09   2.49e-04       73.19     71.37    29793.18      4.40      3.66    7452.76   00h00'30      450.00    0.0165      0.49     450.00    0.0669      2.00    0.0000      0.00  
    A53    char   yes     seq    65536    54613   0.83     4.00       1849         0      0      0.00   9.90e-09   5.41e-04       66.02     64.29    29804.39      4.05      3.37   16189.67   00h00'30      450.00    0.0167      0.50     450.00    0.0674      2.02    0.0000      0.00  


;Intra-SIMD 8-bit, rate 1/2
# ------ ------- ----- ------- -------- -------- ------  ------- ---------- --------- ------ --------- ---------- ----------  ---------- --------- ----------- --------- --------- ---------- ----------  ---------- --------- --------- ---------- --------- --------- --------- --------- 
#  PROC    TYPE   GEN     VEC        N        K      R      SNR        FRA        BE     FE     BE/FE        BER        FER        LOAD     STORE      DECODE      CTHR      ITHR    LATENCY      ET/RT    BIG FREQ   BIG POW   BIG ENE   LIT FREQ   LIT POW   LIT ENE   RAM POW   RAM ENE  
#                                                          (dB)                                                                    (ms)      (ms)        (ms)    (Mb/s)    (Mb/s)       (us)   (hhmmss)       (Mhz)       (W)       (J)      (Mhz)       (W)       (J)       (W)       (J)  
# ------ ------- ----- ------- -------- -------- ------  ------- ---------- --------- ------ --------- ---------- ----------  ---------- --------- ----------- --------- --------- ---------- ----------  ---------- --------- --------- ---------- --------- --------- --------- --------- 
    A53    char    no   intra      128       64   0.50     2.50    2703185         0      0      0.00   5.78e-09   3.70e-07     1119.73   1496.72    23602.55     13.20      6.60       9.70   00h00'30      450.00    0.0167      0.44     450.00    0.0680      1.78    0.0000      0.00  
    A53    char    no   intra      256      128   0.50     2.50    1749209         0      0      0.00   4.47e-09   5.72e-07      825.67   1135.59    25568.68     16.27      8.13      15.74   00h00'30      450.00    0.0168      0.46     450.00    0.0680      1.87    0.0000      0.00  
    A53    char    no   intra      512      256   0.50     2.50    1008094         0      0      0.00   3.87e-09   9.92e-07      648.30    805.03    27086.27     18.09      9.04      28.31   00h00'30      450.00    0.0168      0.48     450.00    0.0691      1.97    0.0000      0.00  
    A53    char    no   intra     1024      512   0.50     2.50     527032         0      0      0.00   3.71e-09   1.90e-06      446.87    477.23    28292.34     18.47      9.24      55.44   00h00'30      450.00    0.0167      0.49     450.00    0.0697      2.04    0.0000      0.00  
    A53    char    no   intra     2048     1024   0.50     2.50     279448         0      0      0.00   3.49e-09   3.58e-06      374.79    437.45    28733.86     19.37      9.69     105.73   00h00'30      450.00    0.0167      0.49     450.00    0.0703      2.08    0.0000      0.00  
    A53    char    no   intra     4096     2048   0.50     2.50     143201         0      0      0.00   3.41e-09   6.98e-06      380.87    367.29    28986.45     19.73      9.86     207.64   00h00'30      450.00    0.0168      0.50     450.00    0.0723      2.15    0.0000      0.00  
    A53    char    no   intra     8192     4096   0.50     2.50      72697         0      0      0.00   3.36e-09   1.38e-05      371.02    318.82    29146.81     19.96      9.98     410.42   00h00'30      450.00    0.0167      0.50     450.00    0.0731      2.18    0.0000      0.00  
    A53    char    no   intra    16384     8192   0.50     2.50      35187         0      0      0.00   3.47e-09   2.84e-05      361.89    291.38    29235.93     19.29      9.64     849.44   00h00'30      450.00    0.0167      0.50     450.00    0.0763      2.28    0.0000      0.00  
    A53    char    no   intra    32768    16384   0.50     2.50      17137         0      0      0.00   3.56e-09   5.84e-05      313.37    305.24    29297.50     18.77      9.39    1745.70   00h00'31      450.00    0.0169      0.50     450.00    0.0790      2.36    0.0000      0.00  
    A53    char    no   intra    65536    32768   0.50     2.50       8522         0      0      0.00   3.58e-09   1.17e-04      298.46    293.66    29336.07     18.66      9.33    3511.87   00h00'32      450.00    0.0168      0.50     450.00    0.0810      2.43    0.0000      0.00  


;Intra-SIMD 8-bit, rate 5/6
# ------ ------- ----- ------- -------- -------- ------  ------- ---------- --------- ------ --------- ---------- ----------  ---------- --------- ----------- --------- --------- ---------- ----------  ---------- --------- --------- ---------- --------- --------- --------- --------- 
#  PROC    TYPE   GEN     VEC        N        K      R      SNR        FRA        BE     FE     BE/FE        BER        FER        LOAD     STORE      DECODE      CTHR      ITHR    LATENCY      ET/RT    BIG FREQ   BIG POW   BIG ENE   LIT FREQ   LIT POW   LIT ENE   RAM POW   RAM ENE  
#                                                          (dB)                                                                    (ms)      (ms)        (ms)    (Mb/s)    (Mb/s)       (us)   (hhmmss)       (Mhz)       (W)       (J)      (Mhz)       (W)       (J)       (W)       (J)  
# ------ ------- ----- ------- -------- -------- ------  ------- ---------- --------- ------ --------- ---------- ----------  ---------- --------- ----------- --------- --------- ---------- ----------  ---------- --------- --------- ---------- --------- --------- --------- --------- 
    A53    char    no   intra      128      107   0.83     4.00    3876235         0      0      0.00   2.41e-09   2.58e-07     1598.91   2165.00    20837.43     20.17     16.86       6.35   00h00'30      450.00    0.0167      0.41     450.00    0.0674      1.66    0.0000      0.00  
    A53    char    no   intra      256      213   0.83     4.00    2114353         0      0      0.00   2.22e-09   4.73e-07      991.98   1126.83    24907.55     20.03     16.66      12.78   00h00'30      450.00    0.0167      0.45     450.00    0.0680      1.84    0.0000      0.00  
    A53    char    no   intra      512      427   0.83     4.00    1240427         0      0      0.00   1.89e-09   8.06e-07      784.49    972.82    26459.06     22.51     18.77      22.75   00h00'30      450.00    0.0167      0.47     450.00    0.0691      1.95    0.0000      0.00  
    A53    char    no   intra     1024      853   0.83     4.00     701025         0      0      0.00   1.67e-09   1.43e-06      582.62    717.77    27674.26     24.78     20.64      41.33   00h00'30      450.00    0.0167      0.48     450.00    0.0702      2.03    0.0000      0.00  
    A53    char    no   intra     2048     1707   0.83     4.00     350128         0      0      0.00   1.67e-09   2.86e-06      457.18    519.02    28472.49     24.35     20.30      84.11   00h00'30      450.00    0.0167      0.49     450.00    0.0711      2.09    0.0000      0.00  
    A53    char    no   intra     4096     3413   0.83     4.00     178311         0      0      0.00   1.64e-09   5.61e-06      391.17    411.81    28890.21     24.60     20.50     166.52   00h00'30      450.00    0.0167      0.50     450.00    0.0721      2.14    0.0000      0.00  
    A53    char    no   intra     8192     6827   0.83     4.00      89029         0      0      0.00   1.65e-09   1.12e-05      497.61    390.13    28924.00     24.46     20.39     334.85   00h00'30      450.00    0.0167      0.50     450.00    0.0738      2.20    0.0000      0.00  
    A53    char    no   intra    16384    13653   0.83     4.00      43452         0      0      0.00   1.69e-09   2.30e-05      435.42    363.07    29078.38     23.83     19.86     687.58   00h00'30      450.00    0.0168      0.50     450.00    0.0775      2.31    0.0000      0.00  
    A53    char    no   intra    32768    27307   0.83     4.00      20623         0      0      0.00   1.78e-09   4.85e-05      374.54    357.87    29177.99     22.59     18.83    1450.34   00h00'30      450.00    0.0168      0.50     450.00    0.0805      2.41    0.0000      0.00  
    A53    char    no   intra    65536    54613   0.83     4.00       9762         0      0      0.00   1.88e-09   1.02e-04      338.55    335.55    29251.34     21.38     17.82    3065.50   00h00'31      450.00    0.0169      0.51     450.00    0.0828      2.48    0.0000      0.00  


;Intra-SIMD 8-bit, rate 1/2, gen
# ------ ------- ----- ------- -------- -------- ------  ------- ---------- --------- ------ --------- ---------- ----------  ---------- --------- ----------- --------- --------- ---------- ----------  ---------- --------- --------- ---------- --------- --------- --------- --------- 
#  PROC    TYPE   GEN     VEC        N        K      R      SNR        FRA        BE     FE     BE/FE        BER        FER        LOAD     STORE      DECODE      CTHR      ITHR    LATENCY      ET/RT    BIG FREQ   BIG POW   BIG ENE   LIT FREQ   LIT POW   LIT ENE   RAM POW   RAM ENE  
#                                                          (dB)                                                                    (ms)      (ms)        (ms)    (Mb/s)    (Mb/s)       (us)   (hhmmss)       (Mhz)       (W)       (J)      (Mhz)       (W)       (J)       (W)       (J)  
# ------ ------- ----- ------- -------- -------- ------  ------- ---------- --------- ------ --------- ---------- ----------  ---------- --------- ----------- --------- --------- ---------- ----------  ---------- --------- --------- ---------- --------- --------- --------- --------- 
    A53    char   yes   intra      128       64   0.50     2.50    4473757         0      0      0.00   3.49e-09   2.24e-07     1846.73   2020.69    19827.16     24.17     12.08       5.30   00h00'30      450.00    0.0167      0.40     450.00    0.0680      1.61    0.0000      0.00  
    A53    char   yes   intra      256      128   0.50     2.50    2747617         0      0      0.00   2.84e-09   3.64e-07     1294.50   1407.66    23455.01     26.89     13.45       9.52   00h00'30      450.00    0.0168      0.44     450.00    0.0680      1.78    0.0000      0.00  
    A53    char   yes   intra      512      256   0.50     2.50    1658497         0      0      0.00   2.36e-09   6.03e-07     1010.74   1155.57    25488.66     30.71     15.35      16.67   00h00'30      450.00    0.0168      0.46     450.00    0.0702      1.94    0.0000      0.00  
    A53    char   yes   intra     1024      512   0.50     2.50     812754         0      0      0.00   2.40e-09   1.23e-06      725.54    748.24    27266.45     28.96     14.48      35.36   00h00'30      450.00    0.0167      0.48     450.00    0.0723      2.08    0.0000      0.00  
    A53    char   yes   intra     2048     1024   0.50     2.50     414632         0      0      0.00   2.36e-09   2.41e-06      565.67    621.96    28154.73     28.94     14.47      70.77   00h00'30      450.00    0.0167      0.49     450.00    0.0724      2.12    0.0000      0.00  
    A53    char   yes   intra     4096     2048   0.50     2.50     189707         0      0      0.00   2.57e-09   5.27e-06      451.47    474.17    28746.63     26.19     13.09     156.41   00h00'30      450.00    0.0167      0.50     450.00    0.0745      2.21    0.0000      0.00  
    A53    char   yes   intra     8192     4096   0.50     2.50      91063         0      0      0.00   2.68e-09   1.10e-05      405.37    406.49    28984.08     25.04     12.52     327.20   00h00'30      450.00    0.0168      0.50     450.00    0.0777      2.31    0.0000      0.00  
    A53    char   yes   intra    16384     8192   0.50     2.50      43720         0      0      0.00   2.79e-09   2.29e-05      438.81    378.08    29050.90     23.98     11.99     683.16   00h00'30      450.00    0.0171      0.51     450.00    0.0794      2.37    0.0000      0.00  
    A53    char   yes   intra    32768    16384   0.50     2.50      20916         0      0      0.00   2.92e-09   4.78e-05      374.65    377.58    29154.53     22.92     11.46    1429.85   00h00'30      450.00    0.0167      0.50     450.00    0.0820      2.45    0.0000      0.00  
    A53    char   yes   intra    65536    32768   0.50     2.50      10102         0      0      0.00   3.02e-09   9.90e-05      350.66    345.85    29225.91     22.13     11.06    2962.03   00h00'30      450.00    0.0168      0.50     450.00    0.0844      2.53    0.0000      0.00  


;Intra-SIMD 8-bit, rate 5/6, gen
# ------ ------- ----- ------- -------- -------- ------  ------- ---------- --------- ------ --------- ---------- ----------  ---------- --------- ----------- --------- --------- ---------- ----------  ---------- --------- --------- ---------- --------- --------- --------- --------- 
#  PROC    TYPE   GEN     VEC        N        K      R      SNR        FRA        BE     FE     BE/FE        BER        FER        LOAD     STORE      DECODE      CTHR      ITHR    LATENCY      ET/RT    BIG FREQ   BIG POW   BIG ENE   LIT FREQ   LIT POW   LIT ENE   RAM POW   RAM ENE  
#                                                          (dB)                                                                    (ms)      (ms)        (ms)    (Mb/s)    (Mb/s)       (us)   (hhmmss)       (Mhz)       (W)       (J)      (Mhz)       (W)       (J)       (W)       (J)  
# ------ ------- ----- ------- -------- -------- ------  ------- ---------- --------- ------ --------- ---------- ----------  ---------- --------- ----------- --------- --------- ---------- ----------  ---------- --------- --------- ---------- --------- --------- --------- --------- 
    A53    char   yes   intra      128      107   0.83     4.00    5672310         0      0      0.00   1.65e-09   1.76e-07     2341.15   2410.02    17380.37     32.81     27.42       3.90   00h00'30      450.00    0.0167      0.37     450.00    0.0669      1.48    0.0000      0.00  
    A53    char   yes   intra      256      213   0.83     4.00    3116698         0      0      0.00   1.51e-09   3.21e-07     1470.65   1686.15    22490.90     31.11     25.88       8.23   00h00'30      450.00    0.0167      0.43     450.00    0.0680      1.75    0.0000      0.00  
    A53    char   yes   intra      512      427   0.83     4.00    1896355         0      0      0.00   1.23e-09   5.27e-07     1156.42   1325.91    24841.32     35.53     29.64      14.41   00h00'30      450.00    0.0168      0.46     450.00    0.0702      1.92    0.0000      0.00  
    A53    char   yes   intra     1024      853   0.83     4.00    1007213         0      0      0.00   1.16e-09   9.93e-07      888.79   1008.28    26617.49     36.17     30.13      28.31   00h00'30      450.00    0.0167      0.48     450.00    0.0723      2.06    0.0000      0.00  
    A53    char   yes   intra     2048     1707   0.83     4.00     496336         0      0      0.00   1.18e-09   2.01e-06      671.83    679.16    27823.09     34.84     29.04      58.78   00h00'30      450.00    0.0167      0.49     450.00    0.0733      2.14    0.0000      0.00  
    A53    char   yes   intra     4096     3413   0.83     4.00     228325         0      0      0.00   1.28e-09   4.38e-06      510.89    538.61    28541.00     31.61     26.34     129.60   00h00'30      450.00    0.0167      0.50     450.00    0.0736      2.18    0.0000      0.00  
    A53    char   yes   intra     8192     6827   0.83     4.00     111715         0      0      0.00   1.31e-09   8.95e-06      534.02    484.06    28750.43     30.74     25.62     266.47   00h00'30      450.00    0.0168      0.50     450.00    0.0760      2.26    0.0000      0.00  
    A53    char   yes   intra    16384    13653   0.83     4.00      52063         0      0      0.00   1.41e-09   1.92e-05      515.56    440.51    28898.22     28.57     23.81     573.43   00h00'30      450.00    0.0168      0.50     450.00    0.0819      2.45    0.0000      0.00  
    A53    char   yes   intra    32768    27307   0.83     4.00      24101         0      0      0.00   1.52e-09   4.15e-05      443.02    428.45    29028.30     26.41     22.01    1240.60   00h00'30      450.00    0.0168      0.50     450.00    0.0851      2.55    0.0000      0.00  
    A53    char   yes   intra    65536    54613   0.83     4.00      11314         0      0      0.00   1.62e-09   8.84e-05      398.37    390.77    29132.35     24.78     20.65    2644.64   00h00'30      450.00    0.0168      0.50     450.00    0.0862      2.58    0.0000      0.00  


;Inter-SIMD 8-bit, rate 1/2
# ------ ------- ----- ------- -------- -------- ------  ------- ---------- --------- ------ --------- ---------- ----------  ---------- --------- ----------- --------- --------- ---------- ----------  ---------- --------- --------- ---------- --------- --------- --------- --------- 
#  PROC    TYPE   GEN     VEC        N        K      R      SNR        FRA        BE     FE     BE/FE        BER        FER        LOAD     STORE      DECODE      CTHR      ITHR    LATENCY      ET/RT    BIG FREQ   BIG POW   BIG ENE   LIT FREQ   LIT POW   LIT ENE   RAM POW   RAM ENE  
#                                                          (dB)                                                                    (ms)      (ms)        (ms)    (Mb/s)    (Mb/s)       (us)   (hhmmss)       (Mhz)       (W)       (J)      (Mhz)       (W)       (J)       (W)       (J)  
# ------ ------- ----- ------- -------- -------- ------  ------- ---------- --------- ------ --------- ---------- ----------  ---------- --------- ----------- --------- --------- ---------- ----------  ---------- --------- --------- ---------- --------- --------- --------- --------- 
    A53    char    no   inter      128       64   0.50     2.50   12452816         0      0      0.00   1.25e-09   8.03e-08     2593.30    626.47    25617.96     55.27     27.64      37.05   00h00'30      450.00    0.0167      0.48     450.00    0.0766      2.21    0.0000      0.00  
    A53    char    no   inter      256      128   0.50     2.50    6376208         0      0      0.00   1.23e-09   1.57e-07     2534.12    506.69    26350.90     55.54     27.77      73.75   00h00'30      450.00    0.0167      0.49     450.00    0.0777      2.28    0.0000      0.00  
    A53    char    no   inter      512      256   0.50     2.50    2894304         0      0      0.00   1.35e-09   3.46e-07     2457.19    376.33    26841.17     49.94     24.97     164.04   00h00'30      450.00    0.0167      0.50     450.00    0.0826      2.45    0.0000      0.00  
    A53    char    no   inter     1024      512   0.50     2.50    1279856         0      0      0.00   1.53e-09   7.81e-07     2671.77    283.92    26863.43     43.95     21.98     372.78   00h00'30      450.00    0.0168      0.50     450.00    0.0847      2.53    0.0000      0.00  
    A53    char    no   inter     2048     1024   0.50     2.50     592608         0      0      0.00   1.65e-09   1.69e-06     2838.94    257.14    26787.85     40.61     20.31     806.85   00h00'30      450.00    0.0168      0.50     450.00    0.0867      2.59    0.0000      0.00  
    A53    char    no   inter     4096     2048   0.50     2.50     252224         0      0      0.00   1.94e-09   3.96e-06     4441.97    216.42    25258.40     34.53     17.27    1897.79   00h00'30      450.00    0.0168      0.50     450.00    0.0890      2.66    0.0000      0.00  
    A53    char    no   inter     8192     4096   0.50     2.50     116352         0      0      0.00   2.10e-09   8.59e-06     4005.50    206.63    25715.45     31.85     15.92    4115.45   00h00'30      450.00    0.0167      0.50     450.00    0.0910      2.72    0.0000      0.00  
    A53    char    no   inter    16384     8192   0.50     2.50      54224         0      0      0.00   2.25e-09   1.84e-05     4083.43    210.72    25633.42     29.69     14.84    8830.80   00h00'30      450.00    0.0165      0.49     450.00    0.0915      2.74    0.0000      0.00  
    A53    char    no   inter    32768    16384   0.50     2.50      22880         0      0      0.00   2.67e-09   4.37e-05     5457.18    242.51    24233.46     25.05     12.52   20932.27   00h00'31      450.00    0.0169      0.51     450.00    0.0896      2.68    0.0000      0.00  
    A53    char    no   inter    65536    32768   0.50     2.50      10464         0      0      0.00   2.92e-09   9.56e-05     5288.04    230.08    24444.44     22.89     11.44   45814.31   00h00'33      450.00    0.0169      0.51     450.00    0.0898      2.69    0.0000      0.00  


;Inter-SIMD 8-bit, rate 5/6
#     0       1     2       3        4        5      6        7          8         9     10        11         12         13          14        15          16        17        18         19         20          21        22        23         24        25        26        27        28
# ------ ------- ----- ------- -------- -------- ------  ------- ---------- --------- ------ --------- ---------- ----------  ---------- --------- ----------- --------- --------- ---------- ----------  ---------- --------- --------- ---------- --------- --------- --------- --------- 
#  PROC    TYPE   GEN     VEC        N        K      R      SNR        FRA        BE     FE     BE/FE        BER        FER        LOAD     STORE      DECODE      CTHR      ITHR    LATENCY      ET/RT    BIG FREQ   BIG POW   BIG ENE   LIT FREQ   LIT POW   LIT ENE   RAM POW   RAM ENE  
#                                                          (dB)                                                                    (ms)      (ms)        (ms)    (Mb/s)    (Mb/s)       (us)   (hhmmss)       (Mhz)       (W)       (J)      (Mhz)       (W)       (J)       (W)       (J)  
# ------ ------- ----- ------- -------- -------- ------  ------- ---------- --------- ------ --------- ---------- ----------  ---------- --------- ----------- --------- --------- ---------- ----------  ---------- --------- --------- ---------- --------- --------- --------- --------- 
    A53    char    no   inter      128      107   0.83     4.00   16970800         0      0      0.00   5.51e-10   5.89e-08     3502.45    858.95    24103.76     76.31     63.79      26.84   00h00'30      450.00    0.0167      0.48     450.00    0.0776      2.21    0.0000      0.00  
    A53    char    no   inter      256      213   0.83     4.00    7052016         0      0      0.00   6.66e-10   1.42e-07     2795.47    530.73    25995.20     61.57     51.23      66.53   00h00'30      450.00    0.0167      0.49     450.00    0.0784      2.30    0.0000      0.00  
    A53    char    no   inter      512      427   0.83     4.00    3316032         0      0      0.00   7.06e-10   3.02e-07     2584.88    406.52    26654.85     57.27     47.76     143.04   00h00'30      450.00    0.0167      0.50     450.00    0.0790      2.34    0.0000      0.00  
    A53    char    no   inter     1024      853   0.83     4.00    1531760         0      0      0.00   7.65e-10   6.53e-07     3050.79    348.51    26401.68     52.63     43.84     311.29   00h00'30      450.00    0.0167      0.50     450.00    0.0852      2.54    0.0000      0.00  
    A53    char    no   inter     2048     1707   0.83     4.00     653152         0      0      0.00   8.97e-10   1.53e-06     3190.10    299.21    26390.40     44.77     37.31     731.95   00h00'30      450.00    0.0167      0.50     450.00    0.0890      2.66    0.0000      0.00  
    A53    char    no   inter     4096     3413   0.83     4.00     274336         0      0      0.00   1.07e-09   3.65e-06     4726.89    242.80    24944.26     37.56     31.30    1744.66   00h00'30      450.00    0.0167      0.50     450.00    0.0900      2.69    0.0000      0.00  
    A53    char    no   inter     8192     6827   0.83     4.00     130144         0      0      0.00   1.13e-09   7.68e-06     4443.15    228.01    25253.48     35.63     29.69    3678.96   00h00'30      450.00    0.0165      0.49     450.00    0.0920      2.75    0.0000      0.00  
    A53    char    no   inter    16384    13653   0.83     4.00      58304         0      0      0.00   1.26e-09   1.72e-05     4537.67    221.25    25169.19     31.92     26.60    8212.98   00h00'30      450.00    0.0169      0.51     450.00    0.0927      2.77    0.0000      0.00  
    A53    char    no   inter    32768    27307   0.83     4.00      24960         0      0      0.00   1.47e-09   4.01e-05     4963.98    260.65    24716.28     27.32     22.76   19192.89   00h00'31      450.00    0.0169      0.51     450.00    0.0918      2.75    0.0000      0.00  
    A53    char    no   inter    65536    54613   0.83     4.00      11024         0      0      0.00   1.66e-09   9.07e-05     5133.17    255.94    24555.77     24.13     20.11   43461.36   00h00'32      450.00    0.0171      0.51     450.00    0.0909      2.72    0.0000      0.00  


;inter-SIMD 8-bit, rate 1/2, gen
# ------ ------- ----- ------- -------- -------- ------  ------- ---------- --------- ------ --------- ---------- ----------  ---------- --------- ----------- --------- --------- ---------- ----------  ---------- --------- --------- ---------- --------- --------- --------- --------- 
#  PROC    TYPE   GEN     VEC        N        K      R      SNR        FRA        BE     FE     BE/FE        BER        FER        LOAD     STORE      DECODE      CTHR      ITHR    LATENCY      ET/RT    BIG FREQ   BIG POW   BIG ENE   LIT FREQ   LIT POW   LIT ENE   RAM POW   RAM ENE  
#                                                          (dB)                                                                    (ms)      (ms)        (ms)    (Mb/s)    (Mb/s)       (us)   (hhmmss)       (Mhz)       (W)       (J)      (Mhz)       (W)       (J)       (W)       (J)  
# ------ ------- ----- ------- -------- -------- ------  ------- ---------- --------- ------ --------- ---------- ----------  ---------- --------- ----------- --------- --------- ---------- ----------  ---------- --------- --------- ---------- --------- --------- --------- --------- 
    A53    char   yes   inter      128       64   0.50     2.50   14156976         0      0      0.00   1.10e-09   7.06e-08     2885.21    636.88    25199.99     63.09     31.55      32.46   00h00'30      450.00    0.0168      0.48     450.00    0.0777      2.23    0.0000      0.00  
    A53    char   yes   inter      256      128   0.50     2.50    6991568         0      0      0.00   1.12e-09   1.43e-07     2752.95    496.62    26076.29     61.03     30.52      67.11   00h00'30      450.00    0.0167      0.49     450.00    0.0788      2.31    0.0000      0.00  
    A53    char   yes   inter      512      256   0.50     2.50    3254320         0      0      0.00   1.20e-09   3.07e-07     2533.01    391.59    26711.57     56.22     28.11     145.71   00h00'30      450.00    0.0167      0.50     450.00    0.0808      2.40    0.0000      0.00  
    A53    char   yes   inter     1024      512   0.50     2.50    1394576         0      0      0.00   1.40e-09   7.17e-07     2675.94    335.30    26791.56     47.92     23.96     341.93   00h00'30      450.00    0.0167      0.50     450.00    0.0849      2.53    0.0000      0.00  
    A53    char   yes   inter     2048     1024   0.50     2.50     622960         0      0      0.00   1.57e-09   1.61e-06     2907.83    276.59    26693.62     42.70     21.35     767.38   00h00'30      450.00    0.0168      0.50     450.00    0.0891      2.66    0.0000      0.00  
    A53    char   yes   inter     4096     2048   0.50     2.50     260720         0      0      0.00   1.87e-09   3.84e-06     4892.18    236.33    24786.08     35.70     17.85    1835.81   00h00'30      450.00    0.0168      0.50     450.00    0.0901      2.70    0.0000      0.00  
    A53    char   yes   inter     8192     4096   0.50     2.50     124832         0      0      0.00   1.96e-09   8.01e-06     4315.08    224.68    25386.15     34.17     17.09    3835.67   00h00'30      450.00    0.0167      0.50     450.00    0.0925      2.77    0.0000      0.00  
    A53    char   yes   inter    16384     8192   0.50     2.50      53936         0      0      0.00   2.26e-09   1.85e-05     4502.97    205.34    25220.49     29.53     14.76    8878.32   00h00'30      450.00    0.0168      0.50     450.00    0.0927      2.77    0.0000      0.00  
    A53    char   yes   inter    32768    16384   0.50     2.50      23344         0      0      0.00   2.61e-09   4.28e-05     5145.52    245.25    24544.61     25.55     12.78   20517.74   00h00'30      450.00    0.0170      0.51     450.00    0.0915      2.74    0.0000      0.00  
    A53    char   yes   inter    65536    32768   0.50     2.50      10704         0      0      0.00   2.85e-09   9.34e-05     5277.77    246.83    24406.73     23.44     11.72   44740.41   00h00'31      450.00    0.0169      0.51     450.00    0.0912      2.73    0.0000      0.00  


;inter-SIMD 8-bit, rate 5/6, gen
# ------ ------- ----- ------- -------- -------- ------  ------- ---------- --------- ------ --------- ---------- ----------  ---------- --------- ----------- --------- --------- ---------- ----------  ---------- --------- --------- ---------- --------- --------- --------- --------- 
#  PROC    TYPE   GEN     VEC        N        K      R      SNR        FRA        BE     FE     BE/FE        BER        FER        LOAD     STORE      DECODE      CTHR      ITHR    LATENCY      ET/RT    BIG FREQ   BIG POW   BIG ENE   LIT FREQ   LIT POW   LIT ENE   RAM POW   RAM ENE  
#                                                          (dB)                                                                    (ms)      (ms)        (ms)    (Mb/s)    (Mb/s)       (us)   (hhmmss)       (Mhz)       (W)       (J)      (Mhz)       (W)       (J)       (W)       (J)  
# ------ ------- ----- ------- -------- -------- ------  ------- ---------- --------- ------ --------- ---------- ----------  ---------- --------- ----------- --------- --------- ---------- ----------  ---------- --------- --------- ---------- --------- --------- --------- --------- 
    A53    char   yes   inter      128      107   0.83     4.00   18467824         0      0      0.00   5.06e-10   5.41e-08     3782.80    868.55    23688.64     83.41     69.73      24.55   00h00'30      450.00    0.0167      0.47     450.00    0.0787      2.23    0.0000      0.00  
    A53    char   yes   inter      256      213   0.83     4.00    7618560         0      0      0.00   6.16e-10   1.31e-07     2955.19    540.62    25768.77     66.65     55.45      61.46   00h00'30      450.00    0.0168      0.49     450.00    0.0795      2.33    0.0000      0.00  
    A53    char   yes   inter      512      427   0.83     4.00    3518272         0      0      0.00   6.66e-10   2.84e-07     2825.25    448.37    26333.09     60.84     50.74     134.64   00h00'30      450.00    0.0167      0.50     450.00    0.0819      2.42    0.0000      0.00  
    A53    char   yes   inter     1024      853   0.83     4.00    1618128         0      0      0.00   7.24e-10   6.18e-07     3176.26    384.33    26231.17     55.62     46.33     294.58   00h00'30      450.00    0.0167      0.50     450.00    0.0864      2.57    0.0000      0.00  
    A53    char   yes   inter     2048     1707   0.83     4.00     682128         0      0      0.00   8.59e-10   1.47e-06     3876.04    308.98    25689.58     46.76     38.98     700.74   00h00'30      450.00    0.0167      0.50     450.00    0.0905      2.70    0.0000      0.00  
    A53    char   yes   inter     4096     3413   0.83     4.00     285904         0      0      0.00   1.02e-09   3.50e-06     5342.53    244.78    24324.71     39.15     32.62    1673.96   00h00'30      450.00    0.0168      0.50     450.00    0.0908      2.72    0.0000      0.00  
    A53    char   yes   inter     8192     6827   0.83     4.00     134672         0      0      0.00   1.09e-09   7.43e-06     4690.85    237.11    24995.29     36.87     30.73    3555.10   00h00'30      450.00    0.0165      0.49     450.00    0.0922      2.76    0.0000      0.00  
    A53    char   yes   inter    16384    13653   0.83     4.00      59520         0      0      0.00   1.23e-09   1.68e-05     4576.77    219.73    25126.00     32.59     27.16    8043.68   00h00'30      450.00    0.0168      0.50     450.00    0.0943      2.82    0.0000      0.00  
    A53    char   yes   inter    32768    27307   0.83     4.00      24640         0      0      0.00   1.49e-09   4.06e-05     6029.66    262.55    23633.12     26.98     22.48   19432.03   00h00'30      450.00    0.0168      0.50     450.00    0.0911      2.73    0.0000      0.00  
    A53    char   yes   inter    65536    54613   0.83     4.00      11072         0      0      0.00   1.65e-09   9.03e-05     5481.54    258.11    24202.23     24.23     20.19   43268.61   00h00'31      450.00    0.0170      0.51     450.00    0.0917      2.75    0.0000      0.00  
