# -> Seq 8-bit, rate 1/2, no gen:
# ------|-------|-----|-------|----------|---------|------||-------|----------||-----------|---------|---------|----------|----------||----------|---------|---------|----------|---------|---------|---------|---------|
#  PROC |  TYPE | GEN |   VEC |        N |       K |    R ||   SNR |      FRA || LD+ST+DEC |    CTHR |    ITHR |  LATENCY | RUNTIME  || BIG FREQ | BIG POW | BIG ENE | LIT FREQ | LIT POW | LIT ENE | RAM POW | RAM ENE |
#       |       |     |       |          |         |      ||  (dB) |          ||      (ms) |  (Mb/s) |  (Mb/s) |     (us) | (hhmmss) ||    (Mhz) |     (W) |     (J) |    (Mhz) |     (W) |     (J) |     (W) |     (J) |
# ------|-------|-----|-------|----------|---------|------||-------|----------||-----------|---------|---------|----------|----------||----------|---------|---------|----------|---------|---------|---------|---------|
    A53 |  char |  no |   seq |   131072 |   65536 | 0.50 ||  2.50 |     2500 ||  63677.46 |    5.15 |    2.57 | 25470.98 | 00h01'06 ||   450.00 |  0.0169 |    1.08 |   775.00 |  0.1358 |    8.65 |  0.0000 |    0.00
    A53 |  char |  no |   seq |   262144 |  131072 | 0.50 ||  2.50 |     1250 ||  68988.73 |    4.75 |    2.37 | 55190.98 | 00h01'13 ||   450.00 |  0.0173 |    1.19 |   775.00 |  0.1357 |    9.36 |  0.0000 |    0.00
    A53 |  char |  no |   seq |   524288 |  262144 | 0.50 ||  2.50 |      625 ||  73115.60 |    4.48 |    2.24 | 116984.96 | 00h01'22 ||   450.00 |  0.0173 |    1.27 |   775.00 |  0.1355 |    9.91 |  0.0000 |    0.00
    A53 |  char |  no |   seq |  1048576 |  524288 | 0.50 ||  2.50 |      300 ||  75045.21 |    4.19 |    2.10 | 250150.69 | 00h01'32 ||   450.00 |  0.0172 |    1.29 |   775.00 |  0.1358 |   10.19 |  0.0000 |    0.00
#---------
#---------
# -> Seq 8-bit, rate 5/6, no gen:
# ------|-------|-----|-------|----------|---------|------||-------|----------||-----------|---------|---------|----------|----------||----------|---------|---------|----------|---------|---------|---------|---------|
#  PROC |  TYPE | GEN |   VEC |        N |       K |    R ||   SNR |      FRA || LD+ST+DEC |    CTHR |    ITHR |  LATENCY | RUNTIME  || BIG FREQ | BIG POW | BIG ENE | LIT FREQ | LIT POW | LIT ENE | RAM POW | RAM ENE |
#       |       |     |       |          |         |      ||  (dB) |          ||      (ms) |  (Mb/s) |  (Mb/s) |     (us) | (hhmmss) ||    (Mhz) |     (W) |     (J) |    (Mhz) |     (W) |     (J) |     (W) |     (J) |
# ------|-------|-----|-------|----------|---------|------||-------|----------||-----------|---------|---------|----------|----------||----------|---------|---------|----------|---------|---------|---------|---------|
    A53 |  char |  no |   seq |   131072 |  109227 | 0.83 ||  4.00 |     2500 ||  59917.25 |    5.47 |    4.56 | 23966.90 | 00h01'01 ||   450.00 |  0.0169 |    1.01 |   775.00 |  0.1345 |    8.06 |  0.0000 |    0.00
    A53 |  char |  no |   seq |   262144 |  218453 | 0.83 ||  4.00 |     1250 ||  65158.82 |    5.03 |    4.19 | 52127.05 | 00h01'08 ||   450.00 |  0.0171 |    1.11 |   775.00 |  0.1349 |    8.79 |  0.0000 |    0.00
    A53 |  char |  no |   seq |   524288 |  436907 | 0.83 ||  4.00 |      625 ||  70847.15 |    4.63 |    3.85 | 113355.45 | 00h01'18 ||   450.00 |  0.0170 |    1.20 |   775.00 |  0.1352 |    9.58 |  0.0000 |    0.00
    A53 |  char |  no |   seq |  1048576 |  873813 | 0.83 ||  4.00 |      300 ||  72300.72 |    4.35 |    3.63 | 241002.41 | 00h01'26 ||   450.00 |  0.0173 |    1.25 |   775.00 |  0.1353 |    9.78 |  0.0000 |    0.00
#---------
#---------
# -> Seq 8-bit, rate 1/2, gen:
# ------|-------|-----|-------|----------|---------|------||-------|----------||-----------|---------|---------|----------|----------||----------|---------|---------|----------|---------|---------|---------|---------|
#  PROC |  TYPE | GEN |   VEC |        N |       K |    R ||   SNR |      FRA || LD+ST+DEC |    CTHR |    ITHR |  LATENCY | RUNTIME  || BIG FREQ | BIG POW | BIG ENE | LIT FREQ | LIT POW | LIT ENE | RAM POW | RAM ENE |
#       |       |     |       |          |         |      ||  (dB) |          ||      (ms) |  (Mb/s) |  (Mb/s) |     (us) | (hhmmss) ||    (Mhz) |     (W) |     (J) |    (Mhz) |     (W) |     (J) |     (W) |     (J) |
# ------|-------|-----|-------|----------|---------|------||-------|----------||-----------|---------|---------|----------|----------||----------|---------|---------|----------|---------|---------|---------|---------|
    A53 |  char | yes |   seq |   131072 |   65536 | 0.50 ||  2.50 |     2500 ||  53350.15 |    6.14 |    3.07 | 21340.06 | 00h00'53 ||   450.00 |  0.0169 |    0.90 |   775.00 |  0.1455 |    7.76 |  0.0000 |    0.00
    A53 |  char | yes |   seq |   262144 |  131072 | 0.50 ||  2.50 |     1250 ||  59389.48 |    5.52 |    2.76 | 47511.58 | 00h00'59 ||   450.00 |  0.0170 |    1.01 |   775.00 |  0.1459 |    8.67 |  0.0000 |    0.00
    A53 |  char | yes |   seq |   524288 |  262144 | 0.50 ||  2.50 |      625 ||  62835.74 |    5.21 |    2.61 | 100537.19 | 00h01'03 ||   450.00 |  0.0170 |    1.07 |   775.00 |  0.1461 |    9.18 |  0.0000 |    0.00
    A53 |  char | yes |   seq |  1048576 |  524288 | 0.50 ||  2.50 |      300 ||  63419.54 |    4.96 |    2.48 | 211398.48 | 00h01'04 ||   450.00 |  0.0170 |    1.08 |   775.00 |  0.1461 |    9.27 |  0.0000 |    0.00
#---------
#---------
# -> Seq 8-bit, rate 5/6, gen:
# ------|-------|-----|-------|----------|---------|------||-------|----------||-----------|---------|---------|----------|----------||----------|---------|---------|----------|---------|---------|---------|---------|
#  PROC |  TYPE | GEN |   VEC |        N |       K |    R ||   SNR |      FRA || LD+ST+DEC |    CTHR |    ITHR |  LATENCY | RUNTIME  || BIG FREQ | BIG POW | BIG ENE | LIT FREQ | LIT POW | LIT ENE | RAM POW | RAM ENE |
#       |       |     |       |          |         |      ||  (dB) |          ||      (ms) |  (Mb/s) |  (Mb/s) |     (us) | (hhmmss) ||    (Mhz) |     (W) |     (J) |    (Mhz) |     (W) |     (J) |     (W) |     (J) |
# ------|-------|-----|-------|----------|---------|------||-------|----------||-----------|---------|---------|----------|----------||----------|---------|---------|----------|---------|---------|---------|---------|
    A53 |  char | yes |   seq |   131072 |  109227 | 0.83 ||  4.00 |     2500 ||  50393.71 |    6.50 |    5.42 | 20157.48 | 00h00'50 ||   450.00 |  0.0168 |    0.85 |   775.00 |  0.1440 |    7.26 |  0.0000 |    0.00
    A53 |  char | yes |   seq |   262144 |  218453 | 0.83 ||  4.00 |     1250 ||  56055.81 |    5.85 |    4.87 | 44844.65 | 00h00'56 ||   450.00 |  0.0170 |    0.95 |   775.00 |  0.1450 |    8.13 |  0.0000 |    0.00
    A53 |  char | yes |   seq |   524288 |  436907 | 0.83 ||  4.00 |      625 ||  61397.23 |    5.34 |    4.45 | 98235.57 | 00h01'01 ||   450.00 |  0.0169 |    1.04 |   775.00 |  0.1459 |    8.96 |  0.0000 |    0.00
    A53 |  char | yes |   seq |  1048576 |  873813 | 0.83 ||  4.00 |      300 ||  61260.18 |    5.14 |    4.28 | 204200.59 | 00h01'02 ||   450.00 |  0.0171 |    1.05 |   775.00 |  0.1453 |    8.90 |  0.0000 |    0.00
#---------
#---------
# -> Intra-SIMD 8-bit, rate 1/2, no gen:
# ------|-------|-----|-------|----------|---------|------||-------|----------||-----------|---------|---------|----------|----------||----------|---------|---------|----------|---------|---------|---------|---------|
#  PROC |  TYPE | GEN |   VEC |        N |       K |    R ||   SNR |      FRA || LD+ST+DEC |    CTHR |    ITHR |  LATENCY | RUNTIME  || BIG FREQ | BIG POW | BIG ENE | LIT FREQ | LIT POW | LIT ENE | RAM POW | RAM ENE |
#       |       |     |       |          |         |      ||  (dB) |          ||      (ms) |  (Mb/s) |  (Mb/s) |     (us) | (hhmmss) ||    (Mhz) |     (W) |     (J) |    (Mhz) |     (W) |     (J) |     (W) |     (J) |
# ------|-------|-----|-------|----------|---------|------||-------|----------||-----------|---------|---------|----------|----------||----------|---------|---------|----------|---------|---------|---------|---------|
    A53 |  char |  no | intra |   131072 |   65536 | 0.50 ||  2.50 |    15000 ||  64933.07 |   30.28 |   15.14 |  4328.87 | 00h01'07 ||   450.00 |  0.0170 |    1.11 |   775.00 |  0.1801 |   11.69 |  0.0000 |    0.00
    A53 |  char |  no | intra |   262144 |  131072 | 0.50 ||  2.50 |     7000 ||  67127.00 |   27.34 |   13.67 |  9589.57 | 00h01'11 ||   450.00 |  0.0170 |    1.14 |   775.00 |  0.1824 |   12.24 |  0.0000 |    0.00
    A53 |  char |  no | intra |   524288 |  262144 | 0.50 ||  2.50 |     3500 ||  70631.48 |   25.98 |   12.99 | 20180.42 | 00h01'19 ||   450.00 |  0.0173 |    1.22 |   775.00 |  0.1832 |   12.94 |  0.0000 |    0.00
    A53 |  char |  no | intra |  1048576 |  524288 | 0.50 ||  2.50 |     1750 ||  77509.90 |   23.67 |   11.84 | 44291.37 | 00h01'34 ||   450.00 |  0.0172 |    1.34 |   775.00 |  0.1837 |   14.24 |  0.0000 |    0.00
#---------
#---------
# -> Intra-SIMD 8-bit, rate 5/6, no gen:
# ------|-------|-----|-------|----------|---------|------||-------|----------||-----------|---------|---------|----------|----------||----------|---------|---------|----------|---------|---------|---------|---------|
#  PROC |  TYPE | GEN |   VEC |        N |       K |    R ||   SNR |      FRA || LD+ST+DEC |    CTHR |    ITHR |  LATENCY | RUNTIME  || BIG FREQ | BIG POW | BIG ENE | LIT FREQ | LIT POW | LIT ENE | RAM POW | RAM ENE |
#       |       |     |       |          |         |      ||  (dB) |          ||      (ms) |  (Mb/s) |  (Mb/s) |     (us) | (hhmmss) ||    (Mhz) |     (W) |     (J) |    (Mhz) |     (W) |     (J) |     (W) |     (J) |
# ------|-------|-----|-------|----------|---------|------||-------|----------||-----------|---------|---------|----------|----------||----------|---------|---------|----------|---------|---------|---------|---------|
    A53 |  char |  no | intra |   131072 |  109227 | 0.83 ||  4.00 |    15000 ||  55489.63 |   35.43 |   29.53 |  3699.31 | 00h00'57 ||   450.00 |  0.0169 |    0.94 |   775.00 |  0.1861 |   10.33 |  0.0000 |    0.00
    A53 |  char |  no | intra |   262144 |  218453 | 0.83 ||  4.00 |     7500 ||  62943.21 |   31.24 |   26.03 |  8392.43 | 00h01'06 ||   450.00 |  0.0171 |    1.08 |   775.00 |  0.1879 |   11.83 |  0.0000 |    0.00
    A53 |  char |  no | intra |   524288 |  436907 | 0.83 ||  4.00 |     3500 ||  65428.61 |   28.05 |   23.37 | 18693.89 | 00h01'12 ||   450.00 |  0.0171 |    1.12 |   775.00 |  0.1883 |   12.32 |  0.0000 |    0.00
    A53 |  char |  no | intra |  1048576 |  873813 | 0.83 ||  4.00 |     1750 ||  70669.70 |   25.97 |   21.64 | 40382.68 | 00h01'24 ||   450.00 |  0.0173 |    1.22 |   775.00 |  0.1890 |   13.36 |  0.0000 |    0.00
#---------
#---------
# -> Intra-SIMD 8-bit, rate 1/2, gen:
# ------|-------|-----|-------|----------|---------|------||-------|----------||-----------|---------|---------|----------|----------||----------|---------|---------|----------|---------|---------|---------|---------|
#  PROC |  TYPE | GEN |   VEC |        N |       K |    R ||   SNR |      FRA || LD+ST+DEC |    CTHR |    ITHR |  LATENCY | RUNTIME  || BIG FREQ | BIG POW | BIG ENE | LIT FREQ | LIT POW | LIT ENE | RAM POW | RAM ENE |
#       |       |     |       |          |         |      ||  (dB) |          ||      (ms) |  (Mb/s) |  (Mb/s) |     (us) | (hhmmss) ||    (Mhz) |     (W) |     (J) |    (Mhz) |     (W) |     (J) |     (W) |     (J) |
# ------|-------|-----|-------|----------|---------|------||-------|----------||-----------|---------|---------|----------|----------||----------|---------|---------|----------|---------|---------|---------|---------|
    A53 |  char | yes | intra |   131072 |   65536 | 0.50 ||  2.50 |    15000 ||  56101.21 |   35.05 |   17.52 |  3740.08 | 00h00'56 ||   450.00 |  0.0169 |    0.95 |   775.00 |  0.1866 |   10.47 |  0.0000 |    0.00
    A53 |  char | yes | intra |   262144 |  131072 | 0.50 ||  2.50 |     7000 ||  60192.97 |   30.49 |   15.24 |  8599.00 | 00h01'00 ||   450.00 |  0.0169 |    1.02 |   775.00 |  0.1869 |   11.25 |  0.0000 |    0.00
    A53 |  char | yes | intra |   524288 |  262144 | 0.50 ||  2.50 |     3500 ||  63272.45 |   29.00 |   14.50 | 18077.84 | 00h01'03 ||   450.00 |  0.0170 |    1.07 |   775.00 |  0.1864 |   11.79 |  0.0000 |    0.00
    A53 |  char | yes | intra |  1048576 |  524288 | 0.50 ||  2.50 |     1750 ||  69307.12 |   26.48 |   13.24 | 39604.07 | 00h01'09 ||   450.00 |  0.0170 |    1.18 |   775.00 |  0.1861 |   12.90 |  0.0000 |    0.00
#---------
#---------
# -> Intra-SIMD 8-bit, rate 5/6, gen:
# ------|-------|-----|-------|----------|---------|------||-------|----------||-----------|---------|---------|----------|----------||----------|---------|---------|----------|---------|---------|---------|---------|
#  PROC |  TYPE | GEN |   VEC |        N |       K |    R ||   SNR |      FRA || LD+ST+DEC |    CTHR |    ITHR |  LATENCY | RUNTIME  || BIG FREQ | BIG POW | BIG ENE | LIT FREQ | LIT POW | LIT ENE | RAM POW | RAM ENE |
#       |       |     |       |          |         |      ||  (dB) |          ||      (ms) |  (Mb/s) |  (Mb/s) |     (us) | (hhmmss) ||    (Mhz) |     (W) |     (J) |    (Mhz) |     (W) |     (J) |     (W) |     (J) |
# ------|-------|-----|-------|----------|---------|------||-------|----------||-----------|---------|---------|----------|----------||----------|---------|---------|----------|---------|---------|---------|---------|
    A53 |  char | yes | intra |   131072 |  109227 | 0.83 ||  4.00 |    15000 ||  48871.01 |   40.23 |   33.53 |  3258.07 | 00h00'48 ||   450.00 |  0.0170 |    0.83 |   775.00 |  0.1922 |    9.39 |  0.0000 |    0.00
    A53 |  char | yes | intra |   262144 |  218453 | 0.83 ||  4.00 |     7500 ||  56570.20 |   34.75 |   28.96 |  7542.69 | 00h00'56 ||   450.00 |  0.0169 |    0.96 |   775.00 |  0.1924 |   10.88 |  0.0000 |    0.00
    A53 |  char | yes | intra |   524288 |  436907 | 0.83 ||  4.00 |     3500 ||  61208.53 |   29.98 |   24.98 | 17488.15 | 00h01'01 ||   450.00 |  0.0169 |    1.04 |   775.00 |  0.1907 |   11.67 |  0.0000 |    0.00
    A53 |  char | yes | intra |  1048576 |  873813 | 0.83 ||  4.00 |     1750 ||  63563.21 |   28.87 |   24.06 | 36321.84 | 00h01'04 ||   450.00 |  0.0171 |    1.09 |   775.00 |  0.1908 |   12.13 |  0.0000 |    0.00
#---------
#---------
# -> Inter-SIMD 8-bit, rate 1/2, no gen:
# ------|-------|-----|-------|----------|---------|------||-------|----------||-----------|---------|---------|----------|----------||----------|---------|---------|----------|---------|---------|---------|---------|
#  PROC |  TYPE | GEN |   VEC |        N |       K |    R ||   SNR |      FRA || LD+ST+DEC |    CTHR |    ITHR |  LATENCY | RUNTIME  || BIG FREQ | BIG POW | BIG ENE | LIT FREQ | LIT POW | LIT ENE | RAM POW | RAM ENE |
#       |       |     |       |          |         |      ||  (dB) |          ||      (ms) |  (Mb/s) |  (Mb/s) |     (us) | (hhmmss) ||    (Mhz) |     (W) |     (J) |    (Mhz) |     (W) |     (J) |     (W) |     (J) |
# ------|-------|-----|-------|----------|---------|------||-------|----------||-----------|---------|---------|----------|----------||----------|---------|---------|----------|---------|---------|---------|---------|
    A53 |  char |  no | inter |   131072 |   65536 | 0.50 ||  2.50 |    15000 ||  57128.42 |   34.42 |   17.21 | 60936.98 | 00h01'00 ||   450.00 |  0.0171 |    0.97 |   775.00 |  0.1904 |   10.88 |  0.0000 |    0.00
    A53 |  char |  no | inter |   262144 |  131072 | 0.50 ||  2.50 |     7000 ||  56161.62 |   32.67 |   16.34 | 128369.41 | 00h01'03 ||   450.00 |  0.0171 |    0.96 |   775.00 |  0.1921 |   10.79 |  0.0000 |    0.00
    A53 |  char |  no | inter |   524288 |  262144 | 0.50 ||  2.50 |     3500 ||  62697.11 |   29.27 |   14.63 | 286615.34 | 00h01'16 ||   450.00 |  0.0172 |    1.08 |   775.00 |  0.1894 |   11.87 |  0.0000 |    0.00
    A53 |  char |  no | inter |  1048576 |  524288 | 0.50 ||  2.50 |     1750 ||  68037.67 |   26.97 |   13.49 | 622058.69 | 00h01'35 ||   450.00 |  0.0176 |    1.20 |   775.00 |  0.1887 |   12.84 |  0.0000 |    0.00
#---------
#---------
# -> Inter-SIMD 8-bit, rate 5/6, no gen:
# ------|-------|-----|-------|----------|---------|------||-------|----------||-----------|---------|---------|----------|----------||----------|---------|---------|----------|---------|---------|---------|---------|
#  PROC |  TYPE | GEN |   VEC |        N |       K |    R ||   SNR |      FRA || LD+ST+DEC |    CTHR |    ITHR |  LATENCY | RUNTIME  || BIG FREQ | BIG POW | BIG ENE | LIT FREQ | LIT POW | LIT ENE | RAM POW | RAM ENE |
#       |       |     |       |          |         |      ||  (dB) |          ||      (ms) |  (Mb/s) |  (Mb/s) |     (us) | (hhmmss) ||    (Mhz) |     (W) |     (J) |    (Mhz) |     (W) |     (J) |     (W) |     (J) |
# ------|-------|-----|-------|----------|---------|------||-------|----------||-----------|---------|---------|----------|----------||----------|---------|---------|----------|---------|---------|---------|---------|
    A53 |  char |  no | inter |   131072 |  109227 | 0.83 ||  4.00 |    15000 ||  53557.49 |   36.71 |   30.59 | 57127.99 | 00h00'56 ||   450.00 |  0.0171 |    0.91 |   775.00 |  0.1921 |   10.29 |  0.0000 |    0.00
    A53 |  char |  no | inter |   262144 |  218453 | 0.83 ||  4.00 |     7500 ||  56929.80 |   34.54 |   28.78 | 121450.25 | 00h01'03 ||   450.00 |  0.0171 |    0.97 |   775.00 |  0.1934 |   11.01 |  0.0000 |    0.00
    A53 |  char |  no | inter |   524288 |  436907 | 0.83 ||  4.00 |     3500 ||  60590.67 |   30.29 |   25.24 | 276985.94 | 00h01'13 ||   450.00 |  0.0173 |    1.05 |   775.00 |  0.1909 |   11.57 |  0.0000 |    0.00
    A53 |  char |  no | inter |  1048576 |  873813 | 0.83 ||  4.00 |     1750 ||  64351.79 |   28.52 |   23.76 | 588359.19 | 00h01'29 ||   450.00 |  0.0177 |    1.14 |   775.00 |  0.1904 |   12.26 |  0.0000 |    0.00
#---------
#---------
# -> inter-SIMD 8-bit, rate 1/2, gen:
# ------|-------|-----|-------|----------|---------|------||-------|----------||-----------|---------|---------|----------|----------||----------|---------|---------|----------|---------|---------|---------|---------|
#  PROC |  TYPE | GEN |   VEC |        N |       K |    R ||   SNR |      FRA || LD+ST+DEC |    CTHR |    ITHR |  LATENCY | RUNTIME  || BIG FREQ | BIG POW | BIG ENE | LIT FREQ | LIT POW | LIT ENE | RAM POW | RAM ENE |
#       |       |     |       |          |         |      ||  (dB) |          ||      (ms) |  (Mb/s) |  (Mb/s) |     (us) | (hhmmss) ||    (Mhz) |     (W) |     (J) |    (Mhz) |     (W) |     (J) |     (W) |     (J) |
# ------|-------|-----|-------|----------|---------|------||-------|----------||-----------|---------|---------|----------|----------||----------|---------|---------|----------|---------|---------|---------|---------|
    A53 |  char | yes | inter |   131072 |   65536 | 0.50 ||  2.50 |    15000 ||  54872.97 |   35.83 |   17.91 | 58531.16 | 00h00'56 ||   450.00 |  0.0170 |    0.93 |   775.00 |  0.1926 |   10.57 |  0.0000 |    0.00
    A53 |  char | yes | inter |   262144 |  131072 | 0.50 ||  2.50 |     7000 ||  57575.12 |   31.87 |   15.94 | 131600.28 | 00h01'00 ||   450.00 |  0.0172 |    0.99 |   775.00 |  0.1914 |   11.02 |  0.0000 |    0.00
    A53 |  char | yes | inter |   524288 |  262144 | 0.50 ||  2.50 |     3500 ||  61316.61 |   29.93 |   14.96 | 280304.50 | 00h01'06 ||   450.00 |  0.0170 |    1.04 |   775.00 |  0.1905 |   11.68 |  0.0000 |    0.00
    A53 |  char | yes | inter |  1048576 |  524288 | 0.50 ||  2.50 |     1750 ||  66653.34 |   27.53 |   13.77 | 609402.00 | 00h01'17 ||   450.00 |  0.0170 |    1.13 |   775.00 |  0.1907 |   12.71 |  0.0000 |    0.00
#---------
#---------
# -> inter-SIMD 8-bit, rate 5/6, gen:
# ------|-------|-----|-------|----------|---------|------||-------|----------||-----------|---------|---------|----------|----------||----------|---------|---------|----------|---------|---------|---------|---------|
#  PROC |  TYPE | GEN |   VEC |        N |       K |    R ||   SNR |      FRA || LD+ST+DEC |    CTHR |    ITHR |  LATENCY | RUNTIME  || BIG FREQ | BIG POW | BIG ENE | LIT FREQ | LIT POW | LIT ENE | RAM POW | RAM ENE |
#       |       |     |       |          |         |      ||  (dB) |          ||      (ms) |  (Mb/s) |  (Mb/s) |     (us) | (hhmmss) ||    (Mhz) |     (W) |     (J) |    (Mhz) |     (W) |     (J) |     (W) |     (J) |
# ------|-------|-----|-------|----------|---------|------||-------|----------||-----------|---------|---------|----------|----------||----------|---------|---------|----------|---------|---------|---------|---------|
    A53 |  char | yes | inter |   262144 |  218453 | 0.83 ||  4.00 |     7500 ||  58785.72 |   33.44 |   27.87 | 125409.54 | 00h01'01 ||   450.00 |  0.0171 |    1.00 |   775.00 |  0.1916 |   11.27 |  0.0000 |    0.00
    A53 |  char | yes | inter |   524288 |  436907 | 0.83 ||  4.00 |     3500 ||  58798.77 |   31.21 |   26.01 | 268794.34 | 00h01'04 ||   450.00 |  0.0171 |    1.00 |   775.00 |  0.1935 |   11.38 |  0.0000 |    0.00
    A53 |  char | yes | inter |  1048576 |  873813 | 0.83 ||  4.00 |     1750 ||  64495.43 |   28.45 |   23.71 | 589672.50 | 00h01'15 ||   450.00 |  0.0170 |    1.10 |   775.00 |  0.1916 |   12.36 |  0.0000 |    0.00
#---------
#---------
