PROC,TYPE,GEN,VEC,N,K,R,SNR (dB),FRA,LD+ST+DEC (ms),CTHR (Mbit/s),ITHR (Mbit/s),LATENCY (us),CLU_FREQ (MHz),CLU_POW (W),CLU_ENE (J),RAM_POW (W),RAM_ENE (J),EB_CLU (nJ),EB_CLU_RAM (nJ),TB_CLU (ns)
A15,char,no,seq,4096,2048,0.50,2.50,106522,28079.14,15.54,7.77,263.60,1100.00,0.8863,24.89,0.0517,1.45,114.07650390625,120.730859375,128.7109375
A15,char,yes,seq,4096,2048,0.50,2.50,92647,28378.57,13.37,6.69,306.31,1100.00,0.8688,24.66,0.0547,1.55,129.9424453125,138.123674316406,149.5654296875
A15,char,no,intra,4096,2048,0.50,2.50,419152,23529.36,72.97,36.48,56.14,1100.00,0.9624,22.64,0.0538,1.27,26.3814140625,27.856185546875,27.412109375
A15,char,yes,intra,4096,2048,0.50,2.50,489617,24195.28,82.89,41.44,49.42,1100.00,0.9647,23.34,0.0524,1.27,23.2790400390625,24.5434970703125,24.130859375
A15,char,no,inter,4096,2048,0.50,2.50,885920,29602.30,122.58,61.29,534.63,1100.00,1.0906,32.28,0.0508,1.50,17.7938073120117,18.6226404418945,16.3156127929688
A15,char,yes,inter,4096,2048,0.50,2.50,963264,30663.38,128.67,64.34,509.32,1100.00,1.1151,34.19,0.0506,1.55,17.3322366943359,18.1187232666016,15.543212890625
