# -> Seq 8-bit, rate 1/2, no gen:
# ------|-------|-----|-------|--------|--------|------||-------|----------||-----------|---------|---------|----------|----------||----------|---------|---------|----------|---------|---------|---------|---------|
#  PROC |  TYPE | GEN |   VEC |      N |      K |    R ||   SNR |      FRA || LD+ST+DEC |    CTHR |    ITHR |  LATENCY | RUNTIME  || BIG FREQ | BIG POW | BIG ENE | LIT FREQ | LIT POW | LIT ENE | RAM POW | RAM ENE |
#       |       |     |       |        |        |      ||  (dB) |          ||      (ms) |  (Mb/s) |  (Mb/s) |     (us) | (hhmmss) ||    (Mhz) |     (W) |     (J) |    (Mhz) |     (W) |     (J) |     (W) |     (J) |
# ------|-------|-----|-------|--------|--------|------||-------|----------||-----------|---------|---------|----------|----------||----------|---------|---------|----------|---------|---------|---------|---------|
    A57 |  char |  no |   seq |    128 |     64 | 0.50 ||  2.50 |  1332899 ||   8373.67 |   20.37 |   10.19 |     6.28 | 00h00'08 ||   800.00 |  0.4684 |    3.92 |   450.00 |  0.0135 |    0.11 |  0.0000 |    0.00
    A57 |  char |  no |   seq |    256 |    128 | 0.50 ||  2.50 |  1048729 ||  13616.11 |   19.72 |    9.86 |    12.98 | 00h00'13 ||   800.00 |  0.4412 |    6.01 |   450.00 |  0.0134 |    0.18 |  0.0000 |    0.00
    A57 |  char |  no |   seq |    512 |    256 | 0.50 ||  2.50 |   699036 ||  20310.38 |   17.62 |    8.81 |    29.05 | 00h00'20 ||   800.00 |  0.4349 |    8.83 |   450.00 |  0.0135 |    0.27 |  0.0000 |    0.00
    A57 |  char |  no |   seq |   1024 |    512 | 0.50 ||  2.50 |   399077 ||  26042.45 |   15.69 |    7.85 |    65.26 | 00h00'26 ||   800.00 |  0.4310 |   11.22 |   450.00 |  0.0134 |    0.35 |  0.0000 |    0.00
    A57 |  char |  no |   seq |   2048 |   1024 | 0.50 ||  2.50 |   213346 ||  30368.17 |   14.39 |    7.19 |   142.34 | 00h00'30 ||   800.00 |  0.4303 |   13.07 |   450.00 |  0.0134 |    0.41 |  0.0000 |    0.00
    A57 |  char |  no |   seq |   4096 |   2048 | 0.50 ||  2.50 |   106522 ||  32373.57 |   13.48 |    6.74 |   303.91 | 00h00'32 ||   800.00 |  0.4324 |   14.00 |   450.00 |  0.0135 |    0.44 |  0.0000 |    0.00
    A57 |  char |  no |   seq |   8192 |   4096 | 0.50 ||  2.50 |    52362 ||  34019.30 |   12.61 |    6.30 |   649.69 | 00h00'34 ||   800.00 |  0.4463 |   15.18 |   450.00 |  0.0135 |    0.46 |  0.0000 |    0.00
    A57 |  char |  no |   seq |  16384 |   8192 | 0.50 ||  2.50 |    24703 ||  35124.58 |   11.52 |    5.76 |  1421.88 | 00h00'35 ||   800.00 |  0.4586 |   16.11 |   450.00 |  0.0135 |    0.47 |  0.0000 |    0.00
    A57 |  char |  no |   seq |  32768 |  16384 | 0.50 ||  2.50 |    11635 ||  35337.75 |   10.79 |    5.39 |  3037.19 | 00h00'35 ||   800.00 |  0.4569 |   16.15 |   450.00 |  0.0134 |    0.47 |  0.0000 |    0.00
    A57 |  char |  no |   seq |  65536 |  32768 | 0.50 ||  2.50 |     5560 ||  36266.09 |   10.05 |    5.02 |  6522.68 | 00h00'37 ||   800.00 |  0.4538 |   16.46 |   450.00 |  0.0134 |    0.49 |  0.0000 |    0.00
    A57 |  char |  no |   seq |   131072 |   65536 | 0.50 ||  2.50 |     2500 ||  35895.10 |    9.13 |    4.56 | 14358.04 | 00h00'37 ||   800.00 |  0.4554 |   16.35 |   450.00 |  0.0137 |    0.49 |  0.0000 |    0.00
    A57 |  char |  no |   seq |   262144 |  131072 | 0.50 ||  2.50 |     1250 ||  46463.08 |    7.05 |    3.53 | 37170.46 | 00h00'49 ||   800.00 |  0.4279 |   19.88 |   450.00 |  0.0137 |    0.63 |  0.0000 |    0.00
    A57 |  char |  no |   seq |   524288 |  262144 | 0.50 ||  2.50 |      625 ||  48197.08 |    6.80 |    3.40 | 77115.34 | 00h00'53 ||   800.00 |  0.4278 |   20.62 |   450.00 |  0.0138 |    0.66 |  0.0000 |    0.00
    A57 |  char |  no |   seq |  1048576 |  524288 | 0.50 ||  2.50 |      300 ||  50970.32 |    6.17 |    3.09 | 169901.06 | 00h01'01 ||   800.00 |  0.4273 |   21.78 |   450.00 |  0.0137 |    0.70 |  0.0000 |    0.00
#---------
#---------
# -> Seq 8-bit, rate 5/6, no gen:
# ------|-------|-----|-------|--------|--------|------||-------|----------||-----------|---------|---------|----------|----------||----------|---------|---------|----------|---------|---------|---------|---------|
#  PROC |  TYPE | GEN |   VEC |      N |      K |    R ||   SNR |      FRA || LD+ST+DEC |    CTHR |    ITHR |  LATENCY | RUNTIME  || BIG FREQ | BIG POW | BIG ENE | LIT FREQ | LIT POW | LIT ENE | RAM POW | RAM ENE |
#       |       |     |       |        |        |      ||  (dB) |          ||      (ms) |  (Mb/s) |  (Mb/s) |     (us) | (hhmmss) ||    (Mhz) |     (W) |     (J) |    (Mhz) |     (W) |     (J) |     (W) |     (J) |
# ------|-------|-----|-------|--------|--------|------||-------|----------||-----------|---------|---------|----------|----------||----------|---------|---------|----------|---------|---------|---------|---------|
    A57 |  char |  no |   seq |    128 |    107 | 0.83 ||  4.00 |  1453651 ||   6666.03 |   27.91 |   23.33 |     4.59 | 00h00'06 ||   800.00 |  0.4357 |    2.90 |   450.00 |  0.0143 |    0.10 |  0.0000 |    0.00
    A57 |  char |  no |   seq |    256 |    213 | 0.83 ||  4.00 |  1102321 ||  12909.63 |   21.86 |   18.19 |    11.71 | 00h00'12 ||   800.00 |  0.4388 |    5.66 |   450.00 |  0.0134 |    0.17 |  0.0000 |    0.00
    A57 |  char |  no |   seq |    512 |    427 | 0.83 ||  4.00 |   752754 ||  19347.51 |   19.92 |   16.61 |    25.70 | 00h00'19 ||   800.00 |  0.4314 |    8.35 |   450.00 |  0.0134 |    0.26 |  0.0000 |    0.00
    A57 |  char |  no |   seq |   1024 |    853 | 0.83 ||  4.00 |   457183 ||  24875.97 |   18.82 |   15.68 |    54.41 | 00h00'24 ||   800.00 |  0.4327 |   10.76 |   450.00 |  0.0134 |    0.33 |  0.0000 |    0.00
    A57 |  char |  no |   seq |   2048 |   1707 | 0.83 ||  4.00 |   238931 ||  29556.61 |   16.56 |   13.80 |   123.70 | 00h00'29 ||   800.00 |  0.4308 |   12.73 |   450.00 |  0.0134 |    0.40 |  0.0000 |    0.00
    A57 |  char |  no |   seq |   4096 |   3413 | 0.83 ||  4.00 |   118322 ||  32900.24 |   14.73 |   12.27 |   278.06 | 00h00'32 ||   800.00 |  0.4328 |   14.24 |   450.00 |  0.0134 |    0.44 |  0.0000 |    0.00
    A57 |  char |  no |   seq |   8192 |   6827 | 0.83 ||  4.00 |    57604 ||  33887.89 |   13.93 |   11.60 |   588.29 | 00h00'33 ||   800.00 |  0.4468 |   15.14 |   450.00 |  0.0133 |    0.45 |  0.0000 |    0.00
    A57 |  char |  no |   seq |  16384 |  13653 | 0.83 ||  4.00 |    27305 ||  34970.91 |   12.79 |   10.66 |  1280.75 | 00h00'35 ||   800.00 |  0.4490 |   15.70 |   450.00 |  0.0134 |    0.47 |  0.0000 |    0.00
    A57 |  char |  no |   seq |  32768 |  27307 | 0.83 ||  4.00 |    12609 ||  34796.40 |   11.87 |    9.90 |  2759.65 | 00h00'35 ||   800.00 |  0.4539 |   15.79 |   450.00 |  0.0135 |    0.47 |  0.0000 |    0.00
    A57 |  char |  no |   seq |  65536 |  54613 | 0.83 ||  4.00 |     5896 ||  35879.84 |   10.77 |    8.97 |  6085.45 | 00h00'36 ||   800.00 |  0.4518 |   16.21 |   450.00 |  0.0134 |    0.48 |  0.0000 |    0.00
    A57 |  char |  no |   seq |   131072 |  109227 | 0.83 ||  4.00 |     2500 ||  34624.86 |    9.46 |    7.89 | 13849.94 | 00h00'35 ||   800.00 |  0.4481 |   15.52 |   450.00 |  0.0136 |    0.47 |  0.0000 |    0.00
    A57 |  char |  no |   seq |   262144 |  218453 | 0.83 ||  4.00 |     1250 ||  44650.18 |    7.34 |    6.12 | 35720.14 | 00h00'46 ||   800.00 |  0.4235 |   18.91 |   450.00 |  0.0136 |    0.61 |  0.0000 |    0.00
    A57 |  char |  no |   seq |   524288 |  436907 | 0.83 ||  4.00 |      625 ||  46908.43 |    6.99 |    5.82 | 75053.48 | 00h00'51 ||   800.00 |  0.4292 |   20.13 |   450.00 |  0.0137 |    0.64 |  0.0000 |    0.00
    A57 |  char |  no |   seq |  1048576 |  873813 | 0.83 ||  4.00 |      300 ||  51668.90 |    6.09 |    5.07 | 172229.69 | 00h01'00 ||   800.00 |  0.4195 |   21.68 |   450.00 |  0.0138 |    0.71 |  0.0000 |    0.00
#---------
#---------
# -> Seq 8-bit, rate 1/2, gen:
# ------|-------|-----|-------|--------|--------|------||-------|----------||-----------|---------|---------|----------|----------||----------|---------|---------|----------|---------|---------|---------|---------|
#  PROC |  TYPE | GEN |   VEC |      N |      K |    R ||   SNR |      FRA || LD+ST+DEC |    CTHR |    ITHR |  LATENCY | RUNTIME  || BIG FREQ | BIG POW | BIG ENE | LIT FREQ | LIT POW | LIT ENE | RAM POW | RAM ENE |
#       |       |     |       |        |        |      ||  (dB) |          ||      (ms) |  (Mb/s) |  (Mb/s) |     (us) | (hhmmss) ||    (Mhz) |     (W) |     (J) |    (Mhz) |     (W) |     (J) |     (W) |     (J) |
# ------|-------|-----|-------|--------|--------|------||-------|----------||-----------|---------|---------|----------|----------||----------|---------|---------|----------|---------|---------|---------|---------|
    A57 |  char | yes |   seq |    128 |     64 | 0.50 ||  2.50 |  1372446 ||   6954.89 |   25.26 |   12.63 |     5.07 | 00h00'06 ||   800.00 |  0.4505 |    3.13 |   450.00 |  0.0143 |    0.10 |  0.0000 |    0.00
    A57 |  char | yes |   seq |    256 |    128 | 0.50 ||  2.50 |  1039196 ||  11534.44 |   23.06 |   11.53 |    11.10 | 00h00'11 ||   800.00 |  0.4450 |    5.13 |   450.00 |  0.0134 |    0.15 |  0.0000 |    0.00
    A57 |  char | yes |   seq |    512 |    256 | 0.50 ||  2.50 |   672044 ||  16269.29 |   21.15 |   10.57 |    24.21 | 00h00'16 ||   800.00 |  0.4486 |    7.30 |   450.00 |  0.0135 |    0.22 |  0.0000 |    0.00
    A57 |  char | yes |   seq |   1024 |    512 | 0.50 ||  2.50 |   367136 ||  20689.64 |   18.17 |    9.09 |    56.35 | 00h00'20 ||   800.00 |  0.4493 |    9.30 |   450.00 |  0.0134 |    0.28 |  0.0000 |    0.00
    A57 |  char | yes |   seq |   2048 |   1024 | 0.50 ||  2.50 |   185879 ||  22956.37 |   16.58 |    8.29 |   123.50 | 00h00'22 ||   800.00 |  0.4520 |   10.38 |   450.00 |  0.0136 |    0.31 |  0.0000 |    0.00
    A57 |  char | yes |   seq |   4096 |   2048 | 0.50 ||  2.50 |    92647 ||  25176.66 |   15.07 |    7.54 |   271.75 | 00h00'25 ||   800.00 |  0.4537 |   11.42 |   450.00 |  0.0134 |    0.34 |  0.0000 |    0.00
    A57 |  char | yes |   seq |   8192 |   4096 | 0.50 ||  2.50 |    44280 ||  26075.95 |   13.91 |    6.96 |   588.89 | 00h00'26 ||   800.00 |  0.4644 |   12.11 |   450.00 |  0.0134 |    0.35 |  0.0000 |    0.00
    A57 |  char | yes |   seq |  16384 |   8192 | 0.50 ||  2.50 |    20875 ||  26835.19 |   12.75 |    6.37 |  1285.52 | 00h00'26 ||   800.00 |  0.4715 |   12.65 |   450.00 |  0.0135 |    0.36 |  0.0000 |    0.00
    A57 |  char | yes |   seq |  32768 |  16384 | 0.50 ||  2.50 |     9828 ||  27418.46 |   11.75 |    5.87 |  2789.83 | 00h00'27 ||   800.00 |  0.4715 |   12.93 |   450.00 |  0.0134 |    0.37 |  0.0000 |    0.00
    A57 |  char | yes |   seq |  65536 |  32768 | 0.50 ||  2.50 |     4714 ||  27547.61 |   11.21 |    5.61 |  5843.79 | 00h00'27 ||   800.00 |  0.4761 |   13.12 |   450.00 |  0.0135 |    0.37 |  0.0000 |    0.00
    A57 |  char | yes |   seq |   131072 |   65536 | 0.50 ||  2.50 |     2500 ||  32034.12 |   10.23 |    5.11 | 12813.65 | 00h00'32 ||   800.00 |  0.4786 |   15.33 |   450.00 |  0.0136 |    0.43 |  0.0000 |    0.00
    A57 |  char | yes |   seq |   262144 |  131072 | 0.50 ||  2.50 |     1250 ||  42970.84 |    7.63 |    3.81 | 34376.67 | 00h00'43 ||   800.00 |  0.4444 |   19.10 |   450.00 |  0.0134 |    0.58 |  0.0000 |    0.00
    A57 |  char | yes |   seq |   524288 |  262144 | 0.50 ||  2.50 |      625 ||  41347.86 |    7.92 |    3.96 | 66156.59 | 00h00'41 ||   800.00 |  0.4564 |   18.87 |   450.00 |  0.0135 |    0.56 |  0.0000 |    0.00
    A57 |  char | yes |   seq |  1048576 |  524288 | 0.50 ||  2.50 |      300 ||  44251.51 |    7.11 |    3.55 | 147505.05 | 00h00'44 ||   800.00 |  0.4501 |   19.92 |   450.00 |  0.0136 |    0.60 |  0.0000 |    0.00
#---------
#---------
# -> Seq 8-bit, rate 5/6, gen:
# ------|-------|-----|-------|--------|--------|------||-------|----------||-----------|---------|---------|----------|----------||----------|---------|---------|----------|---------|---------|---------|---------|
#  PROC |  TYPE | GEN |   VEC |      N |      K |    R ||   SNR |      FRA || LD+ST+DEC |    CTHR |    ITHR |  LATENCY | RUNTIME  || BIG FREQ | BIG POW | BIG ENE | LIT FREQ | LIT POW | LIT ENE | RAM POW | RAM ENE |
#       |       |     |       |        |        |      ||  (dB) |          ||      (ms) |  (Mb/s) |  (Mb/s) |     (us) | (hhmmss) ||    (Mhz) |     (W) |     (J) |    (Mhz) |     (W) |     (J) |     (W) |     (J) |
# ------|-------|-----|-------|--------|--------|------||-------|----------||-----------|---------|---------|----------|----------||----------|---------|---------|----------|---------|---------|---------|---------|
    A57 |  char | yes |   seq |    128 |    107 | 0.83 ||  4.00 |  1468511 ||   5745.48 |   32.72 |   27.35 |     3.91 | 00h00'05 ||   800.00 |  0.4466 |    2.57 |   450.00 |  0.0146 |    0.08 |  0.0000 |    0.00
    A57 |  char | yes |   seq |    256 |    213 | 0.83 ||  4.00 |  1089749 ||  10948.90 |   25.48 |   21.20 |    10.05 | 00h00'10 ||   800.00 |  0.4497 |    4.92 |   450.00 |  0.0135 |    0.15 |  0.0000 |    0.00
    A57 |  char | yes |   seq |    512 |    427 | 0.83 ||  4.00 |   718502 ||  15704.30 |   23.42 |   19.54 |    21.86 | 00h00'15 ||   800.00 |  0.4511 |    7.08 |   450.00 |  0.0134 |    0.21 |  0.0000 |    0.00
    A57 |  char | yes |   seq |   1024 |    853 | 0.83 ||  4.00 |   417855 ||  19991.16 |   21.40 |   17.83 |    47.84 | 00h00'19 ||   800.00 |  0.4518 |    9.03 |   450.00 |  0.0134 |    0.27 |  0.0000 |    0.00
    A57 |  char | yes |   seq |   2048 |   1707 | 0.83 ||  4.00 |   210135 ||  22689.28 |   18.97 |   15.81 |   107.97 | 00h00'22 ||   800.00 |  0.4503 |   10.22 |   450.00 |  0.0134 |    0.30 |  0.0000 |    0.00
    A57 |  char | yes |   seq |   4096 |   3413 | 0.83 ||  4.00 |   101774 ||  25023.97 |   16.66 |   13.88 |   245.88 | 00h00'25 ||   800.00 |  0.4519 |   11.31 |   450.00 |  0.0136 |    0.34 |  0.0000 |    0.00
    A57 |  char | yes |   seq |   8192 |   6827 | 0.83 ||  4.00 |    48800 ||  26011.22 |   15.37 |   12.81 |   533.02 | 00h00'26 ||   800.00 |  0.4663 |   12.13 |   450.00 |  0.0135 |    0.35 |  0.0000 |    0.00
    A57 |  char | yes |   seq |  16384 |  13653 | 0.83 ||  4.00 |    22830 ||  26259.01 |   14.24 |   11.87 |  1150.20 | 00h00'26 ||   800.00 |  0.4689 |   12.31 |   450.00 |  0.0134 |    0.35 |  0.0000 |    0.00
    A57 |  char | yes |   seq |  32768 |  27307 | 0.83 ||  4.00 |    10570 ||  27093.24 |   12.78 |   10.65 |  2563.22 | 00h00'27 ||   800.00 |  0.4726 |   12.80 |   450.00 |  0.0135 |    0.37 |  0.0000 |    0.00
    A57 |  char | yes |   seq |  65536 |  54613 | 0.83 ||  4.00 |     4895 ||  27079.39 |   11.85 |    9.87 |  5532.05 | 00h00'27 ||   800.00 |  0.4812 |   13.03 |   450.00 |  0.0135 |    0.36 |  0.0000 |    0.00
    A57 |  char | yes |   seq |   131072 |  109227 | 0.83 ||  4.00 |     2500 ||  29448.45 |   11.13 |    9.27 | 11779.38 | 00h00'29 ||   800.00 |  0.4817 |   14.18 |   450.00 |  0.0135 |    0.40 |  0.0000 |    0.00
    A57 |  char | yes |   seq |   262144 |  218453 | 0.83 ||  4.00 |     1250 ||  35870.39 |    9.14 |    7.61 | 28696.31 | 00h00'36 ||   800.00 |  0.4590 |   16.47 |   450.00 |  0.0135 |    0.48 |  0.0000 |    0.00
    A57 |  char | yes |   seq |   524288 |  436907 | 0.83 ||  4.00 |      625 ||  47302.67 |    6.93 |    5.77 | 75684.27 | 00h00'47 ||   800.00 |  0.4351 |   20.58 |   450.00 |  0.0136 |    0.64 |  0.0000 |    0.00
    A57 |  char | yes |   seq |  1048576 |  873813 | 0.83 ||  4.00 |      300 ||  49868.99 |    6.31 |    5.26 | 166229.97 | 00h00'50 ||   800.00 |  0.4294 |   21.41 |   450.00 |  0.0136 |    0.68 |  0.0000 |    0.00
#---------
#---------
# -> Intra-SIMD 8-bit, rate 1/2, no gen:
# ------|-------|-----|-------|--------|--------|------||-------|----------||-----------|---------|---------|----------|----------||----------|---------|---------|----------|---------|---------|---------|---------|
#  PROC |  TYPE | GEN |   VEC |      N |      K |    R ||   SNR |      FRA || LD+ST+DEC |    CTHR |    ITHR |  LATENCY | RUNTIME  || BIG FREQ | BIG POW | BIG ENE | LIT FREQ | LIT POW | LIT ENE | RAM POW | RAM ENE |
#       |       |     |       |        |        |      ||  (dB) |          ||      (ms) |  (Mb/s) |  (Mb/s) |     (us) | (hhmmss) ||    (Mhz) |     (W) |     (J) |    (Mhz) |     (W) |     (J) |     (W) |     (J) |
# ------|-------|-----|-------|--------|--------|------||-------|----------||-----------|---------|---------|----------|----------||----------|---------|---------|----------|---------|---------|---------|---------|
    A57 |  char |  no | intra |    128 |     64 | 0.50 ||  2.50 |  1628908 ||   4637.26 |   44.96 |   22.48 |     2.85 | 00h00'04 ||   800.00 |  0.4902 |    2.27 |   450.00 |  0.0146 |    0.07 |  0.0000 |    0.00
    A57 |  char |  no | intra |    256 |    128 | 0.50 ||  2.50 |  1482148 ||   7229.82 |   52.48 |   26.24 |     4.88 | 00h00'07 ||   800.00 |  0.4804 |    3.47 |   450.00 |  0.0140 |    0.10 |  0.0000 |    0.00
    A57 |  char |  no | intra |    512 |    256 | 0.50 ||  2.50 |  1287237 ||  11861.46 |   55.56 |   27.78 |     9.21 | 00h00'11 ||   800.00 |  0.4817 |    5.71 |   450.00 |  0.0134 |    0.16 |  0.0000 |    0.00
    A57 |  char |  no | intra |   1024 |    512 | 0.50 ||  2.50 |   979960 ||  18324.19 |   54.76 |   27.38 |    18.70 | 00h00'18 ||   800.00 |  0.4805 |    8.80 |   450.00 |  0.0135 |    0.25 |  0.0000 |    0.00
    A57 |  char |  no | intra |   2048 |   1024 | 0.50 ||  2.50 |   657025 ||  23979.39 |   56.11 |   28.06 |    36.50 | 00h00'24 ||   800.00 |  0.4855 |   11.64 |   450.00 |  0.0134 |    0.32 |  0.0000 |    0.00
    A57 |  char |  no | intra |   4096 |   2048 | 0.50 ||  2.50 |   419152 ||  30317.54 |   56.63 |   28.31 |    72.33 | 00h00'30 ||   800.00 |  0.5011 |   15.19 |   450.00 |  0.0136 |    0.41 |  0.0000 |    0.00
    A57 |  char |  no | intra |   8192 |   4096 | 0.50 ||  2.50 |   234743 ||  34232.57 |   56.17 |   28.09 |   145.83 | 00h00'34 ||   800.00 |  0.5092 |   17.43 |   450.00 |  0.0135 |    0.46 |  0.0000 |    0.00
    A57 |  char |  no | intra |  16384 |   8192 | 0.50 ||  2.50 |   121493 ||  36292.24 |   54.85 |   27.42 |   298.72 | 00h00'36 ||   800.00 |  0.5249 |   19.05 |   450.00 |  0.0135 |    0.49 |  0.0000 |    0.00
    A57 |  char |  no | intra |  32768 |  16384 | 0.50 ||  2.50 |    61018 ||  37526.88 |   53.28 |   26.64 |   615.01 | 00h00'37 ||   800.00 |  0.5335 |   20.02 |   450.00 |  0.0135 |    0.50 |  0.0000 |    0.00
    A57 |  char |  no | intra |  65536 |  32768 | 0.50 ||  2.50 |    29966 ||  37160.14 |   52.85 |   26.42 |  1240.08 | 00h00'37 ||   800.00 |  0.5444 |   20.23 |   450.00 |  0.0135 |    0.50 |  0.0000 |    0.00
    A57 |  char |  no | intra |   131072 |   65536 | 0.50 ||  2.50 |    15000 ||  38877.88 |   50.57 |   25.29 |  2591.86 | 00h00'40 ||   800.00 |  0.5460 |   21.23 |   450.00 |  0.0136 |    0.53 |  0.0000 |    0.00
    A57 |  char |  no | intra |   262144 |  131072 | 0.50 ||  2.50 |     7000 ||  39348.37 |   46.63 |   23.32 |  5621.20 | 00h00'42 ||   800.00 |  0.5383 |   21.18 |   450.00 |  0.0137 |    0.54 |  0.0000 |    0.00
    A57 |  char |  no | intra |   524288 |  262144 | 0.50 ||  2.50 |     3500 ||  41157.11 |   44.59 |   22.29 | 11759.17 | 00h00'46 ||   800.00 |  0.5401 |   22.23 |   450.00 |  0.0139 |    0.57 |  0.0000 |    0.00
    A57 |  char |  no | intra |  1048576 |  524288 | 0.50 ||  2.50 |     1750 ||  45023.29 |   40.76 |   20.38 | 25727.59 | 00h00'55 ||   800.00 |  0.5378 |   24.22 |   450.00 |  0.0141 |    0.63 |  0.0000 |    0.00
#---------
#---------
# -> Intra-SIMD 8-bit, rate 5/6, no gen:
# ------|-------|-----|-------|--------|--------|------||-------|----------||-----------|---------|---------|----------|----------||----------|---------|---------|----------|---------|---------|---------|---------|
#  PROC |  TYPE | GEN |   VEC |      N |      K |    R ||   SNR |      FRA || LD+ST+DEC |    CTHR |    ITHR |  LATENCY | RUNTIME  || BIG FREQ | BIG POW | BIG ENE | LIT FREQ | LIT POW | LIT ENE | RAM POW | RAM ENE |
#       |       |     |       |        |        |      ||  (dB) |          ||      (ms) |  (Mb/s) |  (Mb/s) |     (us) | (hhmmss) ||    (Mhz) |     (W) |     (J) |    (Mhz) |     (W) |     (J) |     (W) |     (J) |
# ------|-------|-----|-------|--------|--------|------||-------|----------||-----------|---------|---------|----------|----------||----------|---------|---------|----------|---------|---------|---------|---------|
    A57 |  char |  no | intra |    128 |    107 | 0.83 ||  4.00 |  1739009 ||   3052.31 |   72.93 |   60.96 |     1.76 | 00h00'03 ||   800.00 |  0.4844 |    1.48 |   450.00 |  0.0148 |    0.05 |  0.0000 |    0.00
    A57 |  char |  no | intra |    256 |    213 | 0.83 ||  4.00 |  1549709 ||   6139.90 |   64.61 |   53.76 |     3.96 | 00h00'06 ||   800.00 |  0.4810 |    2.95 |   450.00 |  0.0137 |    0.08 |  0.0000 |    0.00
    A57 |  char |  no | intra |    512 |    427 | 0.83 ||  4.00 |  1373013 ||  10208.13 |   68.87 |   57.43 |     7.43 | 00h00'10 ||   800.00 |  0.4833 |    4.93 |   450.00 |  0.0134 |    0.14 |  0.0000 |    0.00
    A57 |  char |  no | intra |   1024 |    853 | 0.83 ||  4.00 |  1137199 ||  15954.42 |   72.99 |   60.80 |    14.03 | 00h00'15 ||   800.00 |  0.5114 |    8.16 |   450.00 |  0.0135 |    0.22 |  0.0000 |    0.00
    A57 |  char |  no | intra |   2048 |   1707 | 0.83 ||  4.00 |   788585 ||  22757.18 |   70.97 |   59.15 |    28.86 | 00h00'22 ||   800.00 |  0.4823 |   10.98 |   450.00 |  0.0135 |    0.31 |  0.0000 |    0.00
    A57 |  char |  no | intra |   4096 |   3413 | 0.83 ||  4.00 |   503777 ||  29930.05 |   68.94 |   57.45 |    59.41 | 00h00'29 ||   800.00 |  0.4974 |   14.89 |   450.00 |  0.0136 |    0.41 |  0.0000 |    0.00
    A57 |  char |  no | intra |   8192 |   6827 | 0.83 ||  4.00 |   290048 ||  34569.68 |   68.73 |   57.28 |   119.19 | 00h00'34 ||   800.00 |  0.5136 |   17.76 |   450.00 |  0.0136 |    0.47 |  0.0000 |    0.00
    A57 |  char |  no | intra |  16384 |  13653 | 0.83 ||  4.00 |   146841 ||  35842.07 |   67.12 |   55.93 |   244.09 | 00h00'36 ||   800.00 |  0.5284 |   18.94 |   450.00 |  0.0137 |    0.49 |  0.0000 |    0.00
    A57 |  char |  no | intra |  32768 |  27307 | 0.83 ||  4.00 |    73239 ||  37732.93 |   63.60 |   53.00 |   515.20 | 00h00'38 ||   800.00 |  0.5400 |   20.38 |   450.00 |  0.0135 |    0.51 |  0.0000 |    0.00
    A57 |  char |  no | intra |  65536 |  54613 | 0.83 ||  4.00 |    35138 ||  38158.58 |   60.35 |   50.29 |  1085.96 | 00h00'38 ||   800.00 |  0.5408 |   20.64 |   450.00 |  0.0135 |    0.52 |  0.0000 |    0.00
    A57 |  char |  no | intra |   131072 |  109227 | 0.83 ||  4.00 |    15000 ||  33395.41 |   58.87 |   49.06 |  2226.36 | 00h00'34 ||   800.00 |  0.5516 |   18.42 |   450.00 |  0.0137 |    0.46 |  0.0000 |    0.00
    A57 |  char |  no | intra |   262144 |  218453 | 0.83 ||  4.00 |     7500 ||  36764.40 |   53.48 |   44.56 |  4901.92 | 00h00'38 ||   800.00 |  0.5456 |   20.06 |   450.00 |  0.0138 |    0.51 |  0.0000 |    0.00
    A57 |  char |  no | intra |   524288 |  436907 | 0.83 ||  4.00 |     3500 ||  37690.46 |   48.69 |   40.57 | 10768.70 | 00h00'41 ||   800.00 |  0.5442 |   20.51 |   450.00 |  0.0139 |    0.52 |  0.0000 |    0.00
    A57 |  char |  no | intra |  1048576 |  873813 | 0.83 ||  4.00 |     1750 ||  41029.62 |   44.72 |   37.27 | 23445.50 | 00h00'49 ||   800.00 |  0.5391 |   22.12 |   450.00 |  0.0141 |    0.58 |  0.0000 |    0.00
#---------
#---------
# -> Intra-SIMD 8-bit, rate 1/2, gen:
# ------|-------|-----|-------|--------|--------|------||-------|----------||-----------|---------|---------|----------|----------||----------|---------|---------|----------|---------|---------|---------|---------|
#  PROC |  TYPE | GEN |   VEC |      N |      K |    R ||   SNR |      FRA || LD+ST+DEC |    CTHR |    ITHR |  LATENCY | RUNTIME  || BIG FREQ | BIG POW | BIG ENE | LIT FREQ | LIT POW | LIT ENE | RAM POW | RAM ENE |
#       |       |     |       |        |        |      ||  (dB) |          ||      (ms) |  (Mb/s) |  (Mb/s) |     (us) | (hhmmss) ||    (Mhz) |     (W) |     (J) |    (Mhz) |     (W) |     (J) |     (W) |     (J) |
# ------|-------|-----|-------|--------|--------|------||-------|----------||-----------|---------|---------|----------|----------||----------|---------|---------|----------|---------|---------|---------|---------|
    A57 |  char | yes | intra |    128 |     64 | 0.50 ||  2.50 |  1698069 ||   3859.91 |   56.31 |   28.16 |     2.27 | 00h00'03 ||   800.00 |  0.4133 |    1.60 |   450.00 |  0.0149 |    0.06 |  0.0000 |    0.00
    A57 |  char | yes | intra |    256 |    128 | 0.50 ||  2.50 |  1572445 ||   6344.16 |   63.45 |   31.73 |     4.03 | 00h00'06 ||   800.00 |  0.4190 |    2.66 |   450.00 |  0.0136 |    0.09 |  0.0000 |    0.00
    A57 |  char | yes | intra |    512 |    256 | 0.50 ||  2.50 |  1381377 ||  10181.13 |   69.47 |   34.73 |     7.37 | 00h00'10 ||   800.00 |  0.4299 |    4.38 |   450.00 |  0.0136 |    0.14 |  0.0000 |    0.00
    A57 |  char | yes | intra |   1024 |    512 | 0.50 ||  2.50 |  1074590 ||  16483.23 |   66.76 |   33.38 |    15.34 | 00h00'16 ||   800.00 |  0.4407 |    7.26 |   450.00 |  0.0135 |    0.22 |  0.0000 |    0.00
    A57 |  char | yes | intra |   2048 |   1024 | 0.50 ||  2.50 |   769737 ||  23049.88 |   68.39 |   34.20 |    29.95 | 00h00'23 ||   800.00 |  0.4450 |   10.26 |   450.00 |  0.0135 |    0.31 |  0.0000 |    0.00
    A57 |  char | yes | intra |   4096 |   2048 | 0.50 ||  2.50 |   489617 ||  29757.42 |   67.39 |   33.70 |    60.78 | 00h00'29 ||   800.00 |  0.4623 |   13.76 |   450.00 |  0.0136 |    0.40 |  0.0000 |    0.00
    A57 |  char | yes | intra |   8192 |   4096 | 0.50 ||  2.50 |   275797 ||  35042.93 |   64.47 |   32.24 |   127.06 | 00h00'35 ||   800.00 |  0.4943 |   17.32 |   450.00 |  0.0135 |    0.47 |  0.0000 |    0.00
    A57 |  char | yes | intra |  16384 |   8192 | 0.50 ||  2.50 |   142854 ||  37972.27 |   61.64 |   30.82 |   265.81 | 00h00'37 ||   800.00 |  0.5039 |   19.13 |   450.00 |  0.0135 |    0.51 |  0.0000 |    0.00
    A57 |  char | yes | intra |  32768 |  16384 | 0.50 ||  2.50 |    68860 ||  38349.05 |   58.84 |   29.42 |   556.91 | 00h00'38 ||   800.00 |  0.5157 |   19.78 |   450.00 |  0.0135 |    0.52 |  0.0000 |    0.00
    A57 |  char | yes | intra |  65536 |  32768 | 0.50 ||  2.50 |    34752 ||  39754.45 |   57.29 |   28.64 |  1143.95 | 00h00'39 ||   800.00 |  0.5251 |   20.88 |   450.00 |  0.0134 |    0.53 |  0.0000 |    0.00
    A57 |  char | yes | intra |   131072 |   65536 | 0.50 ||  2.50 |    15000 ||  36219.35 |   54.28 |   27.14 |  2414.62 | 00h00'36 ||   800.00 |  0.5269 |   19.08 |   450.00 |  0.0136 |    0.49 |  0.0000 |    0.00
    A57 |  char | yes | intra |   262144 |  131072 | 0.50 ||  2.50 |     7000 ||  36624.46 |   50.10 |   25.05 |  5232.07 | 00h00'36 ||   800.00 |  0.5274 |   19.32 |   450.00 |  0.0136 |    0.50 |  0.0000 |    0.00
    A57 |  char | yes | intra |   524288 |  262144 | 0.50 ||  2.50 |     3500 ||  39744.90 |   46.17 |   23.08 | 11355.69 | 00h00'39 ||   800.00 |  0.5187 |   20.62 |   450.00 |  0.0138 |    0.55 |  0.0000 |    0.00
    A57 |  char | yes | intra |  1048576 |  524288 | 0.50 ||  2.50 |     1750 ||  41421.06 |   44.30 |   22.15 | 23669.18 | 00h00'41 ||   800.00 |  0.5270 |   21.83 |   450.00 |  0.0139 |    0.58 |  0.0000 |    0.00
#---------
#---------
# -> Intra-SIMD 8-bit, rate 5/6, gen:
# ------|-------|-----|-------|--------|--------|------||-------|----------||-----------|---------|---------|----------|----------||----------|---------|---------|----------|---------|---------|---------|---------|
#  PROC |  TYPE | GEN |   VEC |      N |      K |    R ||   SNR |      FRA || LD+ST+DEC |    CTHR |    ITHR |  LATENCY | RUNTIME  || BIG FREQ | BIG POW | BIG ENE | LIT FREQ | LIT POW | LIT ENE | RAM POW | RAM ENE |
#       |       |     |       |        |        |      ||  (dB) |          ||      (ms) |  (Mb/s) |  (Mb/s) |     (us) | (hhmmss) ||    (Mhz) |     (W) |     (J) |    (Mhz) |     (W) |     (J) |     (W) |     (J) |
# ------|-------|-----|-------|--------|--------|------||-------|----------||-----------|---------|---------|----------|----------||----------|---------|---------|----------|---------|---------|---------|---------|
    A57 |  char | yes | intra |    128 |    107 | 0.83 ||  4.00 |  1765946 ||   2644.70 |   85.47 |   71.45 |     1.50 | 00h00'02 ||   800.00 |  0.4205 |    1.11 |   450.00 |  0.0159 |    0.04 |  0.0000 |    0.00
    A57 |  char | yes | intra |    256 |    213 | 0.83 ||  4.00 |  1622879 ||   5216.00 |   79.65 |   66.27 |     3.21 | 00h00'05 ||   800.00 |  0.4307 |    2.25 |   450.00 |  0.0135 |    0.07 |  0.0000 |    0.00
    A57 |  char | yes | intra |    512 |    427 | 0.83 ||  4.00 |  1446105 ||   8616.69 |   85.93 |   71.66 |     5.96 | 00h00'08 ||   800.00 |  0.4423 |    3.81 |   450.00 |  0.0134 |    0.12 |  0.0000 |    0.00
    A57 |  char | yes | intra |   1024 |    853 | 0.83 ||  4.00 |  1198370 ||  14029.52 |   87.47 |   72.86 |    11.71 | 00h00'14 ||   800.00 |  0.4471 |    6.27 |   450.00 |  0.0134 |    0.19 |  0.0000 |    0.00
    A57 |  char | yes | intra |   2048 |   1707 | 0.83 ||  4.00 |   890666 ||  21677.23 |   84.15 |   70.14 |    24.34 | 00h00'21 ||   800.00 |  0.4702 |   10.19 |   450.00 |  0.0135 |    0.29 |  0.0000 |    0.00
    A57 |  char | yes | intra |   4096 |   3413 | 0.83 ||  4.00 |   561429 ||  28541.75 |   80.57 |   67.14 |    50.84 | 00h00'28 ||   800.00 |  0.4638 |   13.24 |   450.00 |  0.0136 |    0.39 |  0.0000 |    0.00
    A57 |  char | yes | intra |   8192 |   6827 | 0.83 ||  4.00 |   321341 ||  33598.75 |   78.35 |   65.29 |   104.56 | 00h00'33 ||   800.00 |  0.4952 |   16.64 |   450.00 |  0.0134 |    0.45 |  0.0000 |    0.00
    A57 |  char | yes | intra |  16384 |  13653 | 0.83 ||  4.00 |   170937 ||  37841.83 |   74.01 |   61.67 |   221.38 | 00h00'37 ||   800.00 |  0.5148 |   19.48 |   450.00 |  0.0134 |    0.51 |  0.0000 |    0.00
    A57 |  char | yes | intra |  32768 |  27307 | 0.83 ||  4.00 |    79535 ||  37380.42 |   69.72 |   58.10 |   469.99 | 00h00'37 ||   800.00 |  0.5203 |   19.45 |   450.00 |  0.0135 |    0.50 |  0.0000 |    0.00
    A57 |  char | yes | intra |  65536 |  54613 | 0.83 ||  4.00 |    39967 ||  39951.16 |   65.56 |   54.63 |   999.60 | 00h00'39 ||   800.00 |  0.5318 |   21.25 |   450.00 |  0.0135 |    0.54 |  0.0000 |    0.00
    A57 |  char | yes | intra |   131072 |  109227 | 0.83 ||  4.00 |    15000 ||  31268.90 |   62.88 |   52.40 |  2084.59 | 00h00'31 ||   800.00 |  0.5390 |   16.86 |   450.00 |  0.0136 |    0.42 |  0.0000 |    0.00
    A57 |  char | yes | intra |   262144 |  218453 | 0.83 ||  4.00 |     7500 ||  34853.86 |   56.41 |   47.01 |  4647.18 | 00h00'34 ||   800.00 |  0.5317 |   18.53 |   450.00 |  0.0136 |    0.47 |  0.0000 |    0.00
    A57 |  char | yes | intra |   524288 |  436907 | 0.83 ||  4.00 |     3500 ||  36392.09 |   50.42 |   42.02 | 10397.74 | 00h00'36 ||   800.00 |  0.5255 |   19.12 |   450.00 |  0.0138 |    0.50 |  0.0000 |    0.00
    A57 |  char | yes | intra |  1048576 |  873813 | 0.83 ||  4.00 |     1750 ||  38306.30 |   47.90 |   39.92 | 21889.31 | 00h00'38 ||   800.00 |  0.5336 |   20.44 |   450.00 |  0.0139 |    0.53 |  0.0000 |    0.00
#---------
#---------
# -> Inter-SIMD 8-bit, rate 1/2, no gen:
# ------|-------|-----|-------|--------|--------|------||-------|----------||-----------|---------|---------|----------|----------||----------|---------|---------|----------|---------|---------|---------|---------|
#  PROC |  TYPE | GEN |   VEC |      N |      K |    R ||   SNR |      FRA || LD+ST+DEC |    CTHR |    ITHR |  LATENCY | RUNTIME  || BIG FREQ | BIG POW | BIG ENE | LIT FREQ | LIT POW | LIT ENE | RAM POW | RAM ENE |
#       |       |     |       |        |        |      ||  (dB) |          ||      (ms) |  (Mb/s) |  (Mb/s) |     (us) | (hhmmss) ||    (Mhz) |     (W) |     (J) |    (Mhz) |     (W) |     (J) |     (W) |     (J) |
# ------|-------|-----|-------|--------|--------|------||-------|----------||-----------|---------|---------|----------|----------||----------|---------|---------|----------|---------|---------|---------|---------|
    A57 |  char |  no | inter |    128 |     64 | 0.50 ||  2.50 | 18706160 ||  16295.65 |  146.93 |   73.47 |    13.94 | 00h00'16 ||   800.00 |  0.5251 |    8.56 |   450.00 |  0.0138 |    0.23 |  0.0000 |    0.00
    A57 |  char |  no | inter |    256 |    128 | 0.50 ||  2.50 | 13180784 ||  23347.25 |  144.53 |   72.26 |    28.34 | 00h00'23 ||   800.00 |  0.5117 |   11.95 |   450.00 |  0.0136 |    0.32 |  0.0000 |    0.00
    A57 |  char |  no | inter |    512 |    256 | 0.50 ||  2.50 |  8149008 ||  31422.36 |  132.78 |   66.39 |    61.70 | 00h00'31 ||   800.00 |  0.5255 |   16.51 |   450.00 |  0.0134 |    0.42 |  0.0000 |    0.00
    A57 |  char |  no | inter |   1024 |    512 | 0.50 ||  2.50 |  3781824 ||  33570.30 |  115.36 |   57.68 |   142.03 | 00h00'33 ||   800.00 |  0.5348 |   17.95 |   450.00 |  0.0135 |    0.45 |  0.0000 |    0.00
    A57 |  char |  no | inter |   2048 |   1024 | 0.50 ||  2.50 |  1895728 ||  37493.69 |  103.55 |   51.77 |   316.45 | 00h00'37 ||   800.00 |  0.5437 |   20.39 |   450.00 |  0.0135 |    0.51 |  0.0000 |    0.00
    A57 |  char |  no | inter |   4096 |   2048 | 0.50 ||  2.50 |   885920 ||  38728.95 |   93.70 |   46.85 |   699.46 | 00h00'38 ||   800.00 |  0.5426 |   21.01 |   450.00 |  0.0136 |    0.53 |  0.0000 |    0.00
    A57 |  char |  no | inter |   8192 |   4096 | 0.50 ||  2.50 |   421488 ||  39019.53 |   88.49 |   44.24 |  1481.21 | 00h00'39 ||   800.00 |  0.5528 |   21.57 |   450.00 |  0.0136 |    0.53 |  0.0000 |    0.00
    A57 |  char |  no | inter |  16384 |   8192 | 0.50 ||  2.50 |   188736 ||  38284.89 |   80.77 |   40.38 |  3245.58 | 00h00'38 ||   800.00 |  0.5471 |   20.94 |   450.00 |  0.0135 |    0.52 |  0.0000 |    0.00
    A57 |  char |  no | inter |  32768 |  16384 | 0.50 ||  2.50 |    82496 ||  36884.47 |   73.29 |   36.64 |  7153.70 | 00h00'37 ||   800.00 |  0.5454 |   20.12 |   450.00 |  0.0135 |    0.50 |  0.0000 |    0.00
    A57 |  char |  no | inter |  65536 |  32768 | 0.50 ||  2.50 |    30624 ||  31514.50 |   63.68 |   31.84 | 16465.26 | 00h00'32 ||   800.00 |  0.5242 |   16.52 |   450.00 |  0.0139 |    0.44 |  0.0000 |    0.00
    A57 |  char |  no | inter |   131072 |   65536 | 0.50 ||  2.50 |    15000 ||  34463.49 |   57.05 |   28.52 | 36761.05 | 00h00'36 ||   800.00 |  0.5140 |   17.72 |   450.00 |  0.0140 |    0.48 |  0.0000 |    0.00
    A57 |  char |  no | inter |   262144 |  131072 | 0.50 ||  2.50 |     7000 ||  33844.36 |   54.22 |   27.11 | 77358.54 | 00h00'38 ||   800.00 |  0.5242 |   17.74 |   450.00 |  0.0142 |    0.48 |  0.0000 |    0.00
    A57 |  char |  no | inter |   524288 |  262144 | 0.50 ||  2.50 |     3500 ||  35224.55 |   52.09 |   26.05 | 161026.52 | 00h00'44 ||   800.00 |  0.5302 |   18.68 |   450.00 |  0.0144 |    0.51 |  0.0000 |    0.00
    A57 |  char |  no | inter |  1048576 |  524288 | 0.50 ||  2.50 |     1750 ||  38616.10 |   47.52 |   23.76 | 353061.44 | 00h00'55 ||   800.00 |  0.5263 |   20.32 |   450.00 |  0.0145 |    0.56 |  0.0000 |    0.00
#---------
#---------
# -> Inter-SIMD 8-bit, rate 5/6, no gen:
# ------|-------|-----|-------|--------|--------|------||-------|----------||-----------|---------|---------|----------|----------||----------|---------|---------|----------|---------|---------|---------|---------|
#  PROC |  TYPE | GEN |   VEC |      N |      K |    R ||   SNR |      FRA || LD+ST+DEC |    CTHR |    ITHR |  LATENCY | RUNTIME  || BIG FREQ | BIG POW | BIG ENE | LIT FREQ | LIT POW | LIT ENE | RAM POW | RAM ENE |
#       |       |     |       |        |        |      ||  (dB) |          ||      (ms) |  (Mb/s) |  (Mb/s) |     (us) | (hhmmss) ||    (Mhz) |     (W) |     (J) |    (Mhz) |     (W) |     (J) |     (W) |     (J) |
# ------|-------|-----|-------|--------|--------|------||-------|----------||-----------|---------|---------|----------|----------||----------|---------|---------|----------|---------|---------|---------|---------|
    A57 |  char |  no | inter |    128 |    107 | 0.83 ||  4.00 | 20592832 ||  12735.34 |  206.97 |  173.02 |     9.89 | 00h00'12 ||   800.00 |  0.5019 |    6.39 |   450.00 |  0.0140 |    0.18 |  0.0000 |    0.00
    A57 |  char |  no | inter |    256 |    213 | 0.83 ||  4.00 | 14286336 ||  22900.71 |  159.70 |  132.88 |    25.65 | 00h00'22 ||   800.00 |  0.5114 |   11.71 |   450.00 |  0.0135 |    0.31 |  0.0000 |    0.00
    A57 |  char |  no | inter |    512 |    427 | 0.83 ||  4.00 |  7631728 ||  27327.43 |  142.99 |  119.25 |    57.29 | 00h00'27 ||   800.00 |  0.5325 |   14.55 |   450.00 |  0.0135 |    0.37 |  0.0000 |    0.00
    A57 |  char |  no | inter |   1024 |    853 | 0.83 ||  4.00 |  4583760 ||  34378.03 |  136.53 |  113.73 |   120.00 | 00h00'34 ||   800.00 |  0.5376 |   18.48 |   450.00 |  0.0135 |    0.46 |  0.0000 |    0.00
    A57 |  char |  no | inter |   2048 |   1707 | 0.83 ||  4.00 |  2104272 ||  36281.30 |  118.78 |   99.00 |   275.87 | 00h00'36 ||   800.00 |  0.5491 |   19.92 |   450.00 |  0.0135 |    0.49 |  0.0000 |    0.00
    A57 |  char |  no | inter |   4096 |   3413 | 0.83 ||  4.00 |   961296 ||  38374.53 |  102.61 |   85.50 |   638.71 | 00h00'38 ||   800.00 |  0.5491 |   21.07 |   450.00 |  0.0135 |    0.52 |  0.0000 |    0.00
    A57 |  char |  no | inter |   8192 |   6827 | 0.83 ||  4.00 |   455600 ||  39495.30 |   94.50 |   78.75 |  1387.02 | 00h00'39 ||   800.00 |  0.5525 |   21.82 |   450.00 |  0.0135 |    0.53 |  0.0000 |    0.00
    A57 |  char |  no | inter |  16384 |  13653 | 0.83 ||  4.00 |   207968 ||  38339.57 |   88.87 |   74.06 |  2949.65 | 00h00'38 ||   800.00 |  0.5555 |   21.30 |   450.00 |  0.0135 |    0.52 |  0.0000 |    0.00
    A57 |  char |  no | inter |  32768 |  27307 | 0.83 ||  4.00 |    86624 ||  35607.94 |   79.72 |   66.43 |  6577.01 | 00h00'36 ||   800.00 |  0.5474 |   19.49 |   450.00 |  0.0137 |    0.49 |  0.0000 |    0.00
    A57 |  char |  no | inter |  65536 |  54613 | 0.83 ||  4.00 |    31392 ||  30878.92 |   66.62 |   55.52 | 15738.49 | 00h00'31 ||   800.00 |  0.5280 |   16.30 |   450.00 |  0.0140 |    0.43 |  0.0000 |    0.00
    A57 |  char |  no | inter |   131072 |  109227 | 0.83 ||  4.00 |    15000 ||  33049.87 |   59.49 |   49.57 | 35253.20 | 00h00'35 ||   800.00 |  0.5121 |   16.92 |   450.00 |  0.0142 |    0.47 |  0.0000 |    0.00
    A57 |  char |  no | inter |   262144 |  218453 | 0.83 ||  4.00 |     7500 ||  35549.18 |   55.31 |   46.09 | 75838.25 | 00h00'39 ||   800.00 |  0.5125 |   18.22 |   450.00 |  0.0143 |    0.51 |  0.0000 |    0.00
    A57 |  char |  no | inter |   524288 |  436907 | 0.83 ||  4.00 |     3500 ||  33358.46 |   55.01 |   45.84 | 152495.81 | 00h00'41 ||   800.00 |  0.5385 |   17.97 |   450.00 |  0.0145 |    0.48 |  0.0000 |    0.00
    A57 |  char |  no | inter |  1048576 |  873813 | 0.83 ||  4.00 |     1750 ||  34650.60 |   52.96 |   44.13 | 316805.50 | 00h00'50 ||   800.00 |  0.5453 |   18.89 |   450.00 |  0.0145 |    0.50 |  0.0000 |    0.00
#---------
#---------
# -> inter-SIMD 8-bit, rate 1/2, gen:
# ------|-------|-----|-------|--------|--------|------||-------|----------||-----------|---------|---------|----------|----------||----------|---------|---------|----------|---------|---------|---------|---------|
#  PROC |  TYPE | GEN |   VEC |      N |      K |    R ||   SNR |      FRA || LD+ST+DEC |    CTHR |    ITHR |  LATENCY | RUNTIME  || BIG FREQ | BIG POW | BIG ENE | LIT FREQ | LIT POW | LIT ENE | RAM POW | RAM ENE |
#       |       |     |       |        |        |      ||  (dB) |          ||      (ms) |  (Mb/s) |  (Mb/s) |     (us) | (hhmmss) ||    (Mhz) |     (W) |     (J) |    (Mhz) |     (W) |     (J) |     (W) |     (J) |
# ------|-------|-----|-------|--------|--------|------||-------|----------||-----------|---------|---------|----------|----------||----------|---------|---------|----------|---------|---------|---------|---------|
    A57 |  char | yes | inter |    128 |     64 | 0.50 ||  2.50 | 19644080 ||  15535.87 |  161.85 |   80.92 |    12.65 | 00h00'15 ||   800.00 |  0.4908 |    7.62 |   450.00 |  0.0138 |    0.22 |  0.0000 |    0.00
    A57 |  char | yes | inter |    256 |    128 | 0.50 ||  2.50 | 14383232 ||  23795.60 |  154.74 |   77.37 |    26.47 | 00h00'23 ||   800.00 |  0.4946 |   11.77 |   450.00 |  0.0135 |    0.32 |  0.0000 |    0.00
    A57 |  char | yes | inter |    512 |    256 | 0.50 ||  2.50 |  9026992 ||  32585.28 |  141.84 |   70.92 |    57.76 | 00h00'32 ||   800.00 |  0.5212 |   16.98 |   450.00 |  0.0136 |    0.44 |  0.0000 |    0.00
    A57 |  char | yes | inter |   1024 |    512 | 0.50 ||  2.50 |  4512336 ||  38117.50 |  121.22 |   60.61 |   135.16 | 00h00'38 ||   800.00 |  0.5298 |   20.19 |   450.00 |  0.0136 |    0.52 |  0.0000 |    0.00
    A57 |  char | yes | inter |   2048 |   1024 | 0.50 ||  2.50 |  2072400 ||  38382.54 |  110.58 |   55.29 |   296.33 | 00h00'38 ||   800.00 |  0.5379 |   20.65 |   450.00 |  0.0136 |    0.52 |  0.0000 |    0.00
    A57 |  char | yes | inter |   4096 |   2048 | 0.50 ||  2.50 |   963264 ||  40803.41 |   96.70 |   48.35 |   677.75 | 00h00'40 ||   800.00 |  0.5442 |   22.20 |   450.00 |  0.0135 |    0.55 |  0.0000 |    0.00
    A57 |  char | yes | inter |   8192 |   4096 | 0.50 ||  2.50 |   451024 ||  40511.38 |   91.20 |   45.60 |  1437.13 | 00h00'40 ||   800.00 |  0.5501 |   22.29 |   450.00 |  0.0135 |    0.55 |  0.0000 |    0.00
    A57 |  char | yes | inter |  16384 |   8192 | 0.50 ||  2.50 |   198944 ||  40064.12 |   81.36 |   40.68 |  3222.14 | 00h00'40 ||   800.00 |  0.5479 |   21.95 |   450.00 |  0.0135 |    0.54 |  0.0000 |    0.00
    A57 |  char | yes | inter |  32768 |  16384 | 0.50 ||  2.50 |    87088 ||  38328.25 |   74.45 |   37.23 |  7041.75 | 00h00'38 ||   800.00 |  0.5428 |   20.81 |   450.00 |  0.0136 |    0.52 |  0.0000 |    0.00
    A57 |  char | yes | inter |  65536 |  32768 | 0.50 ||  2.50 |    32208 ||  32873.39 |   64.21 |   32.10 | 16330.55 | 00h00'33 ||   800.00 |  0.5208 |   17.12 |   450.00 |  0.0139 |    0.46 |  0.0000 |    0.00
    A57 |  char | yes | inter |   131072 |   65536 | 0.50 ||  2.50 |    15000 ||  33923.05 |   57.96 |   28.98 | 36184.59 | 00h00'34 ||   800.00 |  0.5193 |   17.62 |   450.00 |  0.0142 |    0.48 |  0.0000 |    0.00
    A57 |  char | yes | inter |   262144 |  131072 | 0.50 ||  2.50 |     7000 ||  33887.32 |   54.15 |   27.08 | 77456.74 | 00h00'35 ||   800.00 |  0.5233 |   17.73 |   450.00 |  0.0141 |    0.48 |  0.0000 |    0.00
    A57 |  char | yes | inter |   524288 |  262144 | 0.50 ||  2.50 |     3500 ||  35833.39 |   51.21 |   25.60 | 163809.78 | 00h00'39 ||   800.00 |  0.5258 |   18.84 |   450.00 |  0.0142 |    0.51 |  0.0000 |    0.00
    A57 |  char | yes | inter |  1048576 |  524288 | 0.50 ||  2.50 |     1750 ||  38529.54 |   47.63 |   23.81 | 352270.03 | 00h00'46 ||   800.00 |  0.5257 |   20.25 |   450.00 |  0.0142 |    0.55 |  0.0000 |    0.00
#---------
#---------
# -> inter-SIMD 8-bit, rate 5/6, gen:
# ------|-------|-----|-------|--------|--------|------||-------|----------||-----------|---------|---------|----------|----------||----------|---------|---------|----------|---------|---------|---------|---------|
#  PROC |  TYPE | GEN |   VEC |      N |      K |    R ||   SNR |      FRA || LD+ST+DEC |    CTHR |    ITHR |  LATENCY | RUNTIME  || BIG FREQ | BIG POW | BIG ENE | LIT FREQ | LIT POW | LIT ENE | RAM POW | RAM ENE |
#       |       |     |       |        |        |      ||  (dB) |          ||      (ms) |  (Mb/s) |  (Mb/s) |     (us) | (hhmmss) ||    (Mhz) |     (W) |     (J) |    (Mhz) |     (W) |     (J) |     (W) |     (J) |
# ------|-------|-----|-------|--------|--------|------||-------|----------||-----------|---------|---------|----------|----------||----------|---------|---------|----------|---------|---------|---------|---------|
    A57 |  char | yes | inter |    128 |    107 | 0.83 ||  4.00 | 21203296 ||  12509.40 |  216.96 |  181.36 |     9.44 | 00h00'12 ||   800.00 |  0.5322 |    6.66 |   450.00 |  0.0138 |    0.17 |  0.0000 |    0.00
    A57 |  char | yes | inter |    256 |    213 | 0.83 ||  4.00 | 14939920 ||  22778.01 |  167.91 |  139.71 |    24.39 | 00h00'22 ||   800.00 |  0.5077 |   11.57 |   450.00 |  0.0135 |    0.31 |  0.0000 |    0.00
    A57 |  char | yes | inter |    512 |    427 | 0.83 ||  4.00 |  9001600 ||  30556.43 |  150.83 |  125.79 |    54.31 | 00h00'30 ||   800.00 |  0.5233 |   15.99 |   450.00 |  0.0135 |    0.41 |  0.0000 |    0.00
    A57 |  char | yes | inter |   1024 |    853 | 0.83 ||  4.00 |  4298672 ||  31450.43 |  139.96 |  116.59 |   117.06 | 00h00'31 ||   800.00 |  0.5494 |   17.28 |   450.00 |  0.0135 |    0.42 |  0.0000 |    0.00
    A57 |  char | yes | inter |   2048 |   1707 | 0.83 ||  4.00 |  2383328 ||  39926.89 |  122.25 |  101.89 |   268.04 | 00h00'39 ||   800.00 |  0.5467 |   21.83 |   450.00 |  0.0136 |    0.54 |  0.0000 |    0.00
    A57 |  char | yes | inter |   4096 |   3413 | 0.83 ||  4.00 |  1038848 ||  40834.29 |  104.20 |   86.83 |   628.92 | 00h00'40 ||   800.00 |  0.5446 |   22.24 |   450.00 |  0.0135 |    0.55 |  0.0000 |    0.00
    A57 |  char | yes | inter |   8192 |   6827 | 0.83 ||  4.00 |   480272 ||  40781.31 |   96.48 |   80.40 |  1358.61 | 00h00'40 ||   800.00 |  0.5481 |   22.35 |   450.00 |  0.0135 |    0.55 |  0.0000 |    0.00
    A57 |  char | yes | inter |  16384 |  13653 | 0.83 ||  4.00 |   214064 ||  38709.80 |   90.60 |   75.50 |  2893.33 | 00h00'38 ||   800.00 |  0.5528 |   21.40 |   450.00 |  0.0135 |    0.52 |  0.0000 |    0.00
    A57 |  char | yes | inter |  32768 |  27307 | 0.83 ||  4.00 |    92992 ||  38276.12 |   79.61 |   66.34 |  6585.71 | 00h00'38 ||   800.00 |  0.5360 |   20.51 |   450.00 |  0.0136 |    0.52 |  0.0000 |    0.00
    A57 |  char | yes | inter |  65536 |  54613 | 0.83 ||  4.00 |    32256 ||  31592.56 |   66.91 |   55.76 | 15670.91 | 00h00'32 ||   800.00 |  0.5213 |   16.47 |   450.00 |  0.0140 |    0.44 |  0.0000 |    0.00
    A57 |  char | yes | inter |   262144 |  218453 | 0.83 ||  4.00 |     7500 ||  34832.19 |   56.44 |   47.04 | 74308.66 | 00h00'36 ||   800.00 |  0.5212 |   18.15 |   450.00 |  0.0142 |    0.50 |  0.0000 |    0.00
    A57 |  char | yes | inter |   524288 |  436907 | 0.83 ||  4.00 |     3500 ||  34661.53 |   52.94 |   44.12 | 158452.70 | 00h00'38 ||   800.00 |  0.5300 |   18.37 |   450.00 |  0.0142 |    0.49 |  0.0000 |    0.00
    A57 |  char | yes | inter |  1048576 |  873813 | 0.83 ||  4.00 |     1750 ||  36393.67 |   50.42 |   42.02 | 332742.09 | 00h00'44 ||   800.00 |  0.5347 |   19.46 |   450.00 |  0.0142 |    0.52 |  0.0000 |    0.00
#---------
#---------
