#FIG 3.2  Produced by xfig version 3.2.5c
Landscape
Center
Metric
A5      
100.00
Single
-2
1200 2
0 32 #d0d0d0
2 2 0 1 0 7 50 -1 -1 0.000 0 0 -1 0 0 5
	 180 3600 1260 3600 1260 4320 180 4320 180 3600
2 2 0 1 0 7 50 -1 -1 0.000 0 0 -1 0 0 5
	 1620 3600 2700 3600 2700 4320 1620 4320 1620 3600
2 2 0 1 0 7 50 -1 -1 0.000 0 0 -1 0 0 5
	 3060 3600 4140 3600 4140 4320 3060 4320 3060 3600
2 1 0 1 0 7 60 -1 -1 0.000 0 0 -1 1 0 2
	1 1 1.00 45.00 90.00
	 1305 3960 1575 3960
2 1 0 1 0 7 60 -1 -1 0.000 0 0 -1 1 0 2
	1 1 1.00 45.00 90.00
	 2745 3960 3015 3960
2 1 0 1 0 7 60 -1 -1 0.000 0 0 -1 1 0 2
	1 1 1.00 45.00 90.00
	 4185 3960 4455 3960
2 1 0 1 0 7 60 -1 -1 0.000 0 0 -1 1 0 2
	1 1 1.00 45.00 90.00
	 5715 3960 5985 3960
2 2 0 1 0 7 50 -1 -1 0.000 0 0 -1 0 0 5
	 6030 3600 7110 3600 7110 4320 6030 4320 6030 3600
2 2 0 3 4 7 50 -1 -1 0.000 0 0 -1 0 0 5
	 4590 3600 5670 3600 5670 4320 4590 4320 4590 3600
2 1 0 3 32 7 72 -1 -1 8.000 0 0 -1 0 0 2
	 2880 4140 2880 4770
2 1 0 3 32 7 72 -1 -1 8.000 0 0 -1 0 0 2
	 4320 4140 4320 4770
2 1 0 1 0 7 74 -1 -1 0.000 0 0 -1 1 0 2
	13 1 1.00 60.00 120.00
	 7110 4680 4410 4680
2 1 0 1 0 7 74 -1 -1 0.000 0 0 -1 1 0 2
	13 1 1.00 60.00 120.00
	 2790 4680 180 4680
2 1 0 1 0 7 74 -1 -1 0.000 0 0 -1 1 0 2
	13 1 1.00 60.00 120.00
	 4230 4680 2970 4680
4 1 0 40 -1 18 10 0.0000 4 120 660 3600 4005 Channel\001
4 1 0 40 -1 18 10 0.0000 4 120 660 2160 4005 Encoder\001
4 1 0 40 -1 18 10 0.0000 4 120 555 720 4005 Source\001
4 1 0 40 -1 18 11 0.0000 4 135 735 5130 4005 Decoder\001
4 1 0 40 -1 18 10 0.0000 4 120 345 6570 4005 Sink\001
4 1 21 70 -1 19 12 0.0000 4 150 1275 3600 4590 Comm. Chan.\001
4 1 1 70 -1 18 12 0.0000 4 150 1065 1440 4590 Transmitter\001
4 1 1 70 -1 18 12 0.0000 4 150 795 5850 4590 Receiver\001
