{
  "ubuntu:latest": {
    "gcc": {
      "image": false,
      "status": "unknown"
    },
    "llvm": {
      "image": false,
      "status": "unknown"
    }
  },
  "rockylinux:9": {
    "gcc": {
      "image": true,
      "status": "success"
    }
  },
  "rockylinux:8": {
    "gcc": {
      "image": true,
      "status": "failure",
      "error": "gcc-8.5 & gfortran-8.5 not compatible"
    }
  },
  "opensuse:tumbleweed": {
    "gcc": {
      "image": true,
      "status": "success"
    }
  }
}
