git needed

1 job for feature/sphinx_doc in 2 minutes and 54 seconds (queued for 2 seconds)
Status Job ID Name Coverage
  Deploy
failed #582390
pages

00:02:54

 
Name Stage Failure
failed
pages Deploy
          3 times.
CMake Error at /builds/2c2bf15f/0/dtk/dtk-doc/build/dtk-core-prefix/tmp/dtk-core-gitclone.cmake:66 (message):
Failed to clone repository: 'git@gitlab.inria.fr:dtk/dtk-core.git'


make[2]: *** [CMakeFiles/dtk-core.dir/build.make:91: dtk-core-prefix/src/dtk-core-stamp/dtk-core-download] Error 1
make[1]: *** [CMakeFiles/Makefile2:73: CMakeFiles/dtk-core.dir/all] Error 2
make: *** [Makefile:84: all] Error 2
ERROR: Job failed: exit code 1