{
    "Subject": 88,
    "Trial": 5,
    "Code": "88-5",
    "Age": 63,
    "Gender": "F",
    "Height": 1.65,
    "Weight": 58,
    "BMI": 21.3,
    "Laterality": "Right",
    "Sensor": "TCon",
    "WalkedDistance": 10,
    "WalkingSpeed": 2.0,
    "PathologyGroup": "Healthy",
    "IsControl": "Yes",
    "LeftFootActivity": [
        [
            490,
            584
        ],
        [
            606,
            685
        ],
        [
            709,
            791
        ],
        [
            811,
            890
        ],
        [
            914,
            1005
        ],
        [
            1021,
            1104
        ],
        [
            1133,
            1219
        ],
        [
            1235,
            1321
        ],
        [
            1364,
            1457
        ],
        [
            1483,
            1546
        ],
        [
            1586,
            1667
        ],
        [
            1693,
            1776
        ],
        [
            1799,
            1878
        ],
        [
            1910,
            1988
        ],
        [
            2007,
            2090
        ],
        [
            2116,
            2200
        ],
        [
            2222,
            2303
        ],
        [
            2332,
            2415
        ],
        [
            2454,
            2532
        ]
    ],
    "RightFootActivity": [
        [
            443,
            524
        ],
        [
            546,
            635
        ],
        [
            656,
            739
        ],
        [
            761,
            840
        ],
        [
            864,
            942
        ],
        [
            967,
            1051
        ],
        [
            1075,
            1158
        ],
        [
            1184,
            1266
        ],
        [
            1301,
            1378
        ],
        [
            1423,
            1503
        ],
        [
            1531,
            1610
        ],
        [
            1639,
            1722
        ],
        [
            1747,
            1829
        ],
        [
            1854,
            1932
        ],
        [
            1956,
            2035
        ],
        [
            2062,
            2143
        ],
        [
            2167,
            2250
        ],
        [
            2276,
            2359
        ],
        [
            2390,
            2472
        ]
    ]
}