<?xml version="1.0" encoding="UTF-8" standalone="no"?><svg xmlns="http://www.w3.org/2000/svg" xmlns:xlink="http://www.w3.org/1999/xlink" contentScriptType="application/ecmascript" contentStyleType="text/css" height="207px" preserveAspectRatio="none" style="width:448px;height:207px;" version="1.1" viewBox="0 0 448 207" width="448px" zoomAndPan="magnify"><defs><filter height="300%" id="f1kghk5d7n1mps" width="300%" x="-1" y="-1"><feGaussianBlur result="blurOut" stdDeviation="2.0"/><feColorMatrix in="blurOut" result="blurOut2" type="matrix" values="0 0 0 0 0 0 0 0 0 0 0 0 0 0 0 0 0 0 .4 0"/><feOffset dx="4.0" dy="4.0" in="blurOut2" result="blurOut3"/><feBlend in="SourceGraphic" in2="blurOut3" mode="normal"/></filter></defs><g><!--class Tags--><rect fill="#FEFECE" filter="url(#f1kghk5d7n1mps)" height="73.6094" id="Tags" style="stroke: #A80036; stroke-width: 1.5;" width="80" x="357" y="65.5"/><ellipse cx="380.1" cy="81.5" fill="#ADD1B2" rx="11" ry="11" style="stroke: #A80036; stroke-width: 1.0;"/><path d="M382.4438,77.1719 L382.6156,77.25 C382.8344,76.9375 383.0375,76.8438 383.3344,76.8438 C383.6313,76.8438 383.9125,76.9844 384.0688,77.25 C384.1625,77.4063 384.1781,77.5313 384.1781,77.9688 L384.1781,79.3906 C384.1781,79.8125 384.1469,80 384.0375,80.1563 C383.8656,80.375 383.6,80.5156 383.3344,80.5156 C383.1156,80.5156 382.8813,80.4063 382.7406,80.2656 C382.6,80.1406 382.5688,80.0156 382.5063,79.6094 C382.4125,79.2031 382.2406,78.9844 381.7563,78.7031 C381.2875,78.4531 380.6781,78.2969 380.1,78.2969 C378.3656,78.2969 377.1156,79.6094 377.1156,81.3906 L377.1156,82.4844 C377.1156,84.1875 378.4125,85.2813 380.4594,85.2813 C381.225,85.2813 381.9125,85.1563 382.3344,84.8906 C382.5219,84.7969 382.5219,84.7969 382.975,84.3125 C383.1625,84.125 383.3656,84.0469 383.5844,84.0469 C384.0531,84.0469 384.4438,84.4375 384.4438,84.8906 C384.4438,85.2813 384.1156,85.7344 383.5375,86.1406 C382.7875,86.6875 381.6313,86.9844 380.4125,86.9844 C377.5219,86.9844 375.4125,85.0938 375.4125,82.5156 L375.4125,81.3906 C375.4125,78.6719 377.4125,76.5938 380.0375,76.5938 C380.9125,76.5938 381.5063,76.7344 382.4438,77.1719 Z "/><text fill="#000000" font-family="sans-serif" font-size="12" lengthAdjust="spacingAndGlyphs" textLength="30" x="395.9" y="85.6543">Tags</text><line style="stroke: #A80036; stroke-width: 1.5;" x1="358" x2="436" y1="97.5" y2="97.5"/><rect fill="none" height="6" style="stroke: #C82930; stroke-width: 1.0;" width="6" x="365" y="106.4023"/><text fill="#000000" font-family="sans-serif" font-size="11" lengthAdjust="spacingAndGlyphs" textLength="10" x="377" y="111.7104">Id</text><rect fill="none" height="6" style="stroke: #C82930; stroke-width: 1.0;" width="6" x="365" y="119.207"/><text fill="#000000" font-family="sans-serif" font-size="11" lengthAdjust="spacingAndGlyphs" textLength="54" x="377" y="124.5151">TagName</text><line style="stroke: #A80036; stroke-width: 1.5;" x1="358" x2="436" y1="131.1094" y2="131.1094"/><!--class Votes--><rect fill="#FEFECE" filter="url(#f1kghk5d7n1mps)" height="86.4141" id="Votes" style="stroke: #A80036; stroke-width: 1.5;" width="88" x="6" y="59.5"/><ellipse cx="30" cy="75.5" fill="#ADD1B2" rx="11" ry="11" style="stroke: #A80036; stroke-width: 1.0;"/><path d="M32.3438,71.1719 L32.5156,71.25 C32.7344,70.9375 32.9375,70.8438 33.2344,70.8438 C33.5313,70.8438 33.8125,70.9844 33.9688,71.25 C34.0625,71.4063 34.0781,71.5313 34.0781,71.9688 L34.0781,73.3906 C34.0781,73.8125 34.0469,74 33.9375,74.1563 C33.7656,74.375 33.5,74.5156 33.2344,74.5156 C33.0156,74.5156 32.7813,74.4063 32.6406,74.2656 C32.5,74.1406 32.4688,74.0156 32.4063,73.6094 C32.3125,73.2031 32.1406,72.9844 31.6563,72.7031 C31.1875,72.4531 30.5781,72.2969 30,72.2969 C28.2656,72.2969 27.0156,73.6094 27.0156,75.3906 L27.0156,76.4844 C27.0156,78.1875 28.3125,79.2813 30.3594,79.2813 C31.125,79.2813 31.8125,79.1563 32.2344,78.8906 C32.4219,78.7969 32.4219,78.7969 32.875,78.3125 C33.0625,78.125 33.2656,78.0469 33.4844,78.0469 C33.9531,78.0469 34.3438,78.4375 34.3438,78.8906 C34.3438,79.2813 34.0156,79.7344 33.4375,80.1406 C32.6875,80.6875 31.5313,80.9844 30.3125,80.9844 C27.4219,80.9844 25.3125,79.0938 25.3125,76.5156 L25.3125,75.3906 C25.3125,72.6719 27.3125,70.5938 29.9375,70.5938 C30.8125,70.5938 31.4063,70.7344 32.3438,71.1719 Z "/><text fill="#000000" font-family="sans-serif" font-size="12" lengthAdjust="spacingAndGlyphs" textLength="36" x="46" y="79.6543">Votes</text><line style="stroke: #A80036; stroke-width: 1.5;" x1="7" x2="93" y1="91.5" y2="91.5"/><rect fill="none" height="6" style="stroke: #C82930; stroke-width: 1.0;" width="6" x="14" y="100.4023"/><text fill="#000000" font-family="sans-serif" font-size="11" lengthAdjust="spacingAndGlyphs" textLength="10" x="26" y="105.7104">Id</text><rect fill="none" height="6" style="stroke: #C82930; stroke-width: 1.0;" width="6" x="14" y="113.207"/><text fill="#000000" font-family="sans-serif" font-size="11" lengthAdjust="spacingAndGlyphs" textLength="35" x="26" y="118.5151">PostId</text><rect fill="none" height="6" style="stroke: #C82930; stroke-width: 1.0;" width="6" x="14" y="126.0117"/><text fill="#000000" font-family="sans-serif" font-size="11" lengthAdjust="spacingAndGlyphs" textLength="62" x="26" y="131.3198">VoteTypeId</text><line style="stroke: #A80036; stroke-width: 1.5;" x1="7" x2="93" y1="137.9141" y2="137.9141"/><!--class Posts--><rect fill="#FEFECE" filter="url(#f1kghk5d7n1mps)" height="188.8516" id="Posts" style="stroke: #A80036; stroke-width: 1.5;" width="129" x="129.5" y="8"/><ellipse cx="172.4" cy="24" fill="#ADD1B2" rx="11" ry="11" style="stroke: #A80036; stroke-width: 1.0;"/><path d="M174.7438,19.6719 L174.9156,19.75 C175.1344,19.4375 175.3375,19.3438 175.6344,19.3438 C175.9313,19.3438 176.2125,19.4844 176.3688,19.75 C176.4625,19.9063 176.4781,20.0313 176.4781,20.4688 L176.4781,21.8906 C176.4781,22.3125 176.4469,22.5 176.3375,22.6563 C176.1656,22.875 175.9,23.0156 175.6344,23.0156 C175.4156,23.0156 175.1813,22.9063 175.0406,22.7656 C174.9,22.6406 174.8688,22.5156 174.8063,22.1094 C174.7125,21.7031 174.5406,21.4844 174.0563,21.2031 C173.5875,20.9531 172.9781,20.7969 172.4,20.7969 C170.6656,20.7969 169.4156,22.1094 169.4156,23.8906 L169.4156,24.9844 C169.4156,26.6875 170.7125,27.7813 172.7594,27.7813 C173.525,27.7813 174.2125,27.6563 174.6344,27.3906 C174.8219,27.2969 174.8219,27.2969 175.275,26.8125 C175.4625,26.625 175.6656,26.5469 175.8844,26.5469 C176.3531,26.5469 176.7438,26.9375 176.7438,27.3906 C176.7438,27.7813 176.4156,28.2344 175.8375,28.6406 C175.0875,29.1875 173.9313,29.4844 172.7125,29.4844 C169.8219,29.4844 167.7125,27.5938 167.7125,25.0156 L167.7125,23.8906 C167.7125,21.1719 169.7125,19.0938 172.3375,19.0938 C173.2125,19.0938 173.8063,19.2344 174.7438,19.6719 Z "/><text fill="#000000" font-family="sans-serif" font-size="12" lengthAdjust="spacingAndGlyphs" textLength="35" x="192.6" y="28.1543">Posts</text><line style="stroke: #A80036; stroke-width: 1.5;" x1="130.5" x2="257.5" y1="40" y2="40"/><rect fill="none" height="6" style="stroke: #C82930; stroke-width: 1.0;" width="6" x="137.5" y="48.9023"/><text fill="#000000" font-family="sans-serif" font-size="11" lengthAdjust="spacingAndGlyphs" textLength="10" x="149.5" y="54.2104">Id</text><rect fill="none" height="6" style="stroke: #C82930; stroke-width: 1.0;" width="6" x="137.5" y="61.707"/><text fill="#000000" font-family="sans-serif" font-size="11" lengthAdjust="spacingAndGlyphs" textLength="62" x="149.5" y="67.0151">PostTypeId</text><rect fill="none" height="6" style="stroke: #C82930; stroke-width: 1.0;" width="6" x="137.5" y="74.5117"/><text fill="#000000" font-family="sans-serif" font-size="11" lengthAdjust="spacingAndGlyphs" textLength="103" x="149.5" y="79.8198">AcceptedAnswerId</text><rect fill="none" height="6" style="stroke: #C82930; stroke-width: 1.0;" width="6" x="137.5" y="87.3164"/><text fill="#000000" font-family="sans-serif" font-size="11" lengthAdjust="spacingAndGlyphs" textLength="47" x="149.5" y="92.6245">ParentId</text><rect fill="none" height="6" style="stroke: #C82930; stroke-width: 1.0;" width="6" x="137.5" y="100.1211"/><text fill="#000000" font-family="sans-serif" font-size="11" lengthAdjust="spacingAndGlyphs" textLength="33" x="149.5" y="105.4292">Score</text><rect fill="none" height="6" style="stroke: #C82930; stroke-width: 1.0;" width="6" x="137.5" y="112.9258"/><text fill="#000000" font-family="sans-serif" font-size="11" lengthAdjust="spacingAndGlyphs" textLength="59" x="149.5" y="118.2339">ViewCount</text><rect fill="none" height="6" style="stroke: #C82930; stroke-width: 1.0;" width="6" x="137.5" y="125.7305"/><text fill="#000000" font-family="sans-serif" font-size="11" lengthAdjust="spacingAndGlyphs" textLength="74" x="149.5" y="131.0386">OwnerUserId</text><rect fill="none" height="6" style="stroke: #C82930; stroke-width: 1.0;" width="6" x="137.5" y="138.5352"/><text fill="#000000" font-family="sans-serif" font-size="11" lengthAdjust="spacingAndGlyphs" textLength="28" x="149.5" y="143.8433">Tags</text><rect fill="none" height="6" style="stroke: #C82930; stroke-width: 1.0;" width="6" x="137.5" y="151.3398"/><text fill="#000000" font-family="sans-serif" font-size="11" lengthAdjust="spacingAndGlyphs" textLength="75" x="149.5" y="156.6479">AnswerCount</text><rect fill="none" height="6" style="stroke: #C82930; stroke-width: 1.0;" width="6" x="137.5" y="164.1445"/><text fill="#000000" font-family="sans-serif" font-size="11" lengthAdjust="spacingAndGlyphs" textLength="88" x="149.5" y="169.4526">CommentCount</text><rect fill="none" height="6" style="stroke: #C82930; stroke-width: 1.0;" width="6" x="137.5" y="176.9492"/><text fill="#000000" font-family="sans-serif" font-size="11" lengthAdjust="spacingAndGlyphs" textLength="78" x="149.5" y="182.2573">FavoriteCount</text><line style="stroke: #A80036; stroke-width: 1.5;" x1="130.5" x2="257.5" y1="188.8516" y2="188.8516"/><!--link Votes to Posts--><path d="M94.1562,102.5 C104.1199,102.5 114.084,102.5 124.047,102.5 " fill="none" id="Votes-Posts" style="stroke: #A80036; stroke-width: 1.0;"/><polygon fill="#A80036" points="129.258,102.5,120.258,98.5,124.258,102.5,120.258,106.5,129.258,102.5" style="stroke: #A80036; stroke-width: 1.0;"/><!--link Posts to Tags--><path d="M258.509,102.5 C288.893,102.5 324.4,102.5 351.854,102.5 " fill="none" id="Posts-Tags" style="stroke: #A80036; stroke-width: 1.0; stroke-dasharray: 7.0,7.0;"/><polygon fill="#A80036" points="356.883,102.5,347.883,98.5,351.883,102.5,347.883,106.5,356.883,102.5" style="stroke: #A80036; stroke-width: 1.0;"/><text fill="#000000" font-family="sans-serif" font-size="13" lengthAdjust="spacingAndGlyphs" textLength="62" x="276.75" y="95.5669">TagName</text><!--
@startuml
class Tags {
    - Id
    - TagName
}

class Votes {
    - Id
    - PostId
    - VoteTypeId
}

class Posts {
    - Id
    - PostTypeId
    - AcceptedAnswerId
    - ParentId
    - Score
    - ViewCount
    - OwnerUserId
    - Tags
    - AnswerCount
    - CommentCount
    - FavoriteCount
}

Votes -> Posts
Posts .> Tags : TagName
@enduml

PlantUML version 1.2019.07beta1(Unknown compile time)
(GPL source distribution)
Java Runtime: Java(TM) SE Runtime Environment
JVM: Java HotSpot(TM) 64-Bit Server VM
Java Version: 1.7.0_25-b15
Operating System: Linux
Default Encoding: UTF-8
Language: en
Country: US
--></g></svg>