MULTI-WORD_DATE	count	probability
next week 	145	0.060669456066945605
twenty seventh 	95	0.0397489539748954
twenty eighth 	75	0.03138075313807531
twenty ninth 	65	0.027196652719665274
twenty third 	63	0.026359832635983262
twenty fourth 	58	0.024267782426778243
next two weeks 	53	0.022175732217573223
twenty second 	53	0.022175732217573223
twenty first 	48	0.0200836820083682
twenty sixth 	44	0.018410041841004185
that day 	41	0.01715481171548117
twenty fifth 	36	0.01506276150627615
thirty first 	28	0.011715481171548118
this week 	26	0.010878661087866108
Tuesday the sixteenth 	21	0.008786610878661089
this month 	20	0.008368200836820083
following week 	19	0.007949790794979079
all day 	19	0.007949790794979079
those days 	18	0.007531380753138075
that week 	18	0.007531380753138075
two days 	16	0.0066945606694560665
next couple of weeks 	16	0.0066945606694560665
three days 	15	0.006276150627615063
Friday the thirteenth 	12	0.00502092050209205
Thursday the twentieth 	12	0.00502092050209205
next couple weeks 	11	0.004602510460251046
next Monday 	11	0.004602510460251046
Wednesday the third 	11	0.004602510460251046
week after 	10	0.0041841004184100415
Wednesday , the third 	10	0.0041841004184100415
Wednesday the fourth 	9	0.0037656903765690376
Saturday the fourth 	9	0.0037656903765690376
whole day 	8	0.0033472803347280333
next day 	8	0.0033472803347280333
Saturday the second 	8	0.0033472803347280333
Tuesday , the sixteenth 	8	0.0033472803347280333
Monday Tuesday 	7	0.0029288702928870294
Monday the ninth 	7	0.0029288702928870294
Thursday the eighth 	7	0.0029288702928870294
Monday the seventh 	7	0.0029288702928870294
next three weeks 	7	0.0029288702928870294
Wednesday the twenty ninth 	6	0.002510460251046025
Wednesday the seventeenth 	6	0.002510460251046025
Wednesday , the fourth 	6	0.002510460251046025
following Monday 	5	0.0020920502092050207
Friday the twenty first 	5	0.0020920502092050207
week after that 	5	0.0020920502092050207
Saturday , the second 	5	0.0020920502092050207
Friday the first 	5	0.0020920502092050207
Saturday , the fourth 	5	0.0020920502092050207
Friday the twenty third 	5	0.0020920502092050207
Monday the fifteenth 	5	0.0020920502092050207
next Wednesday 	5	0.0020920502092050207
Friday the twelfth 	5	0.0020920502092050207
Wednesday the fifteenth 	5	0.0020920502092050207
Thursday , the eighth 	5	0.0020920502092050207
one day 	5	0.0020920502092050207
two weeks 	5	0.0020920502092050207
rest of the week 	5	0.0020920502092050207
Friday , the fifth 	5	0.0020920502092050207
later this month 	4	0.0016736401673640166
Friday the fourth 	4	0.0016736401673640166
Friday the sixteenth 	4	0.0016736401673640166
this day 	4	0.0016736401673640166
next few weeks 	4	0.0016736401673640166
Sunday the third 	4	0.0016736401673640166
Friday the ninth 	4	0.0016736401673640166
Tuesday , the second 	4	0.0016736401673640166
Monday the twenty second 	4	0.0016736401673640166
Monday the twenty ninth 	4	0.0016736401673640166
Monday , the twenty seventh 	4	0.0016736401673640166
first of April 	4	0.0016736401673640166
Tuesday , the twenty third 	4	0.0016736401673640166
June third 	4	0.0016736401673640166
Thursday the third 	4	0.0016736401673640166
Monday the eighth 	4	0.0016736401673640166
Thursday the first 	4	0.0016736401673640166
third of June 	4	0.0016736401673640166
next Tuesday 	4	0.0016736401673640166
Wednesday , the seventeenth 	4	0.0016736401673640166
Wednesday the first 	4	0.0016736401673640166
Thursday the second 	4	0.0016736401673640166
week of the fifteenth 	4	0.0016736401673640166
Wednesday August fourth 	4	0.0016736401673640166
Friday the twenty sixth 	4	0.0016736401673640166
Thursday the twenty ninth 	4	0.0016736401673640166
whole week 	4	0.0016736401673640166
Friday the seventh 	4	0.0016736401673640166
rest of the day 	4	0.0016736401673640166
Tuesday the thirtieth 	4	0.0016736401673640166
both days 	4	0.0016736401673640166
Tuesday Wednesday 	4	0.0016736401673640166
Friday the eleventh 	4	0.0016736401673640166
next Thursday 	4	0.0016736401673640166
week of the sixth 	4	0.0016736401673640166
Wednesday the twenty first 	3	0.0012552301255230125
Tuesday , the thirtieth 	3	0.0012552301255230125
from the twenty fifth through the twenty seventh 	3	0.0012552301255230125
next year 	3	0.0012552301255230125
Wednesday the fourteenth 	3	0.0012552301255230125
week of the ninth 	3	0.0012552301255230125
Thursday the eighteenth 	3	0.0012552301255230125
Tuesday the tenth 	3	0.0012552301255230125
Thursday the thirtieth 	3	0.0012552301255230125
Monday the twenty fourth 	3	0.0012552301255230125
Thursday the twelfth 	3	0.0012552301255230125
the week 	3	0.0012552301255230125
Tuesday , the ninth 	3	0.0012552301255230125
rest of the month 	3	0.0012552301255230125
Tuesday , the eleventh 	3	0.0012552301255230125
beginning of next week 	3	0.0012552301255230125
Wednesday , the twenty ninth 	3	0.0012552301255230125
Thursday , the fifth 	3	0.0012552301255230125
week of the twenty ninth 	3	0.0012552301255230125
fourth fifth 	3	0.0012552301255230125
during the week 	3	0.0012552301255230125
Monday the fourteenth 	3	0.0012552301255230125
Thursday , the third 	3	0.0012552301255230125
Monday , the fifteenth 	3	0.0012552301255230125
Monday the seventeenth 	3	0.0012552301255230125
February third 	3	0.0012552301255230125
next days 	3	0.0012552301255230125
Wednesday , the twenty eighth 	3	0.0012552301255230125
Monday the twentieth 	3	0.0012552301255230125
week of the nineteenth 	3	0.0012552301255230125
June second 	3	0.0012552301255230125
Monday the fifth 	3	0.0012552301255230125
Monday through Friday 	3	0.0012552301255230125
Friday of next week 	3	0.0012552301255230125
Monday through Wednesday 	3	0.0012552301255230125
this weekend 	3	0.0012552301255230125
week of the twenty second 	3	0.0012552301255230125
from the thirty first 	3	0.0012552301255230125
Monday , thirteenth 	3	0.0012552301255230125
Sunday the twenty eighth 	3	0.0012552301255230125
first week of February 	3	0.0012552301255230125
all week 	3	0.0012552301255230125
this Monday 	3	0.0012552301255230125
Friday the sixth 	3	0.0012552301255230125
Friday , the twentieth 	3	0.0012552301255230125
Tuesday the twentieth 	3	0.0012552301255230125
Wednesday the sixth 	3	0.0012552301255230125
from the second to the fifteenth 	3	0.0012552301255230125
Monday the twenty sixth 	3	0.0012552301255230125
Thursday , the twentieth 	3	0.0012552301255230125
twenty fifth through the twenty seventh 	2	0.0008368200836820083
ninth , of July 	2	0.0008368200836820083
end of March 	2	0.0008368200836820083
Friday the third 	2	0.0008368200836820083
Tuesday the twenty seventh 	2	0.0008368200836820083
first of February 	2	0.0008368200836820083
February the third 	2	0.0008368200836820083
first day 	2	0.0008368200836820083
Friday , the fourth 	2	0.0008368200836820083
Thursday , the thirteenth 	2	0.0008368200836820083
Thursday , the fourth 	2	0.0008368200836820083
week of the twenty third 	2	0.0008368200836820083
Thursday the seventeenth 	2	0.0008368200836820083
the fifteenth of May 	2	0.0008368200836820083
Tuesday through Thursday 	2	0.0008368200836820083
seventeenth of March 	2	0.0008368200836820083
third of February 	2	0.0008368200836820083
end of this month 	2	0.0008368200836820083
week later 	2	0.0008368200836820083
twenty seventh and twenty eighth 	2	0.0008368200836820083
twenty sixth today 	2	0.0008368200836820083
next two Fridays 	2	0.0008368200836820083
seventh eighth 	2	0.0008368200836820083
August eighth 	2	0.0008368200836820083
two thirty 	2	0.0008368200836820083
Monday the twenty fifth 	2	0.0008368200836820083
Thursday June the third 	2	0.0008368200836820083
tenth , the seventeenth 	2	0.0008368200836820083
last week of March 	2	0.0008368200836820083
the week of the sixteenth 	2	0.0008368200836820083
a day 	2	0.0008368200836820083
Thursday the tenth 	2	0.0008368200836820083
between the second , and the fifteenth 	2	0.0008368200836820083
Monday , the fifth 	2	0.0008368200836820083
Monday and Tuesday 	2	0.0008368200836820083
Tuesday and Wednesday 	2	0.0008368200836820083
last week 	2	0.0008368200836820083
Saturday , October second 	2	0.0008368200836820083
ninth of August 	2	0.0008368200836820083
next month 	2	0.0008368200836820083
Tuesday , the seventeenth 	2	0.0008368200836820083
tenth of March 	2	0.0008368200836820083
Friday the tenth 	2	0.0008368200836820083
end of next week 	2	0.0008368200836820083
Monday , the ninth 	2	0.0008368200836820083
last day 	2	0.0008368200836820083
next Friday 	2	0.0008368200836820083
Tuesday the third 	2	0.0008368200836820083
May , the twenty fourth 	2	0.0008368200836820083
Wednesday the twenty sixth 	2	0.0008368200836820083
second week 	2	0.0008368200836820083
July thirteenth 	2	0.0008368200836820083
Friday the twenty fourth 	2	0.0008368200836820083
Tuesday , the sixth 	2	0.0008368200836820083
vacation day 	2	0.0008368200836820083
sixteenth of April 	2	0.0008368200836820083
Thursday June third 	2	0.0008368200836820083
seventh of August 	2	0.0008368200836820083
a couple days 	2	0.0008368200836820083
Friday the fifth 	2	0.0008368200836820083
Monday fifteen 	2	0.0008368200836820083
Wednesday , the twenty second 	2	0.0008368200836820083
Friday , the tenth 	2	0.0008368200836820083
Thursday the twentieth of May 	2	0.0008368200836820083
next few days 	2	0.0008368200836820083
Tuesday , the eighteenth 	2	0.0008368200836820083
Tuesday the first 	2	0.0008368200836820083
Monday , the tenth 	2	0.0008368200836820083
Wednesday of next week 	2	0.0008368200836820083
October first 	2	0.0008368200836820083
Friday , the eighth 	2	0.0008368200836820083
twenty six 	2	0.0008368200836820083
November twenty eighth 	2	0.0008368200836820083
Thursday next week 	2	0.0008368200836820083
Thursday , April eighth 	2	0.0008368200836820083
Wednesday the nineteenth 	2	0.0008368200836820083
Thursday , April first 	2	0.0008368200836820083
Independence Day 	2	0.0008368200836820083
end of the week 	2	0.0008368200836820083
week of 	2	0.0008368200836820083
twenty sixth through the twenty eighth 	2	0.0008368200836820083
first week 	2	0.0008368200836820083
Friday the second 	2	0.0008368200836820083
the twenty 	2	0.0008368200836820083
first week of October 	2	0.0008368200836820083
early April 	2	0.0008368200836820083
Tuesday the twenty third 	2	0.0008368200836820083
week of the twenty sixth 	2	0.0008368200836820083
from the twenty fourth through the twenty seventh 	2	0.0008368200836820083
from Thursday to Saturday 	2	0.0008368200836820083
Monday , the twenty fourth 	2	0.0008368200836820083
Tuesday the twenty eighth 	2	0.0008368200836820083
a couple weeks 	2	0.0008368200836820083
Friday this month 	2	0.0008368200836820083
the day 	2	0.0008368200836820083
fifth of April 	2	0.0008368200836820083
Monday the thirty first 	2	0.0008368200836820083
fifteenth of May 	2	0.0008368200836820083
Wednesday , August fourth 	2	0.0008368200836820083
fifteenth of March 	2	0.0008368200836820083
Monday the twenty seventh 	2	0.0008368200836820083
Tuesday the , sixteenth 	2	0.0008368200836820083
end of May 	2	0.0008368200836820083
of January the ninth 	1	0.00041841004184100416
sixth of April 	1	0.00041841004184100416
Wednesday the twenty ninth , of September 	1	0.00041841004184100416
through the sixth 	1	0.00041841004184100416
October sixth 	1	0.00041841004184100416
twenty sixth in July 	1	0.00041841004184100416
from the fourth 	1	0.00041841004184100416
from the twenty seventh to the twenty ninth 	1	0.00041841004184100416
September seventh 	1	0.00041841004184100416
from the thirtieth through the third 	1	0.00041841004184100416
week of January ninth through the thirteenth 	1	0.00041841004184100416
from Friday , the thirtieth , until Tuesday , the third 	1	0.00041841004184100416
fourth through the sixth 	1	0.00041841004184100416
coming week 	1	0.00041841004184100416
fourth eleventh seventeenth 	1	0.00041841004184100416
fifth , Thursday 	1	0.00041841004184100416
Monday , after the third 	1	0.00041841004184100416
until Thursday 	1	0.00041841004184100416
from the seventh to the ninth 	1	0.00041841004184100416
weekend of the eighth and the ninth 	1	0.00041841004184100416
twenty seventh of October 	1	0.00041841004184100416
fourth , Wednesday 	1	0.00041841004184100416
eighth to the ninth 	1	0.00041841004184100416
two vacation days 	1	0.00041841004184100416
twenty fifth of October 	1	0.00041841004184100416
between the twenty fourth and the twenty seventh 	1	0.00041841004184100416
twenty fourth of October 	1	0.00041841004184100416
between the fifth and the seventh 	1	0.00041841004184100416
from Monday , until , two weeks 	1	0.00041841004184100416
October thirty first 	1	0.00041841004184100416
Friday , the nineteenth 	1	0.00041841004184100416
end of the week following 	1	0.00041841004184100416
this Friday 	1	0.00041841004184100416
next week , twenty sixth through the thirtieth 	1	0.00041841004184100416
from , twenty two , to the twenty sixth 	1	0.00041841004184100416
twenty sixth , Tuesday 	1	0.00041841004184100416
twenty fifth , Monday 	1	0.00041841004184100416
April the ninth 	1	0.00041841004184100416
from the sixteenth until the twentieth 	1	0.00041841004184100416
Thursday the twenty third 	1	0.00041841004184100416
couple weeks from now 	1	0.00041841004184100416
March , fifth nineteen ninety three 	1	0.00041841004184100416
from March ninth through Thursday , the eleventh 	1	0.00041841004184100416
two week 	1	0.00041841004184100416
from the fourth to sixth and 	1	0.00041841004184100416
the next two weeks 	1	0.00041841004184100416
between , March eighth and March nineteenth 	1	0.00041841004184100416
week of the fifth I 	1	0.00041841004184100416
Thursday March , eighteenth nineteen ninety three 	1	0.00041841004184100416
eighteenth , 	1	0.00041841004184100416
twenty second through the twenty fourth 	1	0.00041841004184100416
upcoming week 	1	0.00041841004184100416
Thursday of the eleventh 	1	0.00041841004184100416
sixth seventh 	1	0.00041841004184100416
last month 	1	0.00041841004184100416
Wednesday , the fifteen 	1	0.00041841004184100416
Monday , the eighth 	1	0.00041841004184100416
December third 	1	0.00041841004184100416
the twenty eighth of November 	1	0.00041841004184100416
fourth of December 	1	0.00041841004184100416
November the twenty eight 	1	0.00041841004184100416
from the second to fifteenth 	1	0.00041841004184100416
the month 	1	0.00041841004184100416
September twenty fourth nineteen ninety three 	1	0.00041841004184100416
Tuesday , the nineteenth of September 	1	0.00041841004184100416
this next week 	1	0.00041841004184100416
first through the third 	1	0.00041841004184100416
Saturday , the fourth of December 	1	0.00041841004184100416
tenth the Friday 	1	0.00041841004184100416
Monday , July twenty six 	1	0.00041841004184100416
twenty sixth twenty seventh and twenty eighth 	1	0.00041841004184100416
from the thirtieth to the third 	1	0.00041841004184100416
Wednesday fourth 	1	0.00041841004184100416
Friday , the seventeenth 	1	0.00041841004184100416
Wednesday , the tenth 	1	0.00041841004184100416
Friday , October first 	1	0.00041841004184100416
twenty seven 	1	0.00041841004184100416
beginning of April 	1	0.00041841004184100416
Wednesday March thirty first 	1	0.00041841004184100416
March , thirty first 	1	0.00041841004184100416
Wednesday , March thirty first 	1	0.00041841004184100416
end of July 	1	0.00041841004184100416
from the ninth of March until sixteenth 	1	0.00041841004184100416
Tuesday , the fourteenth of March 	1	0.00041841004184100416
two dates 	1	0.00041841004184100416
another date 	1	0.00041841004184100416
from Friday to Sunday 	1	0.00041841004184100416
Wednesday the thirty first 	1	0.00041841004184100416
Easter days 	1	0.00041841004184100416
Sunday , the , twenty sixth 	1	0.00041841004184100416
beginning of , the week of the fourth 	1	0.00041841004184100416
week of the thirteenth 	1	0.00041841004184100416
August twentieth 	1	0.00041841004184100416
Wednesday the ninth 	1	0.00041841004184100416
week of the twenty seventh 	1	0.00041841004184100416
April fourteenth 	1	0.00041841004184100416
Wednesday , April seventh 	1	0.00041841004184100416
Friday April nine 	1	0.00041841004184100416
Friday , April nine 	1	0.00041841004184100416
week of the fourth 	1	0.00041841004184100416
Friday mornings 	1	0.00041841004184100416
two weeks from today 	1	0.00041841004184100416
seventh eighth ninth 	1	0.00041841004184100416
twenty ninth through the thirty first 	1	0.00041841004184100416
Thursday , the first 	1	0.00041841004184100416
Wednesday the seventh 	1	0.00041841004184100416
Tuesday the sixth 	1	0.00041841004184100416
twenty fourth , Monday 	1	0.00041841004184100416
Wednesday the twenty fourth 	1	0.00041841004184100416
twenty seven= 	1	0.00041841004184100416
Friday the twenty sixth of March 	1	0.00041841004184100416
July , first 	1	0.00041841004184100416
week following 	1	0.00041841004184100416
between the second and the sixth 	1	0.00041841004184100416
Monday the seventh , eighth , and ninth 	1	0.00041841004184100416
whole week of the fourth 	1	0.00041841004184100416
week of March twenty ninth 	1	0.00041841004184100416
Wednesday the eleventh 	1	0.00041841004184100416
Wednesday February third 	1	0.00041841004184100416
seventeenth nineteenth 	1	0.00041841004184100416
two weeks from now 	1	0.00041841004184100416
thirty first to the second 	1	0.00041841004184100416
sixth , of , May 	1	0.00041841004184100416
twenty fourth of May 	1	0.00041841004184100416
Tuesday of the next two weeks 	1	0.00041841004184100416
the twenty eighth 	1	0.00041841004184100416
two times those days 	1	0.00041841004184100416
next Wednesday , October sixth 	1	0.00041841004184100416
fourth , fifth , and sixth of October 	1	0.00041841004184100416
October second 	1	0.00041841004184100416
Friday the eighth 	1	0.00041841004184100416
next week the following week 	1	0.00041841004184100416
from , the second , until the , fifteenth 	1	0.00041841004184100416
from the twenty first to the twenty third 	1	0.00041841004184100416
from the ninth March to the sixteenth March 	1	0.00041841004184100416
on the twelfth to the thirteenth of March 	1	0.00041841004184100416
fifteenth , sixteenth 	1	0.00041841004184100416
twenty fourth of March 	1	0.00041841004184100416
eighth of April 	1	0.00041841004184100416
Friday the eighth of October 	1	0.00041841004184100416
Friday October eighth 	1	0.00041841004184100416
week of the thirty first 	1	0.00041841004184100416
week of the twenty fourth 	1	0.00041841004184100416
second of August 	1	0.00041841004184100416
twenty sixth of November 	1	0.00041841004184100416
Thursday and Friday 	1	0.00041841004184100416
Thursday , December the second 	1	0.00041841004184100416
Friday , the first 	1	0.00041841004184100416
next week Wednesday 	1	0.00041841004184100416
from Monday through Wednesday 	1	0.00041841004184100416
following week , Thursday and Friday 	1	0.00041841004184100416
twenty ninth to the second 	1	0.00041841004184100416
first week of / the twenty second through the twenty sixth 	1	0.00041841004184100416
forty six 	1	0.00041841004184100416
day after 	1	0.00041841004184100416
the next week 	1	0.00041841004184100416
eleventh of June 	1	0.00041841004184100416
month of March 	1	0.00041841004184100416
Friday the , twenty first 	1	0.00041841004184100416
next two , Monday 	1	0.00041841004184100416
Thursdays of the month 	1	0.00041841004184100416
next Wednesday the twenty first 	1	0.00041841004184100416
all next week 	1	0.00041841004184100416
Thursday of that week 	1	0.00041841004184100416
March ninth 	1	0.00041841004184100416
next two days 	1	0.00041841004184100416
next couple of Fridays 	1	0.00041841004184100416
last Friday 	1	0.00041841004184100416
April the thirteenth 	1	0.00041841004184100416
four day weekend 	1	0.00041841004184100416
next time 	1	0.00041841004184100416
Thursday , twentieth 	1	0.00041841004184100416
ninth to the tenth of this next week 	1	0.00041841004184100416
Thursday the eleventh 	1	0.00041841004184100416
two other days 	1	0.00041841004184100416
April , first 	1	0.00041841004184100416
Tuesday , the fourteenth 	1	0.00041841004184100416
the two days 	1	0.00041841004184100416
three days from the twenty fourth to twenty sixth 	1	0.00041841004184100416
ninth April 	1	0.00041841004184100416
thirteenth on July , on Thursday 	1	0.00041841004184100416
other days 	1	0.00041841004184100416
thirteenth of July , on Thursday 	1	0.00041841004184100416
seventh and eighth 	1	0.00041841004184100416
early March 	1	0.00041841004184100416
Friday of the tenth 	1	0.00041841004184100416
next Tuesday through Thursday 	1	0.00041841004184100416
from the seventh through the twenty fifth 	1	0.00041841004184100416
from the ninth , to the eleventh 	1	0.00041841004184100416
Monday March , fifteenth 	1	0.00041841004184100416
March sixteenth 	1	0.00041841004184100416
Friday , the sixth 	1	0.00041841004184100416
month of July 	1	0.00041841004184100416
from Friday the thirtieth , until , Tuesday the third 	1	0.00041841004184100416
Monday , August second 	1	0.00041841004184100416
any day of the week 	1	0.00041841004184100416
Friday the fifteenth 	1	0.00041841004184100416
ninth tenth and eleventh 	1	0.00041841004184100416
first of December 	1	0.00041841004184100416
Thursday the twenty 	1	0.00041841004184100416
Wednesday , twenty ninth thirtieth and thirty first 	1	0.00041841004184100416
Tuesday the nineteenth 	1	0.00041841004184100416
Thursday the ninth 	1	0.00041841004184100416
Monday the eleventh 	1	0.00041841004184100416
whole of next week 	1	0.00041841004184100416
Thursday the ninth tenth 	1	0.00041841004184100416
three day weekend 	1	0.00041841004184100416
every year 	1	0.00041841004184100416
month of May 	1	0.00041841004184100416
Thursday , the twenty fifth 	1	0.00041841004184100416
twenty seventh , of May 	1	0.00041841004184100416
thirty first , through June , second 	1	0.00041841004184100416
week of the twenty fifth 	1	0.00041841004184100416
week of the first 	1	0.00041841004184100416
the tenth 	1	0.00041841004184100416
February the second 	1	0.00041841004184100416
seventeenth Tuesday 	1	0.00041841004184100416
Monday , November the twenty second 	1	0.00041841004184100416
December , the third 	1	0.00041841004184100416
from the fifteenth to the nineteenth 	1	0.00041841004184100416
Saturday , December the fourth 	1	0.00041841004184100416
last weekend in March 	1	0.00041841004184100416
Monday the sixth 	1	0.00041841004184100416
this week Friday 	1	0.00041841004184100416
Friday , the twenty third 	1	0.00041841004184100416
week of the second 	1	0.00041841004184100416
day next week 	1	0.00041841004184100416
about Tuesday 	1	0.00041841004184100416
first full week of October 	1	0.00041841004184100416
between the fifteenth 	1	0.00041841004184100416
week of the twelfth 	1	0.00041841004184100416
Thursday , the first , June 	1	0.00041841004184100416
first week of April 	1	0.00041841004184100416
January the twentieth 	1	0.00041841004184100416
February into June 	1	0.00041841004184100416
tenth of July 	1	0.00041841004184100416
eleven of July 	1	0.00041841004184100416
from Sunday the ninth until Wednesday the twelfth 	1	0.00041841004184100416
week just twenty seventh through thirtieth 	1	0.00041841004184100416
Wednesday , the nineteenth of July 	1	0.00041841004184100416
fourteen to seventeen 	1	0.00041841004184100416
from , the second until the sixth 	1	0.00041841004184100416
first , Thursday , on June 	1	0.00041841004184100416
the ninth of August 	1	0.00041841004184100416
twenty seventh through the thirtieth 	1	0.00041841004184100416
thirty first of August 	1	0.00041841004184100416
last day in August 	1	0.00041841004184100416
between the twenty second and twenty ninth 	1	0.00041841004184100416
eighteenth of August 	1	0.00041841004184100416
Tuesday the twenty fifth 	1	0.00041841004184100416
Thursday , June , third 	1	0.00041841004184100416
the twelfth 	1	0.00041841004184100416
Tuesday the 	1	0.00041841004184100416
next couple weeks before the sixteenth 	1	0.00041841004184100416
Wednesday through Friday 	1	0.00041841004184100416
second weekend in March 	1	0.00041841004184100416
ninety five 	1	0.00041841004184100416
thirty first of May 	1	0.00041841004184100416
beginning of June 	1	0.00041841004184100416
that Thursday the third 	1	0.00041841004184100416
Monday and Tuesday next week 	1	0.00041841004184100416
Thursday , June third 	1	0.00041841004184100416
twenty second of January 	1	0.00041841004184100416
Thursday November 	1	0.00041841004184100416
twenty fifth of Monday 	1	0.00041841004184100416
Wednesday the third of February 	1	0.00041841004184100416
eighth and ninth 	1	0.00041841004184100416
Monday and Tuesday the next week 	1	0.00041841004184100416
from the fourth through the sixth 	1	0.00041841004184100416
next week Wednesday and Thursday 	1	0.00041841004184100416
Saturday October second 	1	0.00041841004184100416
last day of April 	1	0.00041841004184100416
fifth , Wednesday 	1	0.00041841004184100416
Monday in August 	1	0.00041841004184100416
October fourth 	1	0.00041841004184100416
from the thirty first , until the second 	1	0.00041841004184100416
from the twenty fourth to the twenty seventh 	1	0.00041841004184100416
from , thirteenth , to , fifteenth 	1	0.00041841004184100416
between twenty two to twenty sixth 	1	0.00041841004184100416
twenty ninth through , the second 	1	0.00041841004184100416
week of twenty fifth through , twenty ninth 	1	0.00041841004184100416
sixth and seventh of March 	1	0.00041841004184100416
February first through fifth 	1	0.00041841004184100416
the week of twenty , fifth , through the twenty ninth 	1	0.00041841004184100416
early next week 	1	0.00041841004184100416
first week of August from the second to the sixth 	1	0.00041841004184100416
Thursday , June the third 	1	0.00041841004184100416
today is the fifth 	1	0.00041841004184100416
Tuesday through Wednesday of next week 	1	0.00041841004184100416
Thursday , the second 	1	0.00041841004184100416
from the fourth to eleventh of March in nineteen ninety five 	1	0.00041841004184100416
December second 	1	0.00041841004184100416
Wednesday , the fifteenth 	1	0.00041841004184100416
Friday , the fourteenth 	1	0.00041841004184100416
tenth , Friday 	1	0.00041841004184100416
between the seventh to the tenth 	1	0.00041841004184100416
the thirtieth 	1	0.00041841004184100416
third , Wednesday 	1	0.00041841004184100416
from the third , to the fourteenth 	1	0.00041841004184100416
last full week in May 	1	0.00041841004184100416
Wednesday through Friday of that week 	1	0.00041841004184100416
last week in May 	1	0.00041841004184100416
second of June 	1	0.00041841004184100416
before the fifth 	1	0.00041841004184100416
Thursday of the third 	1	0.00041841004184100416
January , the twenty fifth 	1	0.00041841004184100416
Friday , this thirteenth 	1	0.00041841004184100416
Tuesday the second 	1	0.00041841004184100416
twenty second of Monday 	1	0.00041841004184100416
from the twenty ninth through the third 	1	0.00041841004184100416
from the twenty sixth 	1	0.00041841004184100416
from the thirtieth , until , the third 	1	0.00041841004184100416
following Wednesday , the fourth , of August 	1	0.00041841004184100416
week of the fifteenth to the nineteenth 	1	0.00041841004184100416
Wednesday all day 	1	0.00041841004184100416
Tuesday the sixteenth of March 	1	0.00041841004184100416
Wednesday , February third 	1	0.00041841004184100416
January twenty fifth 	1	0.00041841004184100416
twenty sixth of July 	1	0.00041841004184100416
Thursday the twentieth of April 	1	0.00041841004184100416
Monday , the fourteenth 	1	0.00041841004184100416
Friday the eighteenth 	1	0.00041841004184100416
from the second to the twelfth 	1	0.00041841004184100416
end of the month 	1	0.00041841004184100416
first two weeks of May 	1	0.00041841004184100416
entire day 	1	0.00041841004184100416
end of the day 	1	0.00041841004184100416
from the ninth to the sixteenth of March 	1	0.00041841004184100416
weekend afterwards 	1	0.00041841004184100416
from the nineteenth to the twenty first 	1	0.00041841004184100416
weekend in April 	1	0.00041841004184100416
two weeks earlier 	1	0.00041841004184100416
twenty seventh through the twenty ninth 	1	0.00041841004184100416
February first 	1	0.00041841004184100416
Thursday , the fourth , May 	1	0.00041841004184100416
May the fifteenth 	1	0.00041841004184100416
between twelve and three 	1	0.00041841004184100416
Thursday the first of April 	1	0.00041841004184100416
eleventh , Wednesday 	1	0.00041841004184100416
Wednesday , the eighteenth 	1	0.00041841004184100416
Wednesday the twenty seventh 	1	0.00041841004184100416
Thursday , the twelfth 	1	0.00041841004184100416
June twenty third 	1	0.00041841004184100416
Tuesday June 	1	0.00041841004184100416
June twenty seventh 	1	0.00041841004184100416
Friday the thirtieth 	1	0.00041841004184100416
Monday the second 	1	0.00041841004184100416
Wednesday the twenty first of July 	1	0.00041841004184100416
between the nineteenth and twenty first 	1	0.00041841004184100416
July twenty second 	1	0.00041841004184100416
Wednesday after the eighteenth 	1	0.00041841004184100416
seventeenth eighteenth 	1	0.00041841004184100416
at least for the first couple of days 	1	0.00041841004184100416
Tuesday the thirteenth 	1	0.00041841004184100416
Friday next week 	1	0.00041841004184100416
one of those days 	1	0.00041841004184100416
twenty first , Wednesday 	1	0.00041841004184100416
between Friday , the thirtieth and Tuesday , the third 	1	0.00041841004184100416
first week of August 	1	0.00041841004184100416
Thursday , the twenty fifth to the twenty seventh 	1	0.00041841004184100416
June the fourteenth 	1	0.00041841004184100416
the sixteenth 	1	0.00041841004184100416
next , Tuesday 	1	0.00041841004184100416
Friday the twenty second 	1	0.00041841004184100416
July twenty fourth 	1	0.00041841004184100416
Friday the fifth , of March 	1	0.00041841004184100416
Friday the fifth of March 	1	0.00041841004184100416
next week Tuesday Wednesday 	1	0.00041841004184100416
next week Tuesday through Thursday 	1	0.00041841004184100416
eighth , of March 	1	0.00041841004184100416
second last week of November 	1	0.00041841004184100416
Thursday Friday 	1	0.00041841004184100416
Saturday the twenty seventh 	1	0.00041841004184100416
Thursday through Saturday 	1	0.00041841004184100416
Saturday , December fourth 	1	0.00041841004184100416
Sunday , the twenty eighth 	1	0.00041841004184100416
next week , the first two days twenty seventh and twenty eighth 	1	0.00041841004184100416
this week , the twenty eighth 	1	0.00041841004184100416
two days that week 	1	0.00041841004184100416
Wednesday , the twenty sixth through the twenty eighth 	1	0.00041841004184100416
twenty second Friday 	1	0.00041841004184100416
month of June 	1	0.00041841004184100416
a couple days in August 	1	0.00041841004184100416
Monday the twenty 	1	0.00041841004184100416
two weeks from the second to the fifteenth 	1	0.00041841004184100416
from the thirtieth until the third of the August 	1	0.00041841004184100416
late the week of the second 	1	0.00041841004184100416
late in the week of the second 	1	0.00041841004184100416
Monday , the second 	1	0.00041841004184100416
tomorrow the tenth 	1	0.00041841004184100416
after the fifteenth 	1	0.00041841004184100416
Friday , in June 	1	0.00041841004184100416
first Friday 	1	0.00041841004184100416
seventh of this month 	1	0.00041841004184100416
after the twenty first 	1	0.00041841004184100416
first two weeks 	1	0.00041841004184100416
seventh of March 	1	0.00041841004184100416
Thursday , the ninth 	1	0.00041841004184100416
rest of the , week 	1	0.00041841004184100416
sixth of October 	1	0.00041841004184100416
fifth of October 	1	0.00041841004184100416
Monday the fourth through Wednesday the sixth 	1	0.00041841004184100416
thirtieth , of September 	1	0.00041841004184100416
Friday , the thirtieth 	1	0.00041841004184100416
week from the twenty sixth to the thirtieth 	1	0.00041841004184100416
from end of July , the thirtieth 	1	0.00041841004184100416
tenth April , 	1	0.00041841004184100416
next Monday and Tuesday 	1	0.00041841004184100416
Friday , the eleventh 	1	0.00041841004184100416
this month , after the seven , of April 	1	0.00041841004184100416
week after the seventh , April 	1	0.00041841004184100416
week after the seventh 	1	0.00041841004184100416
Tuesday , eleven 	1	0.00041841004184100416
same week 	1	0.00041841004184100416
Monday the tenth 	1	0.00041841004184100416
Friday , twenty first 	1	0.00041841004184100416
half of the month 	1	0.00041841004184100416
another day 	1	0.00041841004184100416
week of the , twenty ninth 	1	0.00041841004184100416
Tuesday , 	1	0.00041841004184100416
March the thirtieth 	1	0.00041841004184100416
eighth of October 	1	0.00041841004184100416
whole next week 	1	0.00041841004184100416
early this month 	1	0.00041841004184100416
whole month 	1	0.00041841004184100416
October , first and second 	1	0.00041841004184100416
September fifteenth 	1	0.00041841004184100416
during the month 	1	0.00041841004184100416
December fifteenth 	1	0.00041841004184100416
beginnings of the week 	1	0.00041841004184100416
after the fourteenth 	1	0.00041841004184100416
from the fourteenth to the nineteenth 	1	0.00041841004184100416
Friday the twenty twenty third 	1	0.00041841004184100416
Tuesday the twenty sixth 	1	0.00041841004184100416
rest of that week 	1	0.00041841004184100416
thirty first , Monday 	1	0.00041841004184100416
day that 	1	0.00041841004184100416
the ninth 	1	0.00041841004184100416
from the sixth , through the , seventh 	1	0.00041841004184100416
from the ninth , until Thursday the eleventh 	1	0.00041841004184100416
from Wednesday to Friday 	1	0.00041841004184100416
Wednesday , the first , day 	1	0.00041841004184100416
next Thursday the tenth 	1	0.00041841004184100416
Tuesday June first 	1	0.00041841004184100416
May , twenty seventh 	1	0.00041841004184100416
Thursday , the , third 	1	0.00041841004184100416
day after tomorrow 	1	0.00041841004184100416
June fourth 	1	0.00041841004184100416
May twenty sixth 	1	0.00041841004184100416
during the whole week 	1	0.00041841004184100416
fifth of May 	1	0.00041841004184100416
week of the twenty seventh in September 	1	0.00041841004184100416
Tuesday , the twenty eighth 	1	0.00041841004184100416
Friday , the first of October 	1	0.00041841004184100416
from the fourth to the sixth 	1	0.00041841004184100416
from the , twenty fifth through Saturday 	1	0.00041841004184100416
Monday Tuesday Wednesday 	1	0.00041841004184100416
Tuesdays through Friday 	1	0.00041841004184100416
Monday November twenty ninth 	1	0.00041841004184100416
week , of the twenty second 	1	0.00041841004184100416
Wednesday , 	1	0.00041841004184100416
Tuesday the twenty third of November 	1	0.00041841004184100416
first week of December 	1	0.00041841004184100416
Saturday December four 	1	0.00041841004184100416
Saturday , December four 	1	0.00041841004184100416
next Monday the twenty seventh 	1	0.00041841004184100416
next two 	1	0.00041841004184100416
three weeks 	1	0.00041841004184100416
twenty ninth and 	1	0.00041841004184100416
April ninth 	1	0.00041841004184100416
thirtieth of March sound 	1	0.00041841004184100416
Tuesday the four= t 	1	0.00041841004184100416
from the twelfth to the sixteenth 	1	0.00041841004184100416
twelfth to sixteenth 	1	0.00041841004184100416
from Tuesday the fourteenth 	1	0.00041841004184100416
fourteenth to sixteenth 	1	0.00041841004184100416
week before Easter 	1	0.00041841004184100416
from Monday the twenty fourth 	1	0.00041841004184100416
weekend before twenty second and twenty third 	1	0.00041841004184100416
Tuesday the fourteenth 	1	0.00041841004184100416
twenty second of April 	1	0.00041841004184100416
entire day of the fifteenth 	1	0.00041841004184100416
twenty eighth , of September 	1	0.00041841004184100416
October the second 	1	0.00041841004184100416
Saturday , the second of October 	1	0.00041841004184100416
Thursday May sixth 	1	0.00041841004184100416
from , the , second 	1	0.00041841004184100416
twenty seventh through the first 	1	0.00041841004184100416
week of the eighth 	1	0.00041841004184100416
eighth through the twelfth 	1	0.00041841004184100416
Thursday and Friday , March the ninth and tenth 	1	0.00041841004184100416
entire week 	1	0.00041841004184100416
March thirtieth 	1	0.00041841004184100416
month of August 	1	0.00041841004184100416
January the twelfth 	1	0.00041841004184100416
twenty sixth Friday 	1	0.00041841004184100416
the week of the twenty ninth 	1	0.00041841004184100416
thirtieth of , March 	1	0.00041841004184100416
Wednesday the eighth Friday the tenth Friday the seventeenth 	1	0.00041841004184100416
Wednesday the twenty second 	1	0.00041841004184100416
tenth the seventeenth 	1	0.00041841004184100416
the fifteenth 	1	0.00041841004184100416
seventh next week 	1	0.00041841004184100416
week of May fifteenth 	1	0.00041841004184100416
August tenth 	1	0.00041841004184100416
week of the sixteenth 	1	0.00041841004184100416
May fifteenth 	1	0.00041841004184100416
Friday through , next Tuesday 	1	0.00041841004184100416
August four 	1	0.00041841004184100416
August fourth 	1	0.00041841004184100416
May eighteenth 	1	0.00041841004184100416
Thursday , the eleventh 	1	0.00041841004184100416
between the eighth and the twelfth 	1	0.00041841004184100416
between the fifteenth and the nineteenth 	1	0.00041841004184100416
all day Wednesday 	1	0.00041841004184100416
April nineteenth 	1	0.00041841004184100416
last few month 	1	0.00041841004184100416
Friday , the sixteenth 	1	0.00041841004184100416
Tuesday , the twentieth of June 	1	0.00041841004184100416
from twenty one to twenty third 	1	0.00041841004184100416
whole three days 	1	0.00041841004184100416
Monday twen= sixth 	1	0.00041841004184100416
October , four five and six 	1	0.00041841004184100416
March , fourth 	1	0.00041841004184100416
Monday , the fifteen 	1	0.00041841004184100416
all day Tuesday 	1	0.00041841004184100416
from the ninth through the eleventh 	1	0.00041841004184100416
Thursday the 	1	0.00041841004184100416
Friday the nineteenth 	1	0.00041841004184100416
Tuesday the ninth 	1	0.00041841004184100416
all through Wednesday 	1	0.00041841004184100416
Tuesday of next week 	1	0.00041841004184100416
twenty second and twenty third of November 	1	0.00041841004184100416
Thursday the twenty fifth 	1	0.00041841004184100416
Tuesday , the , second 	1	0.00041841004184100416
Wednesday Thursday 	1	0.00041841004184100416
from the nineteenth , through the twenty first 	1	0.00041841004184100416
April the twenty first 	1	0.00041841004184100416
January , the twenty seventh 	1	0.00041841004184100416
February , the third 	1	0.00041841004184100416
Wednesday , the second 	1	0.00041841004184100416
Tuesday the ninth through Thursday the eleventh 	1	0.00041841004184100416
next this month 	1	0.00041841004184100416
December , Thursday 	1	0.00041841004184100416
week of the , twenty third 	1	0.00041841004184100416
the twenty fifth 	1	0.00041841004184100416
twenty fifth , of August 	1	0.00041841004184100416
year of the Lord , nineteen , ninety three 	1	0.00041841004184100416
this last week of January 	1	0.00041841004184100416
from the ninth until the twelfth 	1	0.00041841004184100416
the twentieth 	1	0.00041841004184100416
week of April tenth 	1	0.00041841004184100416
Tuesday the eleventh Wednesday the twelfth 	1	0.00041841004184100416
Thursday the thirteenth 	1	0.00041841004184100416
Friday April twenty first 	1	0.00041841004184100416
Saturday , twenty second and Sunday , twenty third 	1	0.00041841004184100416
a weekend in April 	1	0.00041841004184100416
Monday , twenty seventh to Friday , thirty first 	1	0.00041841004184100416
April eighth 	1	0.00041841004184100416
Wednesday , the twenty fourth 	1	0.00041841004184100416
from the twenty fifth 	1	0.00041841004184100416
Thursday the sixth 	1	0.00041841004184100416
seventeenth of May 	1	0.00041841004184100416
from the fourteenth through the nineteenth 	1	0.00041841004184100416
seventh today 	1	0.00041841004184100416
May twenty fourth 	1	0.00041841004184100416
April the six and the seventh 	1	0.00041841004184100416
Tuesday the eleventh 	1	0.00041841004184100416
Wednesday , the twenty seventh through Monday , the first 	1	0.00041841004184100416
June , the nineteenth 	1	0.00041841004184100416
Tuesday March the sixteenth 	1	0.00041841004184100416
twenty eight 	1	0.00041841004184100416
third , of August 	1	0.00041841004184100416
between the fourteenth and the nineteenth 	1	0.00041841004184100416
twenty , seventh 	1	0.00041841004184100416
early this week 	1	0.00041841004184100416
June three 	1	0.00041841004184100416
Monday , the twenty second 	1	0.00041841004184100416
twenty fifth to the twenty seventh 	1	0.00041841004184100416
the third 	1	0.00041841004184100416
thirtieth first 	1	0.00041841004184100416
winter holiday 	1	0.00041841004184100416
earlier in the month 	1	0.00041841004184100416
from July thirtieth , through , August third 	1	0.00041841004184100416
between the fourth and sixth of August 	1	0.00041841004184100416
fourth of August 	1	0.00041841004184100416
an extra week 	1	0.00041841004184100416
Friday , the , ninth 	1	0.00041841004184100416
next two or three weeks 	1	0.00041841004184100416
week beginning September eleventh 	1	0.00041841004184100416
Tuesday , the twelfth 	1	0.00041841004184100416
Friday , the fifteenth 	1	0.00041841004184100416
Friday fifteenth 	1	0.00041841004184100416
week starting September eighteenth 	1	0.00041841004184100416
Thursday this week 	1	0.00041841004184100416
Wednesday , July twenty eighth 	1	0.00041841004184100416
thirtieth through the third 	1	0.00041841004184100416
from the twenty fifth to the twenty seventh 	1	0.00041841004184100416
Friday , the twenty ninth of January 	1	0.00041841004184100416
August nineteen ninety three 	1	0.00041841004184100416
Tuesday , fourteenth 	1	0.00041841004184100416
twenty second , Friday 	1	0.00041841004184100416
seventh through the tenth 	1	0.00041841004184100416
first half of the week 	1	0.00041841004184100416
week of the seventeenth 	1	0.00041841004184100416
from the nineteenth until the twenty first 	1	0.00041841004184100416
Thursday of next week 	1	0.00041841004184100416
weekend before 	1	0.00041841004184100416
nineteenth twentieth 	1	0.00041841004184100416
twenty second of September , Friday 	1	0.00041841004184100416
week November of the first 	1	0.00041841004184100416
the twenty sixth 	1	0.00041841004184100416
thirteenth through eighteenth 	1	0.00041841004184100416
day after the ninth 	1	0.00041841004184100416
day before Thanksgiving 	1	0.00041841004184100416
middle of March 	1	0.00041841004184100416
week from Sunday the twelfth to Thursday , sixteenth 	1	0.00041841004184100416
Thursday , ninth to Saturday , eleventh 	1	0.00041841004184100416
Friday , tenth 	1	0.00041841004184100416
Thursday , ninth 	1	0.00041841004184100416
third of , February 	1	0.00041841004184100416
next week from the second to the sixth 	1	0.00041841004184100416
between the twenty fourth and twenty sixth 	1	0.00041841004184100416
last three days 	1	0.00041841004184100416
a couple weeks ago 	1	0.00041841004184100416
week between the eighth and the fourteenth 	1	0.00041841004184100416
end of 	1	0.00041841004184100416
any day 	1	0.00041841004184100416
this week or next 	1	0.00041841004184100416
Wednesday August the fourth 	1	0.00041841004184100416
Wednesday , October the sixth 	1	0.00041841004184100416
Thursday , the thirtieth 	1	0.00041841004184100416
September twenty seventh 	1	0.00041841004184100416
third to the sixth 	1	0.00041841004184100416
beginning of this month 	1	0.00041841004184100416
week of the fourth , of October 	1	0.00041841004184100416
Tuesday and Thursday 	1	0.00041841004184100416
Tuesday Wednesday Thursday 	1	0.00041841004184100416
the last week 	1	0.00041841004184100416
middle of the month 	1	0.00041841004184100416
the end of the month 	1	0.00041841004184100416
Tuesday , the first of June 	1	0.00041841004184100416
