MULTI-WORD_PER	count	probability
Dewitt Latimer 	4	0.13333333333333333
G R I E S 	2	0.06666666666666667
Mark Lively 	2	0.06666666666666667
W A I B E L 	2	0.06666666666666667
M O R I M O T O 	2	0.06666666666666667
C R Deville's 	2	0.06666666666666667
S L O W I G 	2	0.06666666666666667
Harold Smith 	1	0.03333333333333333
Harold Hill 	1	0.03333333333333333
Sam Helwig 	1	0.03333333333333333
Robert Devil 	1	0.03333333333333333
R E U S E 	1	0.03333333333333333
Ralph Gross 	1	0.03333333333333333
Mike Scarazzo 	1	0.03333333333333333
K L E I N S C H M I D T 	1	0.03333333333333333
Douglas Obrian 	1	0.03333333333333333
Jochen Weiss 	1	0.03333333333333333
W A H L S T E R 	1	0.03333333333333333
Darlene Thomas 	1	0.03333333333333333
Gingel Maier 	1	0.03333333333333333
D E V I L L E 	1	0.03333333333333333
