B-LOC	count	probability
London	13	0.06280193236714976
Hanover	9	0.043478260869565216
Bielefeld	7	0.033816425120772944
Hawaii	7	0.033816425120772944
two	6	0.028985507246376812
seventy	5	0.024154589371980676
Wean	5	0.024154589371980676
one	4	0.01932367149758454
Berlin	4	0.01932367149758454
Frankfurt	4	0.01932367149758454
G	4	0.01932367149758454
Bahamas	4	0.01932367149758454
Cancun	3	0.014492753623188406
eighty	3	0.014492753623188406
B	3	0.014492753623188406
S	3	0.014492753623188406
four	3	0.014492753623188406
Oakside	3	0.014492753623188406
Craig	3	0.014492753623188406
Tokyo	3	0.014492753623188406
Grand	3	0.014492753623188406
Cologne	3	0.014492753623188406
Germany	3	0.014492753623188406
Houlihan's	3	0.014492753623188406
Bonn	2	0.00966183574879227
forty	2	0.00966183574879227
Pittsburgh	2	0.00966183574879227
Menzar	2	0.00966183574879227
O	2	0.00966183574879227
Shady	2	0.00966183574879227
Philadelphia	2	0.00966183574879227
Europe	2	0.00966183574879227
Great	2	0.00966183574879227
twelve	2	0.00966183574879227
Rome	2	0.00966183574879227
Allegheny	2	0.00966183574879227
Subway	2	0.00966183574879227
Heathrow	2	0.00966183574879227
A	2	0.00966183574879227
Highlander	2	0.00966183574879227
fifty	2	0.00966183574879227
three	2	0.00966183574879227
L	2	0.00966183574879227
Bouquet	1	0.004830917874396135
Fifth	1	0.004830917874396135
Soho	1	0.004830917874396135
six	1	0.004830917874396135
Seattle	1	0.004830917874396135
Furui's	1	0.004830917874396135
Juneau	1	0.004830917874396135
Oakland	1	0.004830917874396135
Paris	1	0.004830917874396135
Flensburg	1	0.004830917874396135
Susquehanna	1	0.004830917874396135
United	1	0.004830917874396135
Sugar	1	0.004830917874396135
Detroit	1	0.004830917874396135
Maui	1	0.004830917874396135
Spaghetti	1	0.004830917874396135
bagel	1	0.004830917874396135
Cleveland	1	0.004830917874396135
Northumberland	1	0.004830917874396135
P	1	0.004830917874396135
faculty	1	0.004830917874396135
Doherty	1	0.004830917874396135
airport	1	0.004830917874396135
Herald	1	0.004830917874396135
Paradise	1	0.004830917874396135
seven	1	0.004830917874396135
Forbes	1	0.004830917874396135
Mount	1	0.004830917874396135
New	1	0.004830917874396135
Norway	1	0.004830917874396135
cafe	1	0.004830917874396135
Japan	1	0.004830917874396135
Philly	1	0.004830917874396135
fourteen	1	0.004830917874396135
Cliffside	1	0.004830917874396135
Beacon	1	0.004830917874396135
Kennywood	1	0.004830917874396135
Beehive	1	0.004830917874396135
California	1	0.004830917874396135
restaurant	1	0.004830917874396135
Columbus	1	0.004830917874396135
F	1	0.004830917874396135
Rivia	1	0.004830917874396135
Park	1	0.004830917874396135
eight	1	0.004830917874396135
Z	1	0.004830917874396135
Station	1	0.004830917874396135
the	1	0.004830917874396135
Monongahela	1	0.004830917874396135
M	1	0.004830917874396135
Avenue	1	0.004830917874396135
a	1	0.004830917874396135
five	1	0.004830917874396135
Boston	1	0.004830917874396135
Y	1	0.004830917874396135
eleven	1	0.004830917874396135
Lamont	1	0.004830917874396135
Harp	1	0.004830917874396135
sixty	1	0.004830917874396135
Denver	1	0.004830917874396135
Goehring	1	0.004830917874396135
