B-TIME	count	probability
afternoon	422	0.13547351524879614
from	378	0.12134831460674157
morning	364	0.11685393258426967
two	336	0.10786516853932585
one	182	0.058426966292134834
three	150	0.048154093097913325
nine	126	0.04044943820224719
after	117	0.03756019261637239
all	104	0.033386837881219905
ten	103	0.03306581059390048
twelve	95	0.030497592295345103
eleven	68	0.021829855537720707
noon	65	0.02086677367576244
between	55	0.01765650080256822
four	46	0.014767255216693418
a	38	0.012199036918138041
eight	37	0.01187800963081862
afternoons	32	0.010272873194221509
mornings	30	0.009630818619582664
evening	28	0.008988764044943821
five	28	0.008988764044943821
before	28	0.008988764044943821
early	27	0.008667736757624398
whole	25	0.008025682182985553
late	22	0.007062600321027288
anytime	22	0.007062600321027288
until	16	0.005136436597110754
six	15	0.004815409309791332
an	14	0.0044943820224719105
at	10	0.0032102728731942215
about	8	0.002568218298555377
the	8	0.002568218298555377
later	8	0.002568218298555377
rest	7	0.0022471910112359553
during	6	0.0019261637239165329
business	6	0.0019261637239165329
around	6	0.0019261637239165329
lunch	5	0.0016051364365971107
hours	5	0.0016051364365971107
night	5	0.0016051364365971107
evenings	4	0.0012841091492776886
any	4	0.0012841091492776886
seven	4	0.0012841091492776886
half	4	0.0012841091492776886
twenty	4	0.0012841091492776886
least	3	0.0009630818619582664
in	3	0.0009630818619582664
this	3	0.0009630818619582664
eighteenth	3	0.0009630818619582664
lunchtime	2	0.0006420545746388443
,	2	0.0006420545746388443
fourteen	2	0.0006420545746388443
couple	2	0.0006420545746388443
earlier	2	0.0006420545746388443
last	2	0.0006420545746388443
hour	1	0.00032102728731942215
end	1	0.00032102728731942215
third	1	0.00032102728731942215
P	1	0.00032102728731942215
some	1	0.00032102728731942215
few	1	0.00032102728731942215
eleven/	1	0.00032102728731942215
/noon/	1	0.00032102728731942215
tonight	1	0.00032102728731942215
day	1	0.00032102728731942215
second	1	0.00032102728731942215
tenth	1	0.00032102728731942215
hour's	1	0.00032102728731942215
that	1	0.00032102728731942215
threeish	1	0.00032102728731942215
either	1	0.00032102728731942215
another	1	0.00032102728731942215
fifteen	1	0.00032102728731942215
entire	1	0.00032102728731942215
twelve/	1	0.00032102728731942215
time	1	0.00032102728731942215
Tuesday	1	0.00032102728731942215
or	1	0.00032102728731942215
minute	1	0.00032102728731942215
