MULTI-WORD_ORG	count	probability
U C L 	11	0.36666666666666664
Yum Wok 	4	0.13333333333333333
Ali Baba's 	4	0.13333333333333333
Taco Bell 	2	0.06666666666666667
B M F T 	2	0.06666666666666667
Primanti Brothers 	2	0.06666666666666667
D A G A 	2	0.06666666666666667
Union Grill 	1	0.03333333333333333
B M T F 	1	0.03333333333333333
"""""""Fr""""""""uh"""""" """"""K""""""""olsch"""""" brewery "	1	0.03333333333333333
