-1,9191
0,9854
1,3758
2,2611
3,1537
4,1087
5,822
6,537
7,417
8,335
9,243
10,197
11,126
12,102
13,68
14,57
15,53
16,41
17,25
18,18
19,21
20,6
21,8
22,10
23,10
24,5
25,3
26,3
27,1
28,2
31,1
38,1
43,1
45,1
49,4
