-1,1031
0,18058
1,4918
2,2200
3,1182
4,898
5,524
6,336
7,323
8,191
9,181
10,135
11,115
12,118
13,110
14,85
15,86
16,95
17,137
18,88
19,39
20,39
21,42
22,33
23,22
24,20
25,21
26,17
27,12
28,13
29,23
30,12
31,6
32,7
33,11
34,3
35,4
36,5
37,3
38,1
39,2
40,5
41,1
42,1
44,1
54,1
64,1
