-1,1031
0,20154
1,4716
2,1790
3,837
4,623
5,325
6,223
7,176
8,170
9,106
10,109
11,104
12,88
13,89
14,149
15,74
16,57
17,54
18,37
19,35
20,37
21,25
22,23
23,22
24,18
25,14
26,16
27,10
28,7
29,7
30,7
31,3
32,4
33,3
34,4
35,4
36,2
37,1
49,1
52,1
