<?xml version="1.0"?>

<robot xmlns:xacro="http://ros.org/wiki/xacro">

    <!-- fichiers inclus  -->
    <xacro:include filename="$(find chroma_gazebo_models)/macros/sensors/imu_macro.xacro"/>

    <!-- IMU. -->
    <xacro:imu_macro
        robot_namespace="${namespace}"
        parent_link="${namespace}_body_link"
        name="imu"
        topic="imu"
        mass="0.015"
        freq="50.0"
        gyroscope_noise_density="0.0003394"
        gyroscope_random_walk="0.000038785"
        gyroscope_bias_correlation_time="1000.0"
        gyroscope_turn_on_bias_sigma="0.0087"
        accelerometer_noise_density="0.004"
        accelerometer_random_walk="0.006"
        accelerometer_bias_correlation_time="300.0"
        accelerometer_turn_on_bias_sigma="0.1960">
        <inertia ixx="0.00001" ixy="0.0" ixz="0.0" iyy="0.00001" iyz="0.0" izz="0.00001"/>
        <origin xyz="0 0 0" rpy="0 0 0"/>
    </xacro:imu_macro>

</robot>
