{
    "Servers": {
        "1": {
            "Name": "pdm",
            "Group": "Servers",
            "Host": "postgres",
            "Port": 5432,
            "MaintenanceDB": "postgres",
            "Username": "test",
            "SSLMode": "disable",
            "SSLCompression": 0,
            "Timeout": 0,
            "UseSSHTunnel": 0,
            "TunnelPort": "22",
            "TunnelAuthentication": 0
        }
    }
}
