 DRUGBANK::ddi-interactor-in::Compound:Compound(Compound::DB00227,Compound::DB01118) AND Hetionet::CbG::Compound:Gene(Compound::DB01118,Gene::10280) AND bioarx::Covid2_acc_host_gene::Disease:Gene(Disease::SARS-CoV2-nsp6,Gene::10280)=>Merged:Treatment(Compound::DB00227,Disease::SARS-CoV2-nsp6)	0.156
 DRUGBANK::ddi-interactor-in::Compound:Compound(Compound::DB00227,Compound::DB01118) AND bioarx::DrugHumGen:Compound:Gene(Compound::DB01118,Gene::10280) AND bioarx::Covid2_acc_host_gene::Disease:Gene(Disease::SARS-CoV2-nsp6,Gene::10280)=>Merged:Treatment(Compound::DB00227,Disease::SARS-CoV2-nsp6)	0.2145
 DRUGBANK::ddi-interactor-in::Compound:Compound(Compound::DB00227,Compound::DB00956) AND DRUGBANK::target::Compound:Gene(Compound::DB00956,Gene::10280) AND bioarx::Covid2_acc_host_gene::Disease:Gene(Disease::SARS-CoV2-nsp6,Gene::10280)=>Merged:Treatment(Compound::DB00227,Disease::SARS-CoV2-nsp6)	0.182
 DRUGBANK::ddi-interactor-in::Compound:Compound(Compound::DB00227,Compound::DB01242) AND bioarx::DrugHumGen:Compound:Gene(Compound::DB01242,Gene::10280) AND bioarx::Covid2_acc_host_gene::Disease:Gene(Disease::SARS-CoV2-nsp6,Gene::10280)=>Merged:Treatment(Compound::DB00227,Disease::SARS-CoV2-nsp6)	0.2145
 DRUGBANK::ddi-interactor-in::Compound:Compound(Compound::DB00227,Compound::DB00598) AND bioarx::DrugHumGen:Compound:Gene(Compound::DB00598,Gene::10280) AND bioarx::Covid2_acc_host_gene::Disease:Gene(Disease::SARS-CoV2-nsp6,Gene::10280)=>Merged:Treatment(Compound::DB00227,Disease::SARS-CoV2-nsp6)	0.2145
 DRUGBANK::ddi-interactor-in::Compound:Compound(Compound::DB00227,Compound::DB00409) AND Hetionet::CbG::Compound:Gene(Compound::DB00409,Gene::10280) AND bioarx::Covid2_acc_host_gene::Disease:Gene(Disease::SARS-CoV2-nsp6,Gene::10280)=>Merged:Treatment(Compound::DB00227,Disease::SARS-CoV2-nsp6)	0.156
 DRUGBANK::ddi-interactor-in::Compound:Compound(Compound::DB00227,Compound::DB00409) AND bioarx::DrugHumGen:Compound:Gene(Compound::DB00409,Gene::10280) AND bioarx::Covid2_acc_host_gene::Disease:Gene(Disease::SARS-CoV2-nsp6,Gene::10280)=>Merged:Treatment(Compound::DB00227,Disease::SARS-CoV2-nsp6)	0.2145
 DRUGBANK::ddi-interactor-in::Compound:Compound(Compound::DB00227,Compound::DB00409) AND DRUGBANK::target::Compound:Gene(Compound::DB00409,Gene::10280) AND bioarx::Covid2_acc_host_gene::Disease:Gene(Disease::SARS-CoV2-nsp6,Gene::10280)=>Merged:Treatment(Compound::DB00227,Disease::SARS-CoV2-nsp6)	0.182
 DRUGBANK::ddi-interactor-in::Compound:Compound(Compound::DB00208,Compound::DB00227) AND bioarx::DrugHumGen:Compound:Gene(Compound::DB00208,Gene::10280) AND bioarx::Covid2_acc_host_gene::Disease:Gene(Disease::SARS-CoV2-nsp6,Gene::10280)=>Merged:Treatment(Compound::DB00227,Disease::SARS-CoV2-nsp6)	0.104
 DRUGBANK::ddi-interactor-in::Compound:Compound(Compound::DB00227,Compound::DB00321) AND Hetionet::CbG::Compound:Gene(Compound::DB00321,Gene::10280) AND bioarx::Covid2_acc_host_gene::Disease:Gene(Disease::SARS-CoV2-nsp6,Gene::10280)=>Merged:Treatment(Compound::DB00227,Disease::SARS-CoV2-nsp6)	0.156
 DRUGBANK::ddi-interactor-in::Compound:Compound(Compound::DB00227,Compound::DB00321) AND bioarx::DrugHumGen:Compound:Gene(Compound::DB00321,Gene::10280) AND bioarx::Covid2_acc_host_gene::Disease:Gene(Disease::SARS-CoV2-nsp6,Gene::10280)=>Merged:Treatment(Compound::DB00227,Disease::SARS-CoV2-nsp6)	0.2145
 DRUGBANK::ddi-interactor-in::Compound:Compound(Compound::DB00227,Compound::DB00321) AND DRUGBANK::target::Compound:Gene(Compound::DB00321,Gene::10280) AND bioarx::Covid2_acc_host_gene::Disease:Gene(Disease::SARS-CoV2-nsp6,Gene::10280)=>Merged:Treatment(Compound::DB00227,Disease::SARS-CoV2-nsp6)	0.182
 DRUGBANK::ddi-interactor-in::Compound:Compound(Compound::DB00227,Compound::DB00420) AND bioarx::DrugHumGen:Compound:Gene(Compound::DB00420,Gene::10280) AND bioarx::Covid2_acc_host_gene::Disease:Gene(Disease::SARS-CoV2-nsp6,Gene::10280)=>Merged:Treatment(Compound::DB00227,Disease::SARS-CoV2-nsp6)	0.2145
 DRUGBANK::ddi-interactor-in::Compound:Compound(Compound::DB00227,Compound::DB00490) AND bioarx::DrugHumGen:Compound:Gene(Compound::DB00490,Gene::10280) AND bioarx::Covid2_acc_host_gene::Disease:Gene(Disease::SARS-CoV2-nsp6,Gene::10280)=>Merged:Treatment(Compound::DB00227,Disease::SARS-CoV2-nsp6)	0.2145
 DRUGBANK::ddi-interactor-in::Compound:Compound(Compound::DB00227,Compound::DB00245) AND bioarx::DrugHumGen:Compound:Gene(Compound::DB00245,Gene::10280) AND bioarx::Covid2_acc_host_gene::Disease:Gene(Disease::SARS-CoV2-nsp6,Gene::10280)=>Merged:Treatment(Compound::DB00227,Disease::SARS-CoV2-nsp6)	0.2145
 DRUGBANK::ddi-interactor-in::Compound:Compound(Compound::DB00227,Compound::DB01069) AND bioarx::DrugHumGen:Compound:Gene(Compound::DB01069,Gene::10280) AND bioarx::Covid2_acc_host_gene::Disease:Gene(Disease::SARS-CoV2-nsp6,Gene::10280)=>Merged:Treatment(Compound::DB00227,Disease::SARS-CoV2-nsp6)	0.2145
 DRUGBANK::ddi-interactor-in::Compound:Compound(Compound::DB00227,Compound::DB01224) AND bioarx::DrugHumGen:Compound:Gene(Compound::DB01224,Gene::10280) AND bioarx::Covid2_acc_host_gene::Disease:Gene(Disease::SARS-CoV2-nsp6,Gene::10280)=>Merged:Treatment(Compound::DB00227,Disease::SARS-CoV2-nsp6)	0.2145
 DRUGBANK::ddi-interactor-in::Compound:Compound(Compound::DB00227,Compound::DB00477) AND bioarx::DrugHumGen:Compound:Gene(Compound::DB00477,Gene::10280) AND bioarx::Covid2_acc_host_gene::Disease:Gene(Disease::SARS-CoV2-nsp6,Gene::10280)=>Merged:Treatment(Compound::DB00227,Disease::SARS-CoV2-nsp6)	0.2145
 DRUGBANK::ddi-interactor-in::Compound:Compound(Compound::DB00227,Compound::DB00836) AND bioarx::DrugHumGen:Compound:Gene(Compound::DB00836,Gene::10280) AND bioarx::Covid2_acc_host_gene::Disease:Gene(Disease::SARS-CoV2-nsp6,Gene::10280)=>Merged:Treatment(Compound::DB00227,Disease::SARS-CoV2-nsp6)	0.2145
 DRUGBANK::ddi-interactor-in::Compound:Compound(Compound::DB00227,Compound::DB00433) AND bioarx::DrugHumGen:Compound:Gene(Compound::DB00433,Gene::10280) AND bioarx::Covid2_acc_host_gene::Disease:Gene(Disease::SARS-CoV2-nsp6,Gene::10280)=>Merged:Treatment(Compound::DB00227,Disease::SARS-CoV2-nsp6)	0.2145
 DRUGBANK::ddi-interactor-in::Compound:Compound(Compound::DB00227,Compound::DB00502) AND Hetionet::CbG::Compound:Gene(Compound::DB00502,Gene::10280) AND bioarx::Covid2_acc_host_gene::Disease:Gene(Disease::SARS-CoV2-nsp6,Gene::10280)=>Merged:Treatment(Compound::DB00227,Disease::SARS-CoV2-nsp6)	0.156
 DRUGBANK::ddi-interactor-in::Compound:Compound(Compound::DB00227,Compound::DB00502) AND bioarx::DrugHumGen:Compound:Gene(Compound::DB00502,Gene::10280) AND bioarx::Covid2_acc_host_gene::Disease:Gene(Disease::SARS-CoV2-nsp6,Gene::10280)=>Merged:Treatment(Compound::DB00227,Disease::SARS-CoV2-nsp6)	0.2145
 DRUGBANK::ddi-interactor-in::Compound:Compound(Compound::DB00227,Compound::DB00502) AND DRUGBANK::target::Compound:Gene(Compound::DB00502,Gene::10280) AND bioarx::Covid2_acc_host_gene::Disease:Gene(Disease::SARS-CoV2-nsp6,Gene::10280)=>Merged:Treatment(Compound::DB00227,Disease::SARS-CoV2-nsp6)	0.182
 DRUGBANK::ddi-interactor-in::Compound:Compound(Compound::DB00227,Compound::DB00875) AND bioarx::DrugHumGen:Compound:Gene(Compound::DB00875,Gene::10280) AND bioarx::Covid2_acc_host_gene::Disease:Gene(Disease::SARS-CoV2-nsp6,Gene::10280)=>Merged:Treatment(Compound::DB00227,Disease::SARS-CoV2-nsp6)	0.2145
 DRUGBANK::ddi-interactor-in::Compound:Compound(Compound::DB00227,Compound::DB00783) AND Hetionet::CuG::Compound:Gene(Compound::DB00783,Gene::537) AND bioarx::Covid2_acc_host_gene::Disease:Gene(Disease::SARS-CoV2-nsp6,Gene::537)=>Merged:Treatment(Compound::DB00227,Disease::SARS-CoV2-nsp6)	0.221
 DRUGBANK::ddi-interactor-in::Compound:Compound(Compound::DB00227,Compound::DB00247) AND Hetionet::CbG::Compound:Gene(Compound::DB00247,Gene::10280) AND bioarx::Covid2_acc_host_gene::Disease:Gene(Disease::SARS-CoV2-nsp6,Gene::10280)=>Merged:Treatment(Compound::DB00227,Disease::SARS-CoV2-nsp6)	0.156
 DRUGBANK::ddi-interactor-in::Compound:Compound(Compound::DB00227,Compound::DB00675) AND Hetionet::CbG::Compound:Gene(Compound::DB00675,Gene::10280) AND bioarx::Covid2_acc_host_gene::Disease:Gene(Disease::SARS-CoV2-nsp6,Gene::10280)=>Merged:Treatment(Compound::DB00227,Disease::SARS-CoV2-nsp6)	0.156
 DRUGBANK::ddi-interactor-in::Compound:Compound(Compound::DB00227,Compound::DB01191) AND bioarx::DrugHumGen:Compound:Gene(Compound::DB01191,Gene::10280) AND bioarx::Covid2_acc_host_gene::Disease:Gene(Disease::SARS-CoV2-nsp6,Gene::10280)=>Merged:Treatment(Compound::DB00227,Disease::SARS-CoV2-nsp6)	0.2145
 DRUGBANK::ddi-interactor-in::Compound:Compound(Compound::DB00176,Compound::DB00227) AND Hetionet::CbG::Compound:Gene(Compound::DB00176,Gene::10280) AND bioarx::Covid2_acc_host_gene::Disease:Gene(Disease::SARS-CoV2-nsp6,Gene::10280)=>Merged:Treatment(Compound::DB00227,Disease::SARS-CoV2-nsp6)	0.1105
 DRUGBANK::ddi-interactor-in::Compound:Compound(Compound::DB00176,Compound::DB00227) AND bioarx::DrugHumGen:Compound:Gene(Compound::DB00176,Gene::10280) AND bioarx::Covid2_acc_host_gene::Disease:Gene(Disease::SARS-CoV2-nsp6,Gene::10280)=>Merged:Treatment(Compound::DB00227,Disease::SARS-CoV2-nsp6)	0.104
 DRUGBANK::ddi-interactor-in::Compound:Compound(Compound::DB00227,Compound::DB01104) AND Hetionet::CbG::Compound:Gene(Compound::DB01104,Gene::10280) AND bioarx::Covid2_acc_host_gene::Disease:Gene(Disease::SARS-CoV2-nsp6,Gene::10280)=>Merged:Treatment(Compound::DB00227,Disease::SARS-CoV2-nsp6)	0.156
 DRUGBANK::ddi-interactor-in::Compound:Compound(Compound::DB00227,Compound::DB01104) AND bioarx::DrugHumGen:Compound:Gene(Compound::DB01104,Gene::10280) AND bioarx::Covid2_acc_host_gene::Disease:Gene(Disease::SARS-CoV2-nsp6,Gene::10280)=>Merged:Treatment(Compound::DB00227,Disease::SARS-CoV2-nsp6)	0.2145
 DRUGBANK::ddi-interactor-in::Compound:Compound(Compound::DB00227,Compound::DB00367) AND Hetionet::CdG::Compound:Gene(Compound::DB00367,Gene::10280) AND bioarx::Covid2_acc_host_gene::Disease:Gene(Disease::SARS-CoV2-nsp6,Gene::10280)=>Merged:Treatment(Compound::DB00227,Disease::SARS-CoV2-nsp6)	0.1625
 DRUGBANK::ddi-interactor-in::Compound:Compound(Compound::DB00227,Compound::DB00652) AND Hetionet::CbG::Compound:Gene(Compound::DB00652,Gene::10280) AND bioarx::Covid2_acc_host_gene::Disease:Gene(Disease::SARS-CoV2-nsp6,Gene::10280)=>Merged:Treatment(Compound::DB00227,Disease::SARS-CoV2-nsp6)	0.156
 DRUGBANK::ddi-interactor-in::Compound:Compound(Compound::DB00227,Compound::DB00652) AND DRUGBANK::target::Compound:Gene(Compound::DB00652,Gene::10280) AND bioarx::Covid2_acc_host_gene::Disease:Gene(Disease::SARS-CoV2-nsp6,Gene::10280)=>Merged:Treatment(Compound::DB00227,Disease::SARS-CoV2-nsp6)	0.182
 DRUGBANK::ddi-interactor-in::Compound:Compound(Compound::DB00227,Compound::DB00843) AND Hetionet::CbG::Compound:Gene(Compound::DB00843,Gene::10280) AND bioarx::Covid2_acc_host_gene::Disease:Gene(Disease::SARS-CoV2-nsp6,Gene::10280)=>Merged:Treatment(Compound::DB00227,Disease::SARS-CoV2-nsp6)	0.156
 DRUGBANK::ddi-interactor-in::Compound:Compound(Compound::DB00227,Compound::DB00843) AND bioarx::DrugHumGen:Compound:Gene(Compound::DB00843,Gene::10280) AND bioarx::Covid2_acc_host_gene::Disease:Gene(Disease::SARS-CoV2-nsp6,Gene::10280)=>Merged:Treatment(Compound::DB00227,Disease::SARS-CoV2-nsp6)	0.2145
 DRUGBANK::ddi-interactor-in::Compound:Compound(Compound::DB00227,Compound::DB00907) AND bioarx::DrugHumGen:Compound:Gene(Compound::DB00907,Gene::10280) AND bioarx::Covid2_acc_host_gene::Disease:Gene(Disease::SARS-CoV2-nsp6,Gene::10280)=>Merged:Treatment(Compound::DB00227,Disease::SARS-CoV2-nsp6)	0.2145
 DRUGBANK::ddi-interactor-in::Compound:Compound(Compound::DB00227,Compound::DB00907) AND DRUGBANK::target::Compound:Gene(Compound::DB00907,Gene::10280) AND bioarx::Covid2_acc_host_gene::Disease:Gene(Disease::SARS-CoV2-nsp6,Gene::10280)=>Merged:Treatment(Compound::DB00227,Disease::SARS-CoV2-nsp6)	0.182
 DRUGBANK::ddi-interactor-in::Compound:Compound(Compound::DB00227,Compound::DB00882) AND Hetionet::CbG::Compound:Gene(Compound::DB00882,Gene::10280) AND bioarx::Covid2_acc_host_gene::Disease:Gene(Disease::SARS-CoV2-nsp6,Gene::10280)=>Merged:Treatment(Compound::DB00227,Disease::SARS-CoV2-nsp6)	0.156
 DRUGBANK::ddi-interactor-in::Compound:Compound(Compound::DB00227,Compound::DB00857) AND bioarx::DrugHumGen:Compound:Gene(Compound::DB00857,Gene::10280) AND bioarx::Covid2_acc_host_gene::Disease:Gene(Disease::SARS-CoV2-nsp6,Gene::10280)=>Merged:Treatment(Compound::DB00227,Disease::SARS-CoV2-nsp6)	0.2145
 DRUGBANK::ddi-interactor-in::Compound:Compound(Compound::DB00227,Compound::DB06174) AND DRUGBANK::target::Compound:Gene(Compound::DB06174,Gene::10280) AND bioarx::Covid2_acc_host_gene::Disease:Gene(Disease::SARS-CoV2-nsp6,Gene::10280)=>Merged:Treatment(Compound::DB00227,Disease::SARS-CoV2-nsp6)	0.182
 DRUGBANK::ddi-interactor-in::Compound:Compound(Compound::DB00227,Compound::DB00514) AND Hetionet::CbG::Compound:Gene(Compound::DB00514,Gene::10280) AND bioarx::Covid2_acc_host_gene::Disease:Gene(Disease::SARS-CoV2-nsp6,Gene::10280)=>Merged:Treatment(Compound::DB00227,Disease::SARS-CoV2-nsp6)	0.156
 DRUGBANK::ddi-interactor-in::Compound:Compound(Compound::DB00227,Compound::DB00514) AND DRUGBANK::target::Compound:Gene(Compound::DB00514,Gene::10280) AND bioarx::Covid2_acc_host_gene::Disease:Gene(Disease::SARS-CoV2-nsp6,Gene::10280)=>Merged:Treatment(Compound::DB00227,Disease::SARS-CoV2-nsp6)	0.182
 DRUGBANK::ddi-interactor-in::Compound:Compound(Compound::DB00227,Compound::DB00396) AND Hetionet::CbG::Compound:Gene(Compound::DB00396,Gene::10280) AND bioarx::Covid2_acc_host_gene::Disease:Gene(Disease::SARS-CoV2-nsp6,Gene::10280)=>Merged:Treatment(Compound::DB00227,Disease::SARS-CoV2-nsp6)	0.156
 DRUGBANK::ddi-interactor-in::Compound:Compound(Compound::DB00227,Compound::DB00396) AND bioarx::DrugHumGen:Compound:Gene(Compound::DB00396,Gene::10280) AND bioarx::Covid2_acc_host_gene::Disease:Gene(Disease::SARS-CoV2-nsp6,Gene::10280)=>Merged:Treatment(Compound::DB00227,Disease::SARS-CoV2-nsp6)	0.2145
 DRUGBANK::ddi-interactor-in::Compound:Compound(Compound::DB00227,Compound::DB00679) AND bioarx::DrugHumGen:Compound:Gene(Compound::DB00679,Gene::10280) AND bioarx::Covid2_acc_host_gene::Disease:Gene(Disease::SARS-CoV2-nsp6,Gene::10280)=>Merged:Treatment(Compound::DB00227,Disease::SARS-CoV2-nsp6)	0.2145
 DRUGBANK::ddi-interactor-in::Compound:Compound(Compound::DB00227,Compound::DB04946) AND bioarx::DrugHumGen:Compound:Gene(Compound::DB04946,Gene::10280) AND bioarx::Covid2_acc_host_gene::Disease:Gene(Disease::SARS-CoV2-nsp6,Gene::10280)=>Merged:Treatment(Compound::DB00227,Disease::SARS-CoV2-nsp6)	0.2145
 DRUGBANK::ddi-interactor-in::Compound:Compound(Compound::DB00227,Compound::DB04946) AND Hetionet::CbG::Compound:Gene(Compound::DB04946,Gene::10280) AND bioarx::Covid2_acc_host_gene::Disease:Gene(Disease::SARS-CoV2-nsp6,Gene::10280)=>Merged:Treatment(Compound::DB00227,Disease::SARS-CoV2-nsp6)	0.156
 DRUGBANK::ddi-interactor-in::Compound:Compound(Compound::DB00227,Compound::DB04946) AND Hetionet::CbG::Compound:Gene(Gene::10280,Compound::DB04946) AND bioarx::Covid2_acc_host_gene::Disease:Gene(Disease::SARS-CoV2-nsp6,Gene::10280)=>Merged:Treatment(Compound::DB00227,Disease::SARS-CoV2-nsp6)	0.104
 DRUGBANK::ddi-interactor-in::Compound:Compound(Compound::DB00227,Compound::DB00472) AND Hetionet::CbG::Compound:Gene(Compound::DB00472,Gene::10280) AND bioarx::Covid2_acc_host_gene::Disease:Gene(Disease::SARS-CoV2-nsp6,Gene::10280)=>Merged:Treatment(Compound::DB00227,Disease::SARS-CoV2-nsp6)	0.156
 DRUGBANK::ddi-interactor-in::Compound:Compound(Compound::DB00227,Compound::DB00472) AND bioarx::DrugHumGen:Compound:Gene(Compound::DB00472,Gene::10280) AND bioarx::Covid2_acc_host_gene::Disease:Gene(Disease::SARS-CoV2-nsp6,Gene::10280)=>Merged:Treatment(Compound::DB00227,Disease::SARS-CoV2-nsp6)	0.2145
 DRUGBANK::ddi-interactor-in::Compound:Compound(Compound::DB00227,Compound::DB00481) AND Hetionet::CbG::Compound:Gene(Compound::DB00481,Gene::10280) AND bioarx::Covid2_acc_host_gene::Disease:Gene(Disease::SARS-CoV2-nsp6,Gene::10280)=>Merged:Treatment(Compound::DB00227,Disease::SARS-CoV2-nsp6)	0.156
 DRUGBANK::ddi-interactor-in::Compound:Compound(Compound::DB00227,Compound::DB00481) AND bioarx::DrugHumGen:Compound:Gene(Compound::DB00481,Gene::10280) AND bioarx::Covid2_acc_host_gene::Disease:Gene(Disease::SARS-CoV2-nsp6,Gene::10280)=>Merged:Treatment(Compound::DB00227,Disease::SARS-CoV2-nsp6)	0.2145
 DRUGBANK::ddi-interactor-in::Compound:Compound(Compound::DB00227,Compound::DB04841) AND bioarx::DrugHumGen:Compound:Gene(Compound::DB04841,Gene::10280) AND bioarx::Covid2_acc_host_gene::Disease:Gene(Disease::SARS-CoV2-nsp6,Gene::10280)=>Merged:Treatment(Compound::DB00227,Disease::SARS-CoV2-nsp6)	0.2145
 Hetionet::CdG::Compound:Gene(Compound::DB00227,Gene::3491) AND Hetionet::Gr>G::Gene:Gene(Gene::10632,Gene::3491) AND bioarx::Covid2_acc_host_gene::Disease:Gene(Disease::SARS-CoV2-nsp6,Gene::10632)=>Merged:Treatment(Compound::DB00227,Disease::SARS-CoV2-nsp6)	0.1495
 Hetionet::CdG::Compound:Gene(Compound::DB00227,Gene::332) AND Hetionet::Gr>G::Gene:Gene(Gene::537,Gene::332) AND bioarx::Covid2_acc_host_gene::Disease:Gene(Disease::SARS-CoV2-nsp6,Gene::537)=>Merged:Treatment(Compound::DB00227,Disease::SARS-CoV2-nsp6)	0.1495
 Hetionet::CdG::Compound:Gene(Compound::DB00227,Gene::991) AND Hetionet::Gr>G::Gene:Gene(Gene::537,Gene::991) AND bioarx::Covid2_acc_host_gene::Disease:Gene(Disease::SARS-CoV2-nsp6,Gene::537)=>Merged:Treatment(Compound::DB00227,Disease::SARS-CoV2-nsp6)	0.1495
 Hetionet::CdG::Compound:Gene(Compound::DB00227,Gene::1503) AND Hetionet::Gr>G::Gene:Gene(Gene::537,Gene::1503) AND bioarx::Covid2_acc_host_gene::Disease:Gene(Disease::SARS-CoV2-nsp6,Gene::537)=>Merged:Treatment(Compound::DB00227,Disease::SARS-CoV2-nsp6)	0.1495
 Hetionet::CdG::Compound:Gene(Compound::DB00227,Gene::23378) AND Hetionet::Gr>G::Gene:Gene(Gene::10632,Gene::23378) AND bioarx::Covid2_acc_host_gene::Disease:Gene(Disease::SARS-CoV2-nsp6,Gene::10632)=>Merged:Treatment(Compound::DB00227,Disease::SARS-CoV2-nsp6)	0.1495
 Hetionet::CdG::Compound:Gene(Compound::DB00227,Gene::8520) AND Hetionet::Gr>G::Gene:Gene(Gene::537,Gene::8520) AND bioarx::Covid2_acc_host_gene::Disease:Gene(Disease::SARS-CoV2-nsp6,Gene::537)=>Merged:Treatment(Compound::DB00227,Disease::SARS-CoV2-nsp6)	0.1495
 Hetionet::CdG::Compound:Gene(Compound::DB00227,Gene::51116) AND Hetionet::Gr>G::Gene:Gene(Gene::537,Gene::51116) AND bioarx::Covid2_acc_host_gene::Disease:Gene(Disease::SARS-CoV2-nsp6,Gene::537)=>Merged:Treatment(Compound::DB00227,Disease::SARS-CoV2-nsp6)	0.1495
 Hetionet::CdG::Compound:Gene(Compound::DB00227,Gene::142) AND Hetionet::Gr>G::Gene:Gene(Gene::537,Gene::142) AND bioarx::Covid2_acc_host_gene::Disease:Gene(Disease::SARS-CoV2-nsp6,Gene::537)=>Merged:Treatment(Compound::DB00227,Disease::SARS-CoV2-nsp6)	0.1495
 Hetionet::CdG::Compound:Gene(Compound::DB00227,Gene::2037) AND Hetionet::Gr>G::Gene:Gene(Gene::537,Gene::2037) AND bioarx::Covid2_acc_host_gene::Disease:Gene(Disease::SARS-CoV2-nsp6,Gene::537)=>Merged:Treatment(Compound::DB00227,Disease::SARS-CoV2-nsp6)	0.1495
 Hetionet::CdG::Compound:Gene(Compound::DB00227,Gene::79902) AND Hetionet::Gr>G::Gene:Gene(Gene::537,Gene::79902) AND bioarx::Covid2_acc_host_gene::Disease:Gene(Disease::SARS-CoV2-nsp6,Gene::537)=>Merged:Treatment(Compound::DB00227,Disease::SARS-CoV2-nsp6)	0.1495
 Hetionet::CdG::Compound:Gene(Compound::DB00227,Gene::595) AND Hetionet::Gr>G::Gene:Gene(Gene::537,Gene::595) AND bioarx::Covid2_acc_host_gene::Disease:Gene(Disease::SARS-CoV2-nsp6,Gene::537)=>Merged:Treatment(Compound::DB00227,Disease::SARS-CoV2-nsp6)	0.1495
 Hetionet::CdG::Compound:Gene(Compound::DB00227,Gene::7866) AND Hetionet::Gr>G::Gene:Gene(Gene::537,Gene::7866) AND bioarx::Covid2_acc_host_gene::Disease:Gene(Disease::SARS-CoV2-nsp6,Gene::537)=>Merged:Treatment(Compound::DB00227,Disease::SARS-CoV2-nsp6)	0.1495
 Hetionet::CdG::Compound:Gene(Compound::DB00227,Gene::10112) AND Hetionet::Gr>G::Gene:Gene(Gene::10632,Gene::10112) AND bioarx::Covid2_acc_host_gene::Disease:Gene(Disease::SARS-CoV2-nsp6,Gene::10632)=>Merged:Treatment(Compound::DB00227,Disease::SARS-CoV2-nsp6)	0.1495
 Hetionet::CdG::Compound:Gene(Compound::DB00227,Gene::79073) AND Hetionet::Gr>G::Gene:Gene(Gene::537,Gene::79073) AND bioarx::Covid2_acc_host_gene::Disease:Gene(Disease::SARS-CoV2-nsp6,Gene::537)=>Merged:Treatment(Compound::DB00227,Disease::SARS-CoV2-nsp6)	0.1495
 Hetionet::CdG::Compound:Gene(Compound::DB00227,Gene::2274) AND Hetionet::Gr>G::Gene:Gene(Gene::10632,Gene::2274) AND bioarx::Covid2_acc_host_gene::Disease:Gene(Disease::SARS-CoV2-nsp6,Gene::10632)=>Merged:Treatment(Compound::DB00227,Disease::SARS-CoV2-nsp6)	0.1495
 Hetionet::CdG::Compound:Gene(Compound::DB00227,Gene::5111) AND Hetionet::Gr>G::Gene:Gene(Gene::10632,Gene::5111) AND bioarx::Covid2_acc_host_gene::Disease:Gene(Disease::SARS-CoV2-nsp6,Gene::10632)=>Merged:Treatment(Compound::DB00227,Disease::SARS-CoV2-nsp6)	0.1495
 Hetionet::CdG::Compound:Gene(Compound::DB00227,Gene::5111) AND Hetionet::Gr>G::Gene:Gene(Gene::537,Gene::5111) AND bioarx::Covid2_acc_host_gene::Disease:Gene(Disease::SARS-CoV2-nsp6,Gene::537)=>Merged:Treatment(Compound::DB00227,Disease::SARS-CoV2-nsp6)	0.1495
 Hetionet::CdG::Compound:Gene(Compound::DB00227,Gene::4172) AND Hetionet::Gr>G::Gene:Gene(Gene::10632,Gene::4172) AND bioarx::Covid2_acc_host_gene::Disease:Gene(Disease::SARS-CoV2-nsp6,Gene::10632)=>Merged:Treatment(Compound::DB00227,Disease::SARS-CoV2-nsp6)	0.1495
 Hetionet::CdG::Compound:Gene(Compound::DB00227,Gene::4830) AND Hetionet::Gr>G::Gene:Gene(Gene::537,Gene::4830) AND bioarx::Covid2_acc_host_gene::Disease:Gene(Disease::SARS-CoV2-nsp6,Gene::537)=>Merged:Treatment(Compound::DB00227,Disease::SARS-CoV2-nsp6)	0.1495
 Hetionet::CdG::Compound:Gene(Compound::DB00227,Gene::54205) AND Hetionet::Gr>G::Gene:Gene(Gene::537,Gene::54205) AND bioarx::Covid2_acc_host_gene::Disease:Gene(Disease::SARS-CoV2-nsp6,Gene::537)=>Merged:Treatment(Compound::DB00227,Disease::SARS-CoV2-nsp6)	0.1495
 Hetionet::CdG::Compound:Gene(Compound::DB00227,Gene::23636) AND Hetionet::Gr>G::Gene:Gene(Gene::537,Gene::23636) AND bioarx::Covid2_acc_host_gene::Disease:Gene(Disease::SARS-CoV2-nsp6,Gene::537)=>Merged:Treatment(Compound::DB00227,Disease::SARS-CoV2-nsp6)	0.1495
 Hetionet::CuG::Compound:Gene(Compound::DB00227,Gene::55793) AND Hetionet::Gr>G::Gene:Gene(Gene::10632,Gene::55793) AND bioarx::Covid2_acc_host_gene::Disease:Gene(Disease::SARS-CoV2-nsp6,Gene::10632)=>Merged:Treatment(Compound::DB00227,Disease::SARS-CoV2-nsp6)	0.143
 Hetionet::CuG::Compound:Gene(Compound::DB00227,Gene::994) AND Hetionet::Gr>G::Gene:Gene(Gene::537,Gene::994) AND bioarx::Covid2_acc_host_gene::Disease:Gene(Disease::SARS-CoV2-nsp6,Gene::537)=>Merged:Treatment(Compound::DB00227,Disease::SARS-CoV2-nsp6)	0.143
 Hetionet::CuG::Compound:Gene(Compound::DB00227,Gene::10057) AND Hetionet::Gr>G::Gene:Gene(Gene::10632,Gene::10057) AND bioarx::Covid2_acc_host_gene::Disease:Gene(Disease::SARS-CoV2-nsp6,Gene::10632)=>Merged:Treatment(Compound::DB00227,Disease::SARS-CoV2-nsp6)	0.143
 Hetionet::CuG::Compound:Gene(Compound::DB00227,Gene::10057) AND Hetionet::Gr>G::Gene:Gene(Gene::537,Gene::10057) AND bioarx::Covid2_acc_host_gene::Disease:Gene(Disease::SARS-CoV2-nsp6,Gene::537)=>Merged:Treatment(Compound::DB00227,Disease::SARS-CoV2-nsp6)	0.143
 Hetionet::CuG::Compound:Gene(Compound::DB00227,Gene::7494) AND Hetionet::Gr>G::Gene:Gene(Gene::537,Gene::7494) AND bioarx::Covid2_acc_host_gene::Disease:Gene(Disease::SARS-CoV2-nsp6,Gene::537)=>Merged:Treatment(Compound::DB00227,Disease::SARS-CoV2-nsp6)	0.143
 DRUGBANK::ddi-interactor-in::Compound:Compound(Compound::DB00227,Compound::DB00704) AND DRUGBANK::target::Compound:Gene(Compound::DB00704,Gene::10280) AND bioarx::Covid2_acc_host_gene::Disease:Gene(Disease::SARS-CoV2-nsp6,Gene::10280)=>Merged:Treatment(Compound::DB00227,Disease::SARS-CoV2-nsp6)	0.182
 DRUGBANK::ddi-interactor-in::Compound:Compound(Compound::DB00227,Compound::DB13679) AND bioarx::DrugHumGen:Compound:Gene(Compound::DB13679,Gene::10280) AND bioarx::Covid2_acc_host_gene::Disease:Gene(Disease::SARS-CoV2-nsp6,Gene::10280)=>Merged:Treatment(Compound::DB00227,Disease::SARS-CoV2-nsp6)	0.2145
 Hetionet::CdG::Compound:Gene(Compound::DB00227,Gene::10969) AND Hetionet::Gr>G::Gene:Gene(Gene::537,Gene::10969) AND bioarx::Covid2_acc_host_gene::Disease:Gene(Disease::SARS-CoV2-nsp6,Gene::537)=>Merged:Treatment(Compound::DB00227,Disease::SARS-CoV2-nsp6)	0.1495
 DRUGBANK::ddi-interactor-in::Compound:Compound(Compound::DB00227,Compound::DB00831) AND Hetionet::CbG::Compound:Gene(Compound::DB00831,Gene::10280) AND bioarx::Covid2_acc_host_gene::Disease:Gene(Disease::SARS-CoV2-nsp6,Gene::10280)=>Merged:Treatment(Compound::DB00227,Disease::SARS-CoV2-nsp6)	0.156
 DRUGBANK::ddi-interactor-in::Compound:Compound(Compound::DB00227,Compound::DB00831) AND bioarx::DrugHumGen:Compound:Gene(Compound::DB00831,Gene::10280) AND bioarx::Covid2_acc_host_gene::Disease:Gene(Disease::SARS-CoV2-nsp6,Gene::10280)=>Merged:Treatment(Compound::DB00227,Disease::SARS-CoV2-nsp6)	0.2145
 DRUGBANK::ddi-interactor-in::Compound:Compound(Compound::DB00215,Compound::DB00227) AND bioarx::DrugHumGen:Compound:Gene(Compound::DB00215,Gene::10280) AND bioarx::Covid2_acc_host_gene::Disease:Gene(Disease::SARS-CoV2-nsp6,Gene::10280)=>Merged:Treatment(Compound::DB00227,Disease::SARS-CoV2-nsp6)	0.104
 Hetionet::CuG::Compound:Gene(Compound::DB00227,Gene::392) AND Hetionet::Gr>G::Gene:Gene(Gene::10632,Gene::392) AND bioarx::Covid2_acc_host_gene::Disease:Gene(Disease::SARS-CoV2-nsp6,Gene::10632)=>Merged:Treatment(Compound::DB00227,Disease::SARS-CoV2-nsp6)	0.143
