 DRUGBANK::ddi-interactor-in::Compound:Compound(Compound::DB00234,Compound::DB00409) AND Hetionet::CdG::Compound:Gene(Compound::DB00234,Gene::7088) AND bioarx::Covid2_acc_host_gene::Disease:Gene(Disease::SARS-CoV2-nsp13,Gene::7088)=>Merged:Treatment(Compound::DB00409,Disease::SARS-CoV2-nsp13)	0.2665
 Hetionet::CdG::Compound:Gene(Compound::DB00409,Gene::6192) AND Hetionet::Gr>G::Gene:Gene(Gene::166,Gene::6192) AND bioarx::Covid2_acc_host_gene::Disease:Gene(Disease::SARS-CoV2-nsp13,Gene::166)=>Merged:Treatment(Compound::DB00409,Disease::SARS-CoV2-nsp13)	0.1495
 Hetionet::CdG::Compound:Gene(Compound::DB00409,Gene::6192) AND Hetionet::Gr>G::Gene:Gene(Gene::7088,Gene::6192) AND bioarx::Covid2_acc_host_gene::Disease:Gene(Disease::SARS-CoV2-nsp13,Gene::7088)=>Merged:Treatment(Compound::DB00409,Disease::SARS-CoV2-nsp13)	0.1495
 Hetionet::CdG::Compound:Gene(Compound::DB00409,Gene::6192) AND Hetionet::Gr>G::Gene:Gene(Gene::5566,Gene::6192) AND bioarx::Covid2_acc_host_gene::Disease:Gene(Disease::SARS-CoV2-nsp13,Gene::5566)=>Merged:Treatment(Compound::DB00409,Disease::SARS-CoV2-nsp13)	0.1495
 Hetionet::CdG::Compound:Gene(Compound::DB00409,Gene::6192) AND Hetionet::Gr>G::Gene:Gene(Gene::3281,Gene::6192) AND bioarx::Covid2_acc_host_gene::Disease:Gene(Disease::SARS-CoV2-nsp13,Gene::3281)=>Merged:Treatment(Compound::DB00409,Disease::SARS-CoV2-nsp13)	0.1495
 Hetionet::CdG::Compound:Gene(Compound::DB00409,Gene::6192) AND Hetionet::Gr>G::Gene:Gene(Gene::11116,Gene::6192) AND bioarx::Covid2_acc_host_gene::Disease:Gene(Disease::SARS-CoV2-nsp13,Gene::11116)=>Merged:Treatment(Compound::DB00409,Disease::SARS-CoV2-nsp13)	0.1495
 Hetionet::CdG::Compound:Gene(Compound::DB00409,Gene::6192) AND Hetionet::Gr>G::Gene:Gene(Gene::11113,Gene::6192) AND bioarx::Covid2_acc_host_gene::Disease:Gene(Disease::SARS-CoV2-nsp13,Gene::11113)=>Merged:Treatment(Compound::DB00409,Disease::SARS-CoV2-nsp13)	0.1495
 Hetionet::CdG::Compound:Gene(Compound::DB00409,Gene::6192) AND Hetionet::Gr>G::Gene:Gene(Gene::5576,Gene::6192) AND bioarx::Covid2_acc_host_gene::Disease:Gene(Disease::SARS-CoV2-nsp13,Gene::5576)=>Merged:Treatment(Compound::DB00409,Disease::SARS-CoV2-nsp13)	0.1495
 Hetionet::CdG::Compound:Gene(Compound::DB00409,Gene::6192) AND Hetionet::Gr>G::Gene:Gene(Gene::29110,Gene::6192) AND bioarx::Covid2_acc_host_gene::Disease:Gene(Disease::SARS-CoV2-nsp13,Gene::29110)=>Merged:Treatment(Compound::DB00409,Disease::SARS-CoV2-nsp13)	0.1495
 DRUGBANK::ddi-interactor-in::Compound:Compound(Compound::DB00409,Compound::DB06595) AND bioarx::DrugHumGen:Compound:Gene(Compound::DB06595,Gene::5566) AND bioarx::Covid2_acc_host_gene::Disease:Gene(Disease::SARS-CoV2-nsp13,Gene::5566)=>Merged:Treatment(Compound::DB00409,Disease::SARS-CoV2-nsp13)	0.2145
 DRUGBANK::ddi-interactor-in::Compound:Compound(Compound::DB00409,Compound::DB00836) AND Hetionet::CdG::Compound:Gene(Compound::DB00836,Gene::7088) AND bioarx::Covid2_acc_host_gene::Disease:Gene(Disease::SARS-CoV2-nsp13,Gene::7088)=>Merged:Treatment(Compound::DB00409,Disease::SARS-CoV2-nsp13)	0.1625
 Hetionet::CdG::Compound:Gene(Compound::DB00409,Gene::51170) AND Hetionet::Gr>G::Gene:Gene(Gene::11116,Gene::51170) AND bioarx::Covid2_acc_host_gene::Disease:Gene(Disease::SARS-CoV2-nsp13,Gene::11116)=>Merged:Treatment(Compound::DB00409,Disease::SARS-CoV2-nsp13)	0.1495
 Hetionet::CuG::Compound:Gene(Compound::DB00409,Gene::3108) AND Hetionet::Gr>G::Gene:Gene(Gene::5566,Gene::3108) AND bioarx::Covid2_acc_host_gene::Disease:Gene(Disease::SARS-CoV2-nsp13,Gene::5566)=>Merged:Treatment(Compound::DB00409,Disease::SARS-CoV2-nsp13)	0.143
 Hetionet::CdG::Compound:Gene(Compound::DB00409,Gene::23326) AND Hetionet::Gr>G::Gene:Gene(Gene::7088,Gene::23326) AND bioarx::Covid2_acc_host_gene::Disease:Gene(Disease::SARS-CoV2-nsp13,Gene::7088)=>Merged:Treatment(Compound::DB00409,Disease::SARS-CoV2-nsp13)	0.1495
 Hetionet::CdG::Compound:Gene(Compound::DB00409,Gene::23326) AND Hetionet::Gr>G::Gene:Gene(Gene::29110,Gene::23326) AND bioarx::Covid2_acc_host_gene::Disease:Gene(Disease::SARS-CoV2-nsp13,Gene::29110)=>Merged:Treatment(Compound::DB00409,Disease::SARS-CoV2-nsp13)	0.1495
 Hetionet::CdG::Compound:Gene(Compound::DB00409,Gene::23326) AND Hetionet::Gr>G::Gene:Gene(Gene::166,Gene::23326) AND bioarx::Covid2_acc_host_gene::Disease:Gene(Disease::SARS-CoV2-nsp13,Gene::166)=>Merged:Treatment(Compound::DB00409,Disease::SARS-CoV2-nsp13)	0.1495
 Hetionet::CdG::Compound:Gene(Compound::DB00409,Gene::23326) AND Hetionet::Gr>G::Gene:Gene(Gene::5566,Gene::23326) AND bioarx::Covid2_acc_host_gene::Disease:Gene(Disease::SARS-CoV2-nsp13,Gene::5566)=>Merged:Treatment(Compound::DB00409,Disease::SARS-CoV2-nsp13)	0.1495
 Hetionet::CdG::Compound:Gene(Compound::DB00409,Gene::23326) AND Hetionet::Gr>G::Gene:Gene(Gene::10142,Gene::23326) AND bioarx::Covid2_acc_host_gene::Disease:Gene(Disease::SARS-CoV2-nsp13,Gene::10142)=>Merged:Treatment(Compound::DB00409,Disease::SARS-CoV2-nsp13)	0.1495
 Hetionet::CdG::Compound:Gene(Compound::DB00409,Gene::23326) AND Hetionet::Gr>G::Gene:Gene(Gene::7090,Gene::23326) AND bioarx::Covid2_acc_host_gene::Disease:Gene(Disease::SARS-CoV2-nsp13,Gene::7090)=>Merged:Treatment(Compound::DB00409,Disease::SARS-CoV2-nsp13)	0.1495
 DRUGBANK::ddi-interactor-in::Compound:Compound(Compound::DB00409,Compound::DB00997) AND Hetionet::CdG::Compound:Gene(Compound::DB00997,Gene::7088) AND bioarx::Covid2_acc_host_gene::Disease:Gene(Disease::SARS-CoV2-nsp13,Gene::7088)=>Merged:Treatment(Compound::DB00409,Disease::SARS-CoV2-nsp13)	0.1625
 Hetionet::CdG::Compound:Gene(Compound::DB00409,Gene::1465) AND Hetionet::Gr>G::Gene:Gene(Gene::7088,Gene::1465) AND bioarx::Covid2_acc_host_gene::Disease:Gene(Disease::SARS-CoV2-nsp13,Gene::7088)=>Merged:Treatment(Compound::DB00409,Disease::SARS-CoV2-nsp13)	0.1495
 Hetionet::CdG::Compound:Gene(Compound::DB00409,Gene::1465) AND Hetionet::Gr>G::Gene:Gene(Gene::5566,Gene::1465) AND bioarx::Covid2_acc_host_gene::Disease:Gene(Disease::SARS-CoV2-nsp13,Gene::5566)=>Merged:Treatment(Compound::DB00409,Disease::SARS-CoV2-nsp13)	0.1495
 Hetionet::CdG::Compound:Gene(Compound::DB00409,Gene::1465) AND Hetionet::Gr>G::Gene:Gene(Gene::10142,Gene::1465) AND bioarx::Covid2_acc_host_gene::Disease:Gene(Disease::SARS-CoV2-nsp13,Gene::10142)=>Merged:Treatment(Compound::DB00409,Disease::SARS-CoV2-nsp13)	0.1495
 DRUGBANK::ddi-interactor-in::Compound:Compound(Compound::DB00409,Compound::DB00641) AND Hetionet::CuG::Compound:Gene(Compound::DB00641,Gene::2804) AND bioarx::Covid2_acc_host_gene::Disease:Gene(Disease::SARS-CoV2-nsp13,Gene::2804)=>Merged:Treatment(Compound::DB00409,Disease::SARS-CoV2-nsp13)	0.221
 DRUGBANK::ddi-interactor-in::Compound:Compound(Compound::DB00409,Compound::DB00641) AND Hetionet::CuG::Compound:Gene(Compound::DB00641,Gene::9648) AND bioarx::Covid2_acc_host_gene::Disease:Gene(Disease::SARS-CoV2-nsp13,Gene::9648)=>Merged:Treatment(Compound::DB00409,Disease::SARS-CoV2-nsp13)	0.221
 DRUGBANK::ddi-interactor-in::Compound:Compound(Compound::DB00409,Compound::DB06148) AND Hetionet::CdG::Compound:Gene(Compound::DB06148,Gene::7088) AND bioarx::Covid2_acc_host_gene::Disease:Gene(Disease::SARS-CoV2-nsp13,Gene::7088)=>Merged:Treatment(Compound::DB00409,Disease::SARS-CoV2-nsp13)	0.1625
 Hetionet::CuG::Compound:Gene(Compound::DB00409,Gene::5997) AND Hetionet::Gr>G::Gene:Gene(Gene::7088,Gene::5997) AND bioarx::Covid2_acc_host_gene::Disease:Gene(Disease::SARS-CoV2-nsp13,Gene::7088)=>Merged:Treatment(Compound::DB00409,Disease::SARS-CoV2-nsp13)	0.143
 Hetionet::CuG::Compound:Gene(Compound::DB00409,Gene::5997) AND Hetionet::Gr>G::Gene:Gene(Gene::5566,Gene::5997) AND bioarx::Covid2_acc_host_gene::Disease:Gene(Disease::SARS-CoV2-nsp13,Gene::5566)=>Merged:Treatment(Compound::DB00409,Disease::SARS-CoV2-nsp13)	0.143
 Hetionet::CdG::Compound:Gene(Compound::DB00409,Gene::58478) AND Hetionet::Gr>G::Gene:Gene(Gene::5577,Gene::58478) AND bioarx::Covid2_acc_host_gene::Disease:Gene(Disease::SARS-CoV2-nsp13,Gene::5577)=>Merged:Treatment(Compound::DB00409,Disease::SARS-CoV2-nsp13)	0.1495
 Hetionet::CdG::Compound:Gene(Compound::DB00409,Gene::58478) AND Hetionet::Gr>G::Gene:Gene(Gene::29110,Gene::58478) AND bioarx::Covid2_acc_host_gene::Disease:Gene(Disease::SARS-CoV2-nsp13,Gene::29110)=>Merged:Treatment(Compound::DB00409,Disease::SARS-CoV2-nsp13)	0.1495
 Hetionet::CdG::Compound:Gene(Compound::DB00409,Gene::58478) AND Hetionet::Gr>G::Gene:Gene(Gene::7088,Gene::58478) AND bioarx::Covid2_acc_host_gene::Disease:Gene(Disease::SARS-CoV2-nsp13,Gene::7088)=>Merged:Treatment(Compound::DB00409,Disease::SARS-CoV2-nsp13)	0.1495
 DRUGBANK::ddi-interactor-in::Compound:Compound(Compound::DB00188,Compound::DB00409) AND Hetionet::CuG::Compound:Gene(Compound::DB00188,Gene::79571) AND bioarx::Covid2_acc_host_gene::Disease:Gene(Disease::SARS-CoV2-nsp13,Gene::79571)=>Merged:Treatment(Compound::DB00409,Disease::SARS-CoV2-nsp13)	0.2535
 DRUGBANK::ddi-interactor-in::Compound:Compound(Compound::DB00188,Compound::DB00409) AND Hetionet::CuG::Compound:Gene(Compound::DB00188,Gene::10142) AND bioarx::Covid2_acc_host_gene::Disease:Gene(Disease::SARS-CoV2-nsp13,Gene::10142)=>Merged:Treatment(Compound::DB00409,Disease::SARS-CoV2-nsp13)	0.2535
 DRUGBANK::ddi-interactor-in::Compound:Compound(Compound::DB00188,Compound::DB00409) AND Hetionet::CdG::Compound:Gene(Compound::DB00188,Gene::7088) AND bioarx::Covid2_acc_host_gene::Disease:Gene(Disease::SARS-CoV2-nsp13,Gene::7088)=>Merged:Treatment(Compound::DB00409,Disease::SARS-CoV2-nsp13)	0.2665
 Hetionet::CdG::Compound:Gene(Compound::DB00409,Gene::5696) AND Hetionet::Gr>G::Gene:Gene(Gene::29110,Gene::5696) AND bioarx::Covid2_acc_host_gene::Disease:Gene(Disease::SARS-CoV2-nsp13,Gene::29110)=>Merged:Treatment(Compound::DB00409,Disease::SARS-CoV2-nsp13)	0.1495
 Hetionet::CdG::Compound:Gene(Compound::DB00409,Gene::5696) AND Hetionet::Gr>G::Gene:Gene(Gene::5566,Gene::5696) AND bioarx::Covid2_acc_host_gene::Disease:Gene(Disease::SARS-CoV2-nsp13,Gene::5566)=>Merged:Treatment(Compound::DB00409,Disease::SARS-CoV2-nsp13)	0.1495
 DRUGBANK::ddi-interactor-in::Compound:Compound(Compound::DB00409,Compound::DB01199) AND Hetionet::CdG::Compound:Gene(Compound::DB01199,Gene::7088) AND bioarx::Covid2_acc_host_gene::Disease:Gene(Disease::SARS-CoV2-nsp13,Gene::7088)=>Merged:Treatment(Compound::DB00409,Disease::SARS-CoV2-nsp13)	0.1625
 Hetionet::CdG::Compound:Gene(Compound::DB00409,Gene::1666) AND Hetionet::Gr>G::Gene:Gene(Gene::7088,Gene::1666) AND bioarx::Covid2_acc_host_gene::Disease:Gene(Disease::SARS-CoV2-nsp13,Gene::7088)=>Merged:Treatment(Compound::DB00409,Disease::SARS-CoV2-nsp13)	0.1495
 Hetionet::CdG::Compound:Gene(Compound::DB00409,Gene::1666) AND Hetionet::Gr>G::Gene:Gene(Gene::5566,Gene::1666) AND bioarx::Covid2_acc_host_gene::Disease:Gene(Disease::SARS-CoV2-nsp13,Gene::5566)=>Merged:Treatment(Compound::DB00409,Disease::SARS-CoV2-nsp13)	0.1495
 Hetionet::CuG::Compound:Gene(Compound::DB00409,Gene::54442) AND Hetionet::Gr>G::Gene:Gene(Gene::5576,Gene::54442) AND bioarx::Covid2_acc_host_gene::Disease:Gene(Disease::SARS-CoV2-nsp13,Gene::5576)=>Merged:Treatment(Compound::DB00409,Disease::SARS-CoV2-nsp13)	0.143
 Hetionet::CuG::Compound:Gene(Compound::DB00409,Gene::4482) AND Hetionet::Gr>G::Gene:Gene(Gene::11113,Gene::4482) AND bioarx::Covid2_acc_host_gene::Disease:Gene(Disease::SARS-CoV2-nsp13,Gene::11113)=>Merged:Treatment(Compound::DB00409,Disease::SARS-CoV2-nsp13)	0.143
 Hetionet::CuG::Compound:Gene(Compound::DB00409,Gene::4482) AND Hetionet::Gr>G::Gene:Gene(Gene::7090,Gene::4482) AND bioarx::Covid2_acc_host_gene::Disease:Gene(Disease::SARS-CoV2-nsp13,Gene::7090)=>Merged:Treatment(Compound::DB00409,Disease::SARS-CoV2-nsp13)	0.143
 DRUGBANK::ddi-interactor-in::Compound:Compound(Compound::DB00409,Compound::DB01177) AND Hetionet::CdG::Compound:Gene(Compound::DB01177,Gene::1063) AND bioarx::Covid2_acc_host_gene::Disease:Gene(Disease::SARS-CoV2-nsp13,Gene::1063)=>Merged:Treatment(Compound::DB00409,Disease::SARS-CoV2-nsp13)	0.1625
 DRUGBANK::ddi-interactor-in::Compound:Compound(Compound::DB00409,Compound::DB01177) AND Hetionet::CdG::Compound:Gene(Compound::DB01177,Gene::7088) AND bioarx::Covid2_acc_host_gene::Disease:Gene(Disease::SARS-CoV2-nsp13,Gene::7088)=>Merged:Treatment(Compound::DB00409,Disease::SARS-CoV2-nsp13)	0.1625
 DRUGBANK::ddi-interactor-in::Compound:Compound(Compound::DB00409,Compound::DB01177) AND Hetionet::CuG::Compound:Gene(Compound::DB01177,Gene::5566) AND bioarx::Covid2_acc_host_gene::Disease:Gene(Disease::SARS-CoV2-nsp13,Gene::5566)=>Merged:Treatment(Compound::DB00409,Disease::SARS-CoV2-nsp13)	0.221
 Hetionet::CdG::Compound:Gene(Compound::DB00409,Gene::9688) AND Hetionet::Gr>G::Gene:Gene(Gene::7090,Gene::9688) AND bioarx::Covid2_acc_host_gene::Disease:Gene(Disease::SARS-CoV2-nsp13,Gene::7090)=>Merged:Treatment(Compound::DB00409,Disease::SARS-CoV2-nsp13)	0.1495
 Hetionet::CdG::Compound:Gene(Compound::DB00409,Gene::9688) AND Hetionet::Gr>G::Gene:Gene(Gene::10142,Gene::9688) AND bioarx::Covid2_acc_host_gene::Disease:Gene(Disease::SARS-CoV2-nsp13,Gene::10142)=>Merged:Treatment(Compound::DB00409,Disease::SARS-CoV2-nsp13)	0.1495
 DRUGBANK::ddi-interactor-in::Compound:Compound(Compound::DB00409,Compound::DB06287) AND Hetionet::CuG::Compound:Gene(Compound::DB06287,Gene::2804) AND bioarx::Covid2_acc_host_gene::Disease:Gene(Disease::SARS-CoV2-nsp13,Gene::2804)=>Merged:Treatment(Compound::DB00409,Disease::SARS-CoV2-nsp13)	0.221
 DRUGBANK::ddi-interactor-in::Compound:Compound(Compound::DB00409,Compound::DB06287) AND Hetionet::CuG::Compound:Gene(Compound::DB06287,Gene::10142) AND bioarx::Covid2_acc_host_gene::Disease:Gene(Disease::SARS-CoV2-nsp13,Gene::10142)=>Merged:Treatment(Compound::DB00409,Disease::SARS-CoV2-nsp13)	0.221
 DRUGBANK::ddi-interactor-in::Compound:Compound(Compound::DB00409,Compound::DB06287) AND Hetionet::CuG::Compound:Gene(Compound::DB06287,Gene::79443) AND bioarx::Covid2_acc_host_gene::Disease:Gene(Disease::SARS-CoV2-nsp13,Gene::79443)=>Merged:Treatment(Compound::DB00409,Disease::SARS-CoV2-nsp13)	0.221
 Hetionet::CdG::Compound:Gene(Compound::DB00409,Gene::200081) AND Hetionet::Gr>G::Gene:Gene(Gene::5577,Gene::200081) AND bioarx::Covid2_acc_host_gene::Disease:Gene(Disease::SARS-CoV2-nsp13,Gene::5577)=>Merged:Treatment(Compound::DB00409,Disease::SARS-CoV2-nsp13)	0.1495
 Hetionet::CdG::Compound:Gene(Compound::DB00409,Gene::200081) AND Hetionet::Gr>G::Gene:Gene(Gene::7088,Gene::200081) AND bioarx::Covid2_acc_host_gene::Disease:Gene(Disease::SARS-CoV2-nsp13,Gene::7088)=>Merged:Treatment(Compound::DB00409,Disease::SARS-CoV2-nsp13)	0.1495
 Hetionet::CdG::Compound:Gene(Compound::DB00409,Gene::200081) AND Hetionet::Gr>G::Gene:Gene(Gene::11116,Gene::200081) AND bioarx::Covid2_acc_host_gene::Disease:Gene(Disease::SARS-CoV2-nsp13,Gene::11116)=>Merged:Treatment(Compound::DB00409,Disease::SARS-CoV2-nsp13)	0.1495
 Hetionet::CdG::Compound:Gene(Compound::DB00409,Gene::200081) AND Hetionet::Gr>G::Gene:Gene(Gene::7090,Gene::200081) AND bioarx::Covid2_acc_host_gene::Disease:Gene(Disease::SARS-CoV2-nsp13,Gene::7090)=>Merged:Treatment(Compound::DB00409,Disease::SARS-CoV2-nsp13)	0.1495
 DRUGBANK::ddi-interactor-in::Compound:Compound(Compound::DB00409,Compound::DB00444) AND Hetionet::CuG::Compound:Gene(Compound::DB00444,Gene::79078) AND bioarx::Covid2_acc_host_gene::Disease:Gene(Disease::SARS-CoV2-nsp13,Gene::79078)=>Merged:Treatment(Compound::DB00409,Disease::SARS-CoV2-nsp13)	0.221
 DRUGBANK::ddi-interactor-in::Compound:Compound(Compound::DB00409,Compound::DB00444) AND Hetionet::CdG::Compound:Gene(Compound::DB00444,Gene::7088) AND bioarx::Covid2_acc_host_gene::Disease:Gene(Disease::SARS-CoV2-nsp13,Gene::7088)=>Merged:Treatment(Compound::DB00409,Disease::SARS-CoV2-nsp13)	0.1625
 DRUGBANK::ddi-interactor-in::Compound:Compound(Compound::DB00409,Compound::DB00444) AND Hetionet::CdG::Compound:Gene(Compound::DB00444,Gene::11113) AND bioarx::Covid2_acc_host_gene::Disease:Gene(Disease::SARS-CoV2-nsp13,Gene::11113)=>Merged:Treatment(Compound::DB00409,Disease::SARS-CoV2-nsp13)	0.1625
 DRUGBANK::ddi-interactor-in::Compound:Compound(Compound::DB00409,Compound::DB00444) AND Hetionet::CdG::Compound:Gene(Compound::DB00444,Gene::1063) AND bioarx::Covid2_acc_host_gene::Disease:Gene(Disease::SARS-CoV2-nsp13,Gene::1063)=>Merged:Treatment(Compound::DB00409,Disease::SARS-CoV2-nsp13)	0.1625
 DRUGBANK::ddi-interactor-in::Compound:Compound(Compound::DB00409,Compound::DB01074) AND Hetionet::CuG::Compound:Gene(Compound::DB01074,Gene::2804) AND bioarx::Covid2_acc_host_gene::Disease:Gene(Disease::SARS-CoV2-nsp13,Gene::2804)=>Merged:Treatment(Compound::DB00409,Disease::SARS-CoV2-nsp13)	0.221
 DRUGBANK::ddi-interactor-in::Compound:Compound(Compound::DB00409,Compound::DB08901) AND Hetionet::CuG::Compound:Gene(Compound::DB08901,Gene::5566) AND bioarx::Covid2_acc_host_gene::Disease:Gene(Disease::SARS-CoV2-nsp13,Gene::5566)=>Merged:Treatment(Compound::DB00409,Disease::SARS-CoV2-nsp13)	0.221
 DRUGBANK::ddi-interactor-in::Compound:Compound(Compound::DB00409,Compound::DB00748) AND Hetionet::CdG::Compound:Gene(Compound::DB00748,Gene::5566) AND bioarx::Covid2_acc_host_gene::Disease:Gene(Disease::SARS-CoV2-nsp13,Gene::5566)=>Merged:Treatment(Compound::DB00409,Disease::SARS-CoV2-nsp13)	0.1625
 Hetionet::CuG::Compound:Gene(Compound::DB00409,Gene::6304) AND Hetionet::Gr>G::Gene:Gene(Gene::5566,Gene::6304) AND bioarx::Covid2_acc_host_gene::Disease:Gene(Disease::SARS-CoV2-nsp13,Gene::5566)=>Merged:Treatment(Compound::DB00409,Disease::SARS-CoV2-nsp13)	0.143
 DRUGBANK::ddi-interactor-in::Compound:Compound(Compound::DB00277,Compound::DB00409) AND DGIDB::OTHER::Gene:Compound(Gene::5577,Compound::DB00277) AND bioarx::Covid2_acc_host_gene::Disease:Gene(Disease::SARS-CoV2-nsp13,Gene::5577)=>Merged:Treatment(Compound::DB00409,Disease::SARS-CoV2-nsp13)	0.1105
 Hetionet::CdG::Compound:Gene(Compound::DB00409,Gene::23029) AND Hetionet::Gr>G::Gene:Gene(Gene::11113,Gene::23029) AND bioarx::Covid2_acc_host_gene::Disease:Gene(Disease::SARS-CoV2-nsp13,Gene::11113)=>Merged:Treatment(Compound::DB00409,Disease::SARS-CoV2-nsp13)	0.1495
 Hetionet::CdG::Compound:Gene(Compound::DB00409,Gene::51021) AND Hetionet::Gr>G::Gene:Gene(Gene::7088,Gene::51021) AND bioarx::Covid2_acc_host_gene::Disease:Gene(Disease::SARS-CoV2-nsp13,Gene::7088)=>Merged:Treatment(Compound::DB00409,Disease::SARS-CoV2-nsp13)	0.1495
 Hetionet::CdG::Compound:Gene(Compound::DB00409,Gene::51021) AND Hetionet::Gr>G::Gene:Gene(Gene::5566,Gene::51021) AND bioarx::Covid2_acc_host_gene::Disease:Gene(Disease::SARS-CoV2-nsp13,Gene::5566)=>Merged:Treatment(Compound::DB00409,Disease::SARS-CoV2-nsp13)	0.1495
 DRUGBANK::ddi-interactor-in::Compound:Compound(Compound::DB00409,Compound::DB00448) AND Hetionet::CdG::Compound:Gene(Compound::DB00448,Gene::5566) AND bioarx::Covid2_acc_host_gene::Disease:Gene(Disease::SARS-CoV2-nsp13,Gene::5566)=>Merged:Treatment(Compound::DB00409,Disease::SARS-CoV2-nsp13)	0.1625
 DRUGBANK::ddi-interactor-in::Compound:Compound(Compound::DB00409,Compound::DB00810) AND Hetionet::CuG::Compound:Gene(Compound::DB00810,Gene::5566) AND bioarx::Covid2_acc_host_gene::Disease:Gene(Disease::SARS-CoV2-nsp13,Gene::5566)=>Merged:Treatment(Compound::DB00409,Disease::SARS-CoV2-nsp13)	0.221
 Hetionet::CuG::Compound:Gene(Compound::DB00409,Gene::387) AND Hetionet::Gr>G::Gene:Gene(Gene::7088,Gene::387) AND bioarx::Covid2_acc_host_gene::Disease:Gene(Disease::SARS-CoV2-nsp13,Gene::7088)=>Merged:Treatment(Compound::DB00409,Disease::SARS-CoV2-nsp13)	0.143
 DRUGBANK::ddi-interactor-in::Compound:Compound(Compound::DB00409,Compound::DB06589) AND Hetionet::CdG::Compound:Gene(Compound::DB06589,Gene::5566) AND bioarx::Covid2_acc_host_gene::Disease:Gene(Disease::SARS-CoV2-nsp13,Gene::5566)=>Merged:Treatment(Compound::DB00409,Disease::SARS-CoV2-nsp13)	0.1625
 Hetionet::CuG::Compound:Gene(Compound::DB00409,Gene::10695) AND Hetionet::Gr>G::Gene:Gene(Gene::29110,Gene::10695) AND bioarx::Covid2_acc_host_gene::Disease:Gene(Disease::SARS-CoV2-nsp13,Gene::29110)=>Merged:Treatment(Compound::DB00409,Disease::SARS-CoV2-nsp13)	0.143
 Hetionet::CuG::Compound:Gene(Compound::DB00409,Gene::9143) AND Hetionet::Gr>G::Gene:Gene(Gene::29110,Gene::9143) AND bioarx::Covid2_acc_host_gene::Disease:Gene(Disease::SARS-CoV2-nsp13,Gene::29110)=>Merged:Treatment(Compound::DB00409,Disease::SARS-CoV2-nsp13)	0.143
 DRUGBANK::ddi-interactor-in::Compound:Compound(Compound::DB00312,Compound::DB00409) AND Hetionet::CuG::Compound:Gene(Compound::DB00312,Gene::5566) AND bioarx::Covid2_acc_host_gene::Disease:Gene(Disease::SARS-CoV2-nsp13,Gene::5566)=>Merged:Treatment(Compound::DB00409,Disease::SARS-CoV2-nsp13)	0.2535
 DRUGBANK::ddi-interactor-in::Compound:Compound(Compound::DB00409,Compound::DB01166) AND Hetionet::CdG::Compound:Gene(Compound::DB01166,Gene::7088) AND bioarx::Covid2_acc_host_gene::Disease:Gene(Disease::SARS-CoV2-nsp13,Gene::7088)=>Merged:Treatment(Compound::DB00409,Disease::SARS-CoV2-nsp13)	0.1625
 DRUGBANK::ddi-interactor-in::Compound:Compound(Compound::DB00409,Compound::DB00960) AND Hetionet::CdG::Compound:Gene(Compound::DB00960,Gene::5566) AND bioarx::Covid2_acc_host_gene::Disease:Gene(Disease::SARS-CoV2-nsp13,Gene::5566)=>Merged:Treatment(Compound::DB00409,Disease::SARS-CoV2-nsp13)	0.1625
 Hetionet::CdG::Compound:Gene(Compound::DB00409,Gene::54205) AND Hetionet::Gr>G::Gene:Gene(Gene::5577,Gene::54205) AND bioarx::Covid2_acc_host_gene::Disease:Gene(Disease::SARS-CoV2-nsp13,Gene::5577)=>Merged:Treatment(Compound::DB00409,Disease::SARS-CoV2-nsp13)	0.1495
 Hetionet::CdG::Compound:Gene(Compound::DB00409,Gene::54205) AND Hetionet::Gr>G::Gene:Gene(Gene::10142,Gene::54205) AND bioarx::Covid2_acc_host_gene::Disease:Gene(Disease::SARS-CoV2-nsp13,Gene::10142)=>Merged:Treatment(Compound::DB00409,Disease::SARS-CoV2-nsp13)	0.1495
 DRUGBANK::ddi-interactor-in::Compound:Compound(Compound::DB00091,Compound::DB00409) AND Hetionet::CdG::Compound:Gene(Compound::DB00091,Gene::1063) AND bioarx::Covid2_acc_host_gene::Disease:Gene(Disease::SARS-CoV2-nsp13,Gene::1063)=>Merged:Treatment(Compound::DB00409,Disease::SARS-CoV2-nsp13)	0.2665
 DRUGBANK::ddi-interactor-in::Compound:Compound(Compound::DB00091,Compound::DB00409) AND Hetionet::CuG::Compound:Gene(Compound::DB00091,Gene::2802) AND bioarx::Covid2_acc_host_gene::Disease:Gene(Disease::SARS-CoV2-nsp13,Gene::2802)=>Merged:Treatment(Compound::DB00409,Disease::SARS-CoV2-nsp13)	0.2535
 DRUGBANK::ddi-interactor-in::Compound:Compound(Compound::DB00091,Compound::DB00409) AND Hetionet::CuG::Compound:Gene(Compound::DB00091,Gene::2804) AND bioarx::Covid2_acc_host_gene::Disease:Gene(Disease::SARS-CoV2-nsp13,Gene::2804)=>Merged:Treatment(Compound::DB00409,Disease::SARS-CoV2-nsp13)	0.2535
 DRUGBANK::ddi-interactor-in::Compound:Compound(Compound::DB00193,Compound::DB00409) AND Hetionet::CdG::Compound:Gene(Compound::DB00193,Gene::7088) AND bioarx::Covid2_acc_host_gene::Disease:Gene(Disease::SARS-CoV2-nsp13,Gene::7088)=>Merged:Treatment(Compound::DB00409,Disease::SARS-CoV2-nsp13)	0.2665
 Hetionet::CuG::Compound:Gene(Compound::DB00409,Gene::10451) AND Hetionet::Gr>G::Gene:Gene(Gene::7088,Gene::10451) AND bioarx::Covid2_acc_host_gene::Disease:Gene(Disease::SARS-CoV2-nsp13,Gene::7088)=>Merged:Treatment(Compound::DB00409,Disease::SARS-CoV2-nsp13)	0.143
 DRUGBANK::ddi-interactor-in::Compound:Compound(Compound::DB00409,Compound::DB00715) AND Hetionet::CuG::Compound:Gene(Compound::DB00715,Gene::2804) AND bioarx::Covid2_acc_host_gene::Disease:Gene(Disease::SARS-CoV2-nsp13,Gene::2804)=>Merged:Treatment(Compound::DB00409,Disease::SARS-CoV2-nsp13)	0.221
 DRUGBANK::ddi-interactor-in::Compound:Compound(Compound::DB00409,Compound::DB01095) AND Hetionet::CuG::Compound:Gene(Compound::DB01095,Gene::2804) AND bioarx::Covid2_acc_host_gene::Disease:Gene(Disease::SARS-CoV2-nsp13,Gene::2804)=>Merged:Treatment(Compound::DB00409,Disease::SARS-CoV2-nsp13)	0.221
 DRUGBANK::ddi-interactor-in::Compound:Compound(Compound::DB00409,Compound::DB01095) AND Hetionet::CuG::Compound:Gene(Compound::DB01095,Gene::9648) AND bioarx::Covid2_acc_host_gene::Disease:Gene(Disease::SARS-CoV2-nsp13,Gene::9648)=>Merged:Treatment(Compound::DB00409,Disease::SARS-CoV2-nsp13)	0.221
 DRUGBANK::ddi-interactor-in::Compound:Compound(Compound::DB00409,Compound::DB00854) AND Hetionet::CdG::Compound:Gene(Compound::DB00854,Gene::7088) AND bioarx::Covid2_acc_host_gene::Disease:Gene(Disease::SARS-CoV2-nsp13,Gene::7088)=>Merged:Treatment(Compound::DB00409,Disease::SARS-CoV2-nsp13)	0.1625
