 DRUGBANK::ddi-interactor-in::Compound:Compound(Compound::DB01229,Compound::DB04794) AND DGIDB::OTHER::Gene:Compound(Gene::7090,Compound::DB01229) AND bioarx::Covid2_acc_host_gene::Disease:Gene(Disease::SARS-CoV2-nsp13,Gene::7090)=>Merged:Treatment(Compound::DB04794,Disease::SARS-CoV2-nsp13)	0.1105
 DRUGBANK::ddi-interactor-in::Compound:Compound(Compound::DB00836,Compound::DB04794) AND Hetionet::CdG::Compound:Gene(Compound::DB00836,Gene::7088) AND bioarx::Covid2_acc_host_gene::Disease:Gene(Disease::SARS-CoV2-nsp13,Gene::7088)=>Merged:Treatment(Compound::DB04794,Disease::SARS-CoV2-nsp13)	0.2665
 DRUGBANK::ddi-interactor-in::Compound:Compound(Compound::DB00641,Compound::DB04794) AND Hetionet::CuG::Compound:Gene(Compound::DB00641,Gene::2804) AND bioarx::Covid2_acc_host_gene::Disease:Gene(Disease::SARS-CoV2-nsp13,Gene::2804)=>Merged:Treatment(Compound::DB04794,Disease::SARS-CoV2-nsp13)	0.2535
 DRUGBANK::ddi-interactor-in::Compound:Compound(Compound::DB00641,Compound::DB04794) AND Hetionet::CuG::Compound:Gene(Compound::DB00641,Gene::9648) AND bioarx::Covid2_acc_host_gene::Disease:Gene(Disease::SARS-CoV2-nsp13,Gene::9648)=>Merged:Treatment(Compound::DB04794,Disease::SARS-CoV2-nsp13)	0.2535
 DRUGBANK::ddi-interactor-in::Compound:Compound(Compound::DB01396,Compound::DB04794) AND Hetionet::CdG::Compound:Gene(Compound::DB01396,Gene::7088) AND bioarx::Covid2_acc_host_gene::Disease:Gene(Disease::SARS-CoV2-nsp13,Gene::7088)=>Merged:Treatment(Compound::DB04794,Disease::SARS-CoV2-nsp13)	0.2665
 DRUGBANK::ddi-interactor-in::Compound:Compound(Compound::DB00277,Compound::DB04794) AND DGIDB::OTHER::Gene:Compound(Gene::5577,Compound::DB00277) AND bioarx::Covid2_acc_host_gene::Disease:Gene(Disease::SARS-CoV2-nsp13,Gene::5577)=>Merged:Treatment(Compound::DB04794,Disease::SARS-CoV2-nsp13)	0.1105
 DRUGBANK::ddi-interactor-in::Compound:Compound(Compound::DB00091,Compound::DB04794) AND Hetionet::CdG::Compound:Gene(Compound::DB00091,Gene::1063) AND bioarx::Covid2_acc_host_gene::Disease:Gene(Disease::SARS-CoV2-nsp13,Gene::1063)=>Merged:Treatment(Compound::DB04794,Disease::SARS-CoV2-nsp13)	0.2665
 DRUGBANK::ddi-interactor-in::Compound:Compound(Compound::DB00091,Compound::DB04794) AND Hetionet::CuG::Compound:Gene(Compound::DB00091,Gene::2802) AND bioarx::Covid2_acc_host_gene::Disease:Gene(Disease::SARS-CoV2-nsp13,Gene::2802)=>Merged:Treatment(Compound::DB04794,Disease::SARS-CoV2-nsp13)	0.2535
 DRUGBANK::ddi-interactor-in::Compound:Compound(Compound::DB00091,Compound::DB04794) AND Hetionet::CuG::Compound:Gene(Compound::DB00091,Gene::2804) AND bioarx::Covid2_acc_host_gene::Disease:Gene(Disease::SARS-CoV2-nsp13,Gene::2804)=>Merged:Treatment(Compound::DB04794,Disease::SARS-CoV2-nsp13)	0.2535
 DRUGBANK::ddi-interactor-in::Compound:Compound(Compound::DB01254,Compound::DB04794) AND Hetionet::CuG::Compound:Gene(Compound::DB01254,Gene::2804) AND bioarx::Covid2_acc_host_gene::Disease:Gene(Disease::SARS-CoV2-nsp13,Gene::2804)=>Merged:Treatment(Compound::DB04794,Disease::SARS-CoV2-nsp13)	0.2535
 DRUGBANK::ddi-interactor-in::Compound:Compound(Compound::DB01254,Compound::DB04794) AND Hetionet::CuG::Compound:Gene(Compound::DB01254,Gene::9648) AND bioarx::Covid2_acc_host_gene::Disease:Gene(Disease::SARS-CoV2-nsp13,Gene::9648)=>Merged:Treatment(Compound::DB04794,Disease::SARS-CoV2-nsp13)	0.2535
 DRUGBANK::ddi-interactor-in::Compound:Compound(Compound::DB00563,Compound::DB04794) AND Hetionet::CdG::Compound:Gene(Compound::DB00563,Gene::1063) AND bioarx::Covid2_acc_host_gene::Disease:Gene(Disease::SARS-CoV2-nsp13,Gene::1063)=>Merged:Treatment(Compound::DB04794,Disease::SARS-CoV2-nsp13)	0.2665
 DRUGBANK::ddi-interactor-in::Compound:Compound(Compound::DB01074,Compound::DB04794) AND Hetionet::CuG::Compound:Gene(Compound::DB01074,Gene::2804) AND bioarx::Covid2_acc_host_gene::Disease:Gene(Disease::SARS-CoV2-nsp13,Gene::2804)=>Merged:Treatment(Compound::DB04794,Disease::SARS-CoV2-nsp13)	0.2535
 DRUGBANK::ddi-interactor-in::Compound:Compound(Compound::DB01166,Compound::DB04794) AND Hetionet::CdG::Compound:Gene(Compound::DB01166,Gene::7088) AND bioarx::Covid2_acc_host_gene::Disease:Gene(Disease::SARS-CoV2-nsp13,Gene::7088)=>Merged:Treatment(Compound::DB04794,Disease::SARS-CoV2-nsp13)	0.2665
 DRUGBANK::ddi-interactor-in::Compound:Compound(Compound::DB04794,Compound::DB06287) AND Hetionet::CuG::Compound:Gene(Compound::DB06287,Gene::2804) AND bioarx::Covid2_acc_host_gene::Disease:Gene(Disease::SARS-CoV2-nsp13,Gene::2804)=>Merged:Treatment(Compound::DB04794,Disease::SARS-CoV2-nsp13)	0.221
 DRUGBANK::ddi-interactor-in::Compound:Compound(Compound::DB04794,Compound::DB06287) AND Hetionet::CuG::Compound:Gene(Compound::DB06287,Gene::10142) AND bioarx::Covid2_acc_host_gene::Disease:Gene(Disease::SARS-CoV2-nsp13,Gene::10142)=>Merged:Treatment(Compound::DB04794,Disease::SARS-CoV2-nsp13)	0.221
 DRUGBANK::ddi-interactor-in::Compound:Compound(Compound::DB04794,Compound::DB06287) AND Hetionet::CuG::Compound:Gene(Compound::DB06287,Gene::79443) AND bioarx::Covid2_acc_host_gene::Disease:Gene(Disease::SARS-CoV2-nsp13,Gene::79443)=>Merged:Treatment(Compound::DB04794,Disease::SARS-CoV2-nsp13)	0.221
 DRUGBANK::ddi-interactor-in::Compound:Compound(Compound::DB00877,Compound::DB04794) AND Hetionet::CuG::Compound:Gene(Compound::DB00877,Gene::23177) AND bioarx::Covid2_acc_host_gene::Disease:Gene(Disease::SARS-CoV2-nsp13,Gene::23177)=>Merged:Treatment(Compound::DB04794,Disease::SARS-CoV2-nsp13)	0.2535
 DRUGBANK::ddi-interactor-in::Compound:Compound(Compound::DB00877,Compound::DB04794) AND Hetionet::CuG::Compound:Gene(Compound::DB00877,Gene::2804) AND bioarx::Covid2_acc_host_gene::Disease:Gene(Disease::SARS-CoV2-nsp13,Gene::2804)=>Merged:Treatment(Compound::DB04794,Disease::SARS-CoV2-nsp13)	0.2535
 DRUGBANK::ddi-interactor-in::Compound:Compound(Compound::DB04794,Compound::DB08162) AND DRUGBANK::target::Compound:Gene(Compound::DB08162,Gene::5566) AND bioarx::Covid2_acc_host_gene::Disease:Gene(Disease::SARS-CoV2-nsp13,Gene::5566)=>Merged:Treatment(Compound::DB04794,Disease::SARS-CoV2-nsp13)	0.182
 DRUGBANK::ddi-interactor-in::Compound:Compound(Compound::DB01008,Compound::DB04794) AND Hetionet::CdG::Compound:Gene(Compound::DB01008,Gene::7088) AND bioarx::Covid2_acc_host_gene::Disease:Gene(Disease::SARS-CoV2-nsp13,Gene::7088)=>Merged:Treatment(Compound::DB04794,Disease::SARS-CoV2-nsp13)	0.2665
 DRUGBANK::ddi-interactor-in::Compound:Compound(Compound::DB00717,Compound::DB04794) AND Hetionet::CuG::Compound:Gene(Compound::DB00717,Gene::2804) AND bioarx::Covid2_acc_host_gene::Disease:Gene(Disease::SARS-CoV2-nsp13,Gene::2804)=>Merged:Treatment(Compound::DB04794,Disease::SARS-CoV2-nsp13)	0.2535
 DRUGBANK::ddi-interactor-in::Compound:Compound(Compound::DB00585,Compound::DB04794) AND Hetionet::CdG::Compound:Gene(Compound::DB00585,Gene::7088) AND bioarx::Covid2_acc_host_gene::Disease:Gene(Disease::SARS-CoV2-nsp13,Gene::7088)=>Merged:Treatment(Compound::DB04794,Disease::SARS-CoV2-nsp13)	0.2665
