 DRUGBANK::ddi-interactor-in::Compound:Compound(Compound::DB04844,Compound::DB06148) AND Hetionet::CdG::Compound:Gene(Compound::DB06148,Gene::7088) AND bioarx::Covid2_acc_host_gene::Disease:Gene(Disease::SARS-CoV2-nsp13,Gene::7088)=>Merged:Treatment(Compound::DB04844,Disease::SARS-CoV2-nsp13)	0.1625
 DRUGBANK::ddi-interactor-in::Compound:Compound(Compound::DB00374,Compound::DB04844) AND Hetionet::CuG::Compound:Gene(Compound::DB00374,Gene::2804) AND bioarx::Covid2_acc_host_gene::Disease:Gene(Disease::SARS-CoV2-nsp13,Gene::2804)=>Merged:Treatment(Compound::DB04844,Disease::SARS-CoV2-nsp13)	0.2535
 DRUGBANK::ddi-interactor-in::Compound:Compound(Compound::DB04844,Compound::DB08912) AND Hetionet::CdG::Compound:Gene(Compound::DB08912,Gene::11113) AND bioarx::Covid2_acc_host_gene::Disease:Gene(Disease::SARS-CoV2-nsp13,Gene::11113)=>Merged:Treatment(Compound::DB04844,Disease::SARS-CoV2-nsp13)	0.1625
 DRUGBANK::ddi-interactor-in::Compound:Compound(Compound::DB04844,Compound::DB08912) AND Hetionet::CuG::Compound:Gene(Compound::DB08912,Gene::79078) AND bioarx::Covid2_acc_host_gene::Disease:Gene(Disease::SARS-CoV2-nsp13,Gene::79078)=>Merged:Treatment(Compound::DB04844,Disease::SARS-CoV2-nsp13)	0.221
 DRUGBANK::ddi-interactor-in::Compound:Compound(Compound::DB04844,Compound::DB06287) AND Hetionet::CuG::Compound:Gene(Compound::DB06287,Gene::2804) AND bioarx::Covid2_acc_host_gene::Disease:Gene(Disease::SARS-CoV2-nsp13,Gene::2804)=>Merged:Treatment(Compound::DB04844,Disease::SARS-CoV2-nsp13)	0.221
 DRUGBANK::ddi-interactor-in::Compound:Compound(Compound::DB04844,Compound::DB06287) AND Hetionet::CuG::Compound:Gene(Compound::DB06287,Gene::10142) AND bioarx::Covid2_acc_host_gene::Disease:Gene(Disease::SARS-CoV2-nsp13,Gene::10142)=>Merged:Treatment(Compound::DB04844,Disease::SARS-CoV2-nsp13)	0.221
 DRUGBANK::ddi-interactor-in::Compound:Compound(Compound::DB04844,Compound::DB06287) AND Hetionet::CuG::Compound:Gene(Compound::DB06287,Gene::79443) AND bioarx::Covid2_acc_host_gene::Disease:Gene(Disease::SARS-CoV2-nsp13,Gene::79443)=>Merged:Treatment(Compound::DB04844,Disease::SARS-CoV2-nsp13)	0.221
 DRUGBANK::ddi-interactor-in::Compound:Compound(Compound::DB00641,Compound::DB04844) AND Hetionet::CuG::Compound:Gene(Compound::DB00641,Gene::2804) AND bioarx::Covid2_acc_host_gene::Disease:Gene(Disease::SARS-CoV2-nsp13,Gene::2804)=>Merged:Treatment(Compound::DB04844,Disease::SARS-CoV2-nsp13)	0.2535
 DRUGBANK::ddi-interactor-in::Compound:Compound(Compound::DB00641,Compound::DB04844) AND Hetionet::CuG::Compound:Gene(Compound::DB00641,Gene::9648) AND bioarx::Covid2_acc_host_gene::Disease:Gene(Disease::SARS-CoV2-nsp13,Gene::9648)=>Merged:Treatment(Compound::DB04844,Disease::SARS-CoV2-nsp13)	0.2535
 Hetionet::CdG::Compound:Gene(Compound::DB04844,Gene::9093) AND Hetionet::Gr>G::Gene:Gene(Gene::5576,Gene::9093) AND bioarx::Covid2_acc_host_gene::Disease:Gene(Disease::SARS-CoV2-nsp13,Gene::5576)=>Merged:Treatment(Compound::DB04844,Disease::SARS-CoV2-nsp13)	0.1495
 DRUGBANK::ddi-interactor-in::Compound:Compound(Compound::DB00997,Compound::DB04844) AND Hetionet::CdG::Compound:Gene(Compound::DB00997,Gene::7088) AND bioarx::Covid2_acc_host_gene::Disease:Gene(Disease::SARS-CoV2-nsp13,Gene::7088)=>Merged:Treatment(Compound::DB04844,Disease::SARS-CoV2-nsp13)	0.2665
 DRUGBANK::ddi-interactor-in::Compound:Compound(Compound::DB01137,Compound::DB04844) AND Hetionet::CdG::Compound:Gene(Compound::DB01137,Gene::5566) AND bioarx::Covid2_acc_host_gene::Disease:Gene(Disease::SARS-CoV2-nsp13,Gene::5566)=>Merged:Treatment(Compound::DB04844,Disease::SARS-CoV2-nsp13)	0.2665
 Hetionet::CuG::Compound:Gene(Compound::DB04844,Gene::3251) AND Hetionet::Gr>G::Gene:Gene(Gene::10142,Gene::3251) AND bioarx::Covid2_acc_host_gene::Disease:Gene(Disease::SARS-CoV2-nsp13,Gene::10142)=>Merged:Treatment(Compound::DB04844,Disease::SARS-CoV2-nsp13)	0.143
 DRUGBANK::ddi-interactor-in::Compound:Compound(Compound::DB04844,Compound::DB08901) AND Hetionet::CuG::Compound:Gene(Compound::DB08901,Gene::5566) AND bioarx::Covid2_acc_host_gene::Disease:Gene(Disease::SARS-CoV2-nsp13,Gene::5566)=>Merged:Treatment(Compound::DB04844,Disease::SARS-CoV2-nsp13)	0.221
 DRUGBANK::ddi-interactor-in::Compound:Compound(Compound::DB01396,Compound::DB04844) AND Hetionet::CdG::Compound:Gene(Compound::DB01396,Gene::7088) AND bioarx::Covid2_acc_host_gene::Disease:Gene(Disease::SARS-CoV2-nsp13,Gene::7088)=>Merged:Treatment(Compound::DB04844,Disease::SARS-CoV2-nsp13)	0.2665
 DRUGBANK::ddi-interactor-in::Compound:Compound(Compound::DB00277,Compound::DB04844) AND DGIDB::OTHER::Gene:Compound(Gene::5577,Compound::DB00277) AND bioarx::Covid2_acc_host_gene::Disease:Gene(Disease::SARS-CoV2-nsp13,Gene::5577)=>Merged:Treatment(Compound::DB04844,Disease::SARS-CoV2-nsp13)	0.1105
 DRUGBANK::ddi-interactor-in::Compound:Compound(Compound::DB00836,Compound::DB04844) AND Hetionet::CdG::Compound:Gene(Compound::DB00836,Gene::7088) AND bioarx::Covid2_acc_host_gene::Disease:Gene(Disease::SARS-CoV2-nsp13,Gene::7088)=>Merged:Treatment(Compound::DB04844,Disease::SARS-CoV2-nsp13)	0.2665
 DRUGBANK::ddi-interactor-in::Compound:Compound(Compound::DB01177,Compound::DB04844) AND Hetionet::CdG::Compound:Gene(Compound::DB01177,Gene::1063) AND bioarx::Covid2_acc_host_gene::Disease:Gene(Disease::SARS-CoV2-nsp13,Gene::1063)=>Merged:Treatment(Compound::DB04844,Disease::SARS-CoV2-nsp13)	0.2665
 DRUGBANK::ddi-interactor-in::Compound:Compound(Compound::DB01177,Compound::DB04844) AND Hetionet::CdG::Compound:Gene(Compound::DB01177,Gene::7088) AND bioarx::Covid2_acc_host_gene::Disease:Gene(Disease::SARS-CoV2-nsp13,Gene::7088)=>Merged:Treatment(Compound::DB04844,Disease::SARS-CoV2-nsp13)	0.2665
 DRUGBANK::ddi-interactor-in::Compound:Compound(Compound::DB01177,Compound::DB04844) AND Hetionet::CuG::Compound:Gene(Compound::DB01177,Gene::5566) AND bioarx::Covid2_acc_host_gene::Disease:Gene(Disease::SARS-CoV2-nsp13,Gene::5566)=>Merged:Treatment(Compound::DB04844,Disease::SARS-CoV2-nsp13)	0.2535
 DRUGBANK::ddi-interactor-in::Compound:Compound(Compound::DB00193,Compound::DB04844) AND Hetionet::CdG::Compound:Gene(Compound::DB00193,Gene::7088) AND bioarx::Covid2_acc_host_gene::Disease:Gene(Disease::SARS-CoV2-nsp13,Gene::7088)=>Merged:Treatment(Compound::DB04844,Disease::SARS-CoV2-nsp13)	0.2665
 DRUGBANK::ddi-interactor-in::Compound:Compound(Compound::DB00312,Compound::DB04844) AND Hetionet::CuG::Compound:Gene(Compound::DB00312,Gene::5566) AND bioarx::Covid2_acc_host_gene::Disease:Gene(Disease::SARS-CoV2-nsp13,Gene::5566)=>Merged:Treatment(Compound::DB04844,Disease::SARS-CoV2-nsp13)	0.2535
 DRUGBANK::ddi-interactor-in::Compound:Compound(Compound::DB01095,Compound::DB04844) AND Hetionet::CuG::Compound:Gene(Compound::DB01095,Gene::2804) AND bioarx::Covid2_acc_host_gene::Disease:Gene(Disease::SARS-CoV2-nsp13,Gene::2804)=>Merged:Treatment(Compound::DB04844,Disease::SARS-CoV2-nsp13)	0.2535
 DRUGBANK::ddi-interactor-in::Compound:Compound(Compound::DB01095,Compound::DB04844) AND Hetionet::CuG::Compound:Gene(Compound::DB01095,Gene::9648) AND bioarx::Covid2_acc_host_gene::Disease:Gene(Disease::SARS-CoV2-nsp13,Gene::9648)=>Merged:Treatment(Compound::DB04844,Disease::SARS-CoV2-nsp13)	0.2535
 DRUGBANK::ddi-interactor-in::Compound:Compound(Compound::DB04844,Compound::DB08865) AND Hetionet::CuG::Compound:Gene(Compound::DB08865,Gene::2804) AND bioarx::Covid2_acc_host_gene::Disease:Gene(Disease::SARS-CoV2-nsp13,Gene::2804)=>Merged:Treatment(Compound::DB04844,Disease::SARS-CoV2-nsp13)	0.221
 DRUGBANK::ddi-interactor-in::Compound:Compound(Compound::DB04844,Compound::DB08865) AND Hetionet::CbG::Compound:Gene(Compound::DB08865,Gene::29110) AND bioarx::Covid2_acc_host_gene::Disease:Gene(Disease::SARS-CoV2-nsp13,Gene::29110)=>Merged:Treatment(Compound::DB04844,Disease::SARS-CoV2-nsp13)	0.156
 DRUGBANK::ddi-interactor-in::Compound:Compound(Compound::DB04844,Compound::DB08865) AND Hetionet::CbG::Compound:Gene(Gene::29110,Compound::DB08865) AND bioarx::Covid2_acc_host_gene::Disease:Gene(Disease::SARS-CoV2-nsp13,Gene::29110)=>Merged:Treatment(Compound::DB04844,Disease::SARS-CoV2-nsp13)	0.104
 DRUGBANK::ddi-interactor-in::Compound:Compound(Compound::DB04844,Compound::DB08865) AND Hetionet::CuG::Compound:Gene(Compound::DB08865,Gene::79443) AND bioarx::Covid2_acc_host_gene::Disease:Gene(Disease::SARS-CoV2-nsp13,Gene::79443)=>Merged:Treatment(Compound::DB04844,Disease::SARS-CoV2-nsp13)	0.221
 DRUGBANK::ddi-interactor-in::Compound:Compound(Compound::DB00091,Compound::DB04844) AND Hetionet::CdG::Compound:Gene(Compound::DB00091,Gene::1063) AND bioarx::Covid2_acc_host_gene::Disease:Gene(Disease::SARS-CoV2-nsp13,Gene::1063)=>Merged:Treatment(Compound::DB04844,Disease::SARS-CoV2-nsp13)	0.2665
 DRUGBANK::ddi-interactor-in::Compound:Compound(Compound::DB00091,Compound::DB04844) AND Hetionet::CuG::Compound:Gene(Compound::DB00091,Gene::2802) AND bioarx::Covid2_acc_host_gene::Disease:Gene(Disease::SARS-CoV2-nsp13,Gene::2802)=>Merged:Treatment(Compound::DB04844,Disease::SARS-CoV2-nsp13)	0.2535
 DRUGBANK::ddi-interactor-in::Compound:Compound(Compound::DB00091,Compound::DB04844) AND Hetionet::CuG::Compound:Gene(Compound::DB00091,Gene::2804) AND bioarx::Covid2_acc_host_gene::Disease:Gene(Disease::SARS-CoV2-nsp13,Gene::2804)=>Merged:Treatment(Compound::DB04844,Disease::SARS-CoV2-nsp13)	0.2535
 DRUGBANK::ddi-interactor-in::Compound:Compound(Compound::DB00960,Compound::DB04844) AND Hetionet::CdG::Compound:Gene(Compound::DB00960,Gene::5566) AND bioarx::Covid2_acc_host_gene::Disease:Gene(Disease::SARS-CoV2-nsp13,Gene::5566)=>Merged:Treatment(Compound::DB04844,Disease::SARS-CoV2-nsp13)	0.2665
 DRUGBANK::ddi-interactor-in::Compound:Compound(Compound::DB01211,Compound::DB04844) AND Hetionet::CdG::Compound:Gene(Compound::DB01211,Gene::7088) AND bioarx::Covid2_acc_host_gene::Disease:Gene(Disease::SARS-CoV2-nsp13,Gene::7088)=>Merged:Treatment(Compound::DB04844,Disease::SARS-CoV2-nsp13)	0.2665
 DRUGBANK::ddi-interactor-in::Compound:Compound(Compound::DB00810,Compound::DB04844) AND Hetionet::CuG::Compound:Gene(Compound::DB00810,Gene::5566) AND bioarx::Covid2_acc_host_gene::Disease:Gene(Disease::SARS-CoV2-nsp13,Gene::5566)=>Merged:Treatment(Compound::DB04844,Disease::SARS-CoV2-nsp13)	0.2535
 DRUGBANK::ddi-interactor-in::Compound:Compound(Compound::DB01254,Compound::DB04844) AND Hetionet::CuG::Compound:Gene(Compound::DB01254,Gene::2804) AND bioarx::Covid2_acc_host_gene::Disease:Gene(Disease::SARS-CoV2-nsp13,Gene::2804)=>Merged:Treatment(Compound::DB04844,Disease::SARS-CoV2-nsp13)	0.2535
 DRUGBANK::ddi-interactor-in::Compound:Compound(Compound::DB01254,Compound::DB04844) AND Hetionet::CuG::Compound:Gene(Compound::DB01254,Gene::9648) AND bioarx::Covid2_acc_host_gene::Disease:Gene(Disease::SARS-CoV2-nsp13,Gene::9648)=>Merged:Treatment(Compound::DB04844,Disease::SARS-CoV2-nsp13)	0.2535
 DRUGBANK::ddi-interactor-in::Compound:Compound(Compound::DB04844,Compound::DB06589) AND Hetionet::CdG::Compound:Gene(Compound::DB06589,Gene::5566) AND bioarx::Covid2_acc_host_gene::Disease:Gene(Disease::SARS-CoV2-nsp13,Gene::5566)=>Merged:Treatment(Compound::DB04844,Disease::SARS-CoV2-nsp13)	0.1625
 DRUGBANK::ddi-interactor-in::Compound:Compound(Compound::DB01165,Compound::DB04844) AND Hetionet::CdG::Compound:Gene(Compound::DB01165,Gene::5566) AND bioarx::Covid2_acc_host_gene::Disease:Gene(Disease::SARS-CoV2-nsp13,Gene::5566)=>Merged:Treatment(Compound::DB04844,Disease::SARS-CoV2-nsp13)	0.2665
 Hetionet::CuG::Compound:Gene(Compound::DB04844,Gene::5627) AND Hetionet::Gr>G::Gene:Gene(Gene::7088,Gene::5627) AND bioarx::Covid2_acc_host_gene::Disease:Gene(Disease::SARS-CoV2-nsp13,Gene::7088)=>Merged:Treatment(Compound::DB04844,Disease::SARS-CoV2-nsp13)	0.143
 DRUGBANK::ddi-interactor-in::Compound:Compound(Compound::DB02546,Compound::DB04844) AND Hetionet::CdG::Compound:Gene(Compound::DB02546,Gene::1063) AND bioarx::Covid2_acc_host_gene::Disease:Gene(Disease::SARS-CoV2-nsp13,Gene::1063)=>Merged:Treatment(Compound::DB04844,Disease::SARS-CoV2-nsp13)	0.2665
 DRUGBANK::ddi-interactor-in::Compound:Compound(Compound::DB02546,Compound::DB04844) AND Hetionet::CuG::Compound:Gene(Compound::DB02546,Gene::5566) AND bioarx::Covid2_acc_host_gene::Disease:Gene(Disease::SARS-CoV2-nsp13,Gene::5566)=>Merged:Treatment(Compound::DB04844,Disease::SARS-CoV2-nsp13)	0.2535
 DRUGBANK::ddi-interactor-in::Compound:Compound(Compound::DB02546,Compound::DB04844) AND Hetionet::CuG::Compound:Gene(Compound::DB02546,Gene::9648) AND bioarx::Covid2_acc_host_gene::Disease:Gene(Disease::SARS-CoV2-nsp13,Gene::9648)=>Merged:Treatment(Compound::DB04844,Disease::SARS-CoV2-nsp13)	0.2535
 Hetionet::CdG::Compound:Gene(Compound::DB04844,Gene::2697) AND Hetionet::Gr>G::Gene:Gene(Gene::11116,Gene::2697) AND bioarx::Covid2_acc_host_gene::Disease:Gene(Disease::SARS-CoV2-nsp13,Gene::11116)=>Merged:Treatment(Compound::DB04844,Disease::SARS-CoV2-nsp13)	0.1495
 Hetionet::CdG::Compound:Gene(Compound::DB04844,Gene::2697) AND Hetionet::Gr>G::Gene:Gene(Gene::5576,Gene::2697) AND bioarx::Covid2_acc_host_gene::Disease:Gene(Disease::SARS-CoV2-nsp13,Gene::5576)=>Merged:Treatment(Compound::DB04844,Disease::SARS-CoV2-nsp13)	0.1495
 DRUGBANK::ddi-interactor-in::Compound:Compound(Compound::DB01166,Compound::DB04844) AND Hetionet::CdG::Compound:Gene(Compound::DB01166,Gene::7088) AND bioarx::Covid2_acc_host_gene::Disease:Gene(Disease::SARS-CoV2-nsp13,Gene::7088)=>Merged:Treatment(Compound::DB04844,Disease::SARS-CoV2-nsp13)	0.2665
 DRUGBANK::ddi-interactor-in::Compound:Compound(Compound::DB00234,Compound::DB04844) AND Hetionet::CdG::Compound:Gene(Compound::DB00234,Gene::7088) AND bioarx::Covid2_acc_host_gene::Disease:Gene(Disease::SARS-CoV2-nsp13,Gene::7088)=>Merged:Treatment(Compound::DB04844,Disease::SARS-CoV2-nsp13)	0.2665
 DRUGBANK::ddi-interactor-in::Compound:Compound(Compound::DB01074,Compound::DB04844) AND Hetionet::CuG::Compound:Gene(Compound::DB01074,Gene::2804) AND bioarx::Covid2_acc_host_gene::Disease:Gene(Disease::SARS-CoV2-nsp13,Gene::2804)=>Merged:Treatment(Compound::DB04844,Disease::SARS-CoV2-nsp13)	0.2535
 DRUGBANK::ddi-interactor-in::Compound:Compound(Compound::DB00715,Compound::DB04844) AND Hetionet::CuG::Compound:Gene(Compound::DB00715,Gene::2804) AND bioarx::Covid2_acc_host_gene::Disease:Gene(Disease::SARS-CoV2-nsp13,Gene::2804)=>Merged:Treatment(Compound::DB04844,Disease::SARS-CoV2-nsp13)	0.2535
 DRUGBANK::ddi-interactor-in::Compound:Compound(Compound::DB00445,Compound::DB04844) AND Hetionet::CdG::Compound:Gene(Compound::DB00445,Gene::7088) AND bioarx::Covid2_acc_host_gene::Disease:Gene(Disease::SARS-CoV2-nsp13,Gene::7088)=>Merged:Treatment(Compound::DB04844,Disease::SARS-CoV2-nsp13)	0.2665
 DRUGBANK::ddi-interactor-in::Compound:Compound(Compound::DB00748,Compound::DB04844) AND Hetionet::CdG::Compound:Gene(Compound::DB00748,Gene::5566) AND bioarx::Covid2_acc_host_gene::Disease:Gene(Disease::SARS-CoV2-nsp13,Gene::5566)=>Merged:Treatment(Compound::DB04844,Disease::SARS-CoV2-nsp13)	0.2665
 DRUGBANK::ddi-interactor-in::Compound:Compound(Compound::DB00390,Compound::DB04844) AND Hetionet::CdG::Compound:Gene(Compound::DB00390,Gene::7088) AND bioarx::Covid2_acc_host_gene::Disease:Gene(Disease::SARS-CoV2-nsp13,Gene::7088)=>Merged:Treatment(Compound::DB04844,Disease::SARS-CoV2-nsp13)	0.2665
 Hetionet::CdG::Compound:Gene(Compound::DB04844,Gene::7076) AND Hetionet::Gr>G::Gene:Gene(Gene::5566,Gene::7076) AND bioarx::Covid2_acc_host_gene::Disease:Gene(Disease::SARS-CoV2-nsp13,Gene::5566)=>Merged:Treatment(Compound::DB04844,Disease::SARS-CoV2-nsp13)	0.1495
 Hetionet::CdG::Compound:Gene(Compound::DB04844,Gene::7076) AND Hetionet::Gr>G::Gene:Gene(Gene::7088,Gene::7076) AND bioarx::Covid2_acc_host_gene::Disease:Gene(Disease::SARS-CoV2-nsp13,Gene::7088)=>Merged:Treatment(Compound::DB04844,Disease::SARS-CoV2-nsp13)	0.1495
 DRUGBANK::ddi-interactor-in::Compound:Compound(Compound::DB01268,Compound::DB04844) AND Hetionet::CbG::Compound:Gene(Compound::DB01268,Gene::29110) AND bioarx::Covid2_acc_host_gene::Disease:Gene(Disease::SARS-CoV2-nsp13,Gene::29110)=>Merged:Treatment(Compound::DB04844,Disease::SARS-CoV2-nsp13)	0.1105
 Hetionet::CuG::Compound:Gene(Compound::DB04844,Gene::6839) AND Hetionet::Gr>G::Gene:Gene(Gene::11116,Gene::6839) AND bioarx::Covid2_acc_host_gene::Disease:Gene(Disease::SARS-CoV2-nsp13,Gene::11116)=>Merged:Treatment(Compound::DB04844,Disease::SARS-CoV2-nsp13)	0.143
 DRUGBANK::ddi-interactor-in::Compound:Compound(Compound::DB00448,Compound::DB04844) AND Hetionet::CdG::Compound:Gene(Compound::DB00448,Gene::5566) AND bioarx::Covid2_acc_host_gene::Disease:Gene(Disease::SARS-CoV2-nsp13,Gene::5566)=>Merged:Treatment(Compound::DB04844,Disease::SARS-CoV2-nsp13)	0.2665
 DRUGBANK::ddi-interactor-in::Compound:Compound(Compound::DB00188,Compound::DB04844) AND Hetionet::CuG::Compound:Gene(Compound::DB00188,Gene::79571) AND bioarx::Covid2_acc_host_gene::Disease:Gene(Disease::SARS-CoV2-nsp13,Gene::79571)=>Merged:Treatment(Compound::DB04844,Disease::SARS-CoV2-nsp13)	0.2535
 DRUGBANK::ddi-interactor-in::Compound:Compound(Compound::DB00188,Compound::DB04844) AND Hetionet::CuG::Compound:Gene(Compound::DB00188,Gene::10142) AND bioarx::Covid2_acc_host_gene::Disease:Gene(Disease::SARS-CoV2-nsp13,Gene::10142)=>Merged:Treatment(Compound::DB04844,Disease::SARS-CoV2-nsp13)	0.2535
 DRUGBANK::ddi-interactor-in::Compound:Compound(Compound::DB00188,Compound::DB04844) AND Hetionet::CdG::Compound:Gene(Compound::DB00188,Gene::7088) AND bioarx::Covid2_acc_host_gene::Disease:Gene(Disease::SARS-CoV2-nsp13,Gene::7088)=>Merged:Treatment(Compound::DB04844,Disease::SARS-CoV2-nsp13)	0.2665
 DRUGBANK::ddi-interactor-in::Compound:Compound(Compound::DB04844,Compound::DB06595) AND bioarx::DrugHumGen:Compound:Gene(Compound::DB06595,Gene::5566) AND bioarx::Covid2_acc_host_gene::Disease:Gene(Disease::SARS-CoV2-nsp13,Gene::5566)=>Merged:Treatment(Compound::DB04844,Disease::SARS-CoV2-nsp13)	0.2145
