 DRUGBANK::ddi-interactor-in::Compound:Compound(Compound::DB00234,Compound::DB01192) AND Hetionet::CdG::Compound:Gene(Compound::DB00234,Gene::7088) AND bioarx::Covid2_acc_host_gene::Disease:Gene(Disease::SARS-CoV2-nsp13,Gene::7088)=>Merged:Treatment(Compound::DB01192,Disease::SARS-CoV2-nsp13)	0.2665
 DRUGBANK::ddi-interactor-in::Compound:Compound(Compound::DB00748,Compound::DB01192) AND Hetionet::CdG::Compound:Gene(Compound::DB00748,Gene::5566) AND bioarx::Covid2_acc_host_gene::Disease:Gene(Disease::SARS-CoV2-nsp13,Gene::5566)=>Merged:Treatment(Compound::DB01192,Disease::SARS-CoV2-nsp13)	0.2665
 DRUGBANK::ddi-interactor-in::Compound:Compound(Compound::DB01166,Compound::DB01192) AND Hetionet::CdG::Compound:Gene(Compound::DB01166,Gene::7088) AND bioarx::Covid2_acc_host_gene::Disease:Gene(Disease::SARS-CoV2-nsp13,Gene::7088)=>Merged:Treatment(Compound::DB01192,Disease::SARS-CoV2-nsp13)	0.2665
 DRUGBANK::ddi-interactor-in::Compound:Compound(Compound::DB00448,Compound::DB01192) AND Hetionet::CdG::Compound:Gene(Compound::DB00448,Gene::5566) AND bioarx::Covid2_acc_host_gene::Disease:Gene(Disease::SARS-CoV2-nsp13,Gene::5566)=>Merged:Treatment(Compound::DB01192,Disease::SARS-CoV2-nsp13)	0.2665
 DRUGBANK::ddi-interactor-in::Compound:Compound(Compound::DB00188,Compound::DB01192) AND Hetionet::CuG::Compound:Gene(Compound::DB00188,Gene::79571) AND bioarx::Covid2_acc_host_gene::Disease:Gene(Disease::SARS-CoV2-nsp13,Gene::79571)=>Merged:Treatment(Compound::DB01192,Disease::SARS-CoV2-nsp13)	0.2535
 DRUGBANK::ddi-interactor-in::Compound:Compound(Compound::DB00188,Compound::DB01192) AND Hetionet::CuG::Compound:Gene(Compound::DB00188,Gene::10142) AND bioarx::Covid2_acc_host_gene::Disease:Gene(Disease::SARS-CoV2-nsp13,Gene::10142)=>Merged:Treatment(Compound::DB01192,Disease::SARS-CoV2-nsp13)	0.2535
 DRUGBANK::ddi-interactor-in::Compound:Compound(Compound::DB00188,Compound::DB01192) AND Hetionet::CdG::Compound:Gene(Compound::DB00188,Gene::7088) AND bioarx::Covid2_acc_host_gene::Disease:Gene(Disease::SARS-CoV2-nsp13,Gene::7088)=>Merged:Treatment(Compound::DB01192,Disease::SARS-CoV2-nsp13)	0.2665
 DRUGBANK::ddi-interactor-in::Compound:Compound(Compound::DB00715,Compound::DB01192) AND Hetionet::CuG::Compound:Gene(Compound::DB00715,Gene::2804) AND bioarx::Covid2_acc_host_gene::Disease:Gene(Disease::SARS-CoV2-nsp13,Gene::2804)=>Merged:Treatment(Compound::DB01192,Disease::SARS-CoV2-nsp13)	0.2535
 DRUGBANK::ddi-interactor-in::Compound:Compound(Compound::DB01192,Compound::DB06589) AND Hetionet::CdG::Compound:Gene(Compound::DB06589,Gene::5566) AND bioarx::Covid2_acc_host_gene::Disease:Gene(Disease::SARS-CoV2-nsp13,Gene::5566)=>Merged:Treatment(Compound::DB01192,Disease::SARS-CoV2-nsp13)	0.1625
 DRUGBANK::ddi-interactor-in::Compound:Compound(Compound::DB00997,Compound::DB01192) AND Hetionet::CdG::Compound:Gene(Compound::DB00997,Gene::7088) AND bioarx::Covid2_acc_host_gene::Disease:Gene(Disease::SARS-CoV2-nsp13,Gene::7088)=>Merged:Treatment(Compound::DB01192,Disease::SARS-CoV2-nsp13)	0.2665
 DRUGBANK::ddi-interactor-in::Compound:Compound(Compound::DB00641,Compound::DB01192) AND Hetionet::CuG::Compound:Gene(Compound::DB00641,Gene::2804) AND bioarx::Covid2_acc_host_gene::Disease:Gene(Disease::SARS-CoV2-nsp13,Gene::2804)=>Merged:Treatment(Compound::DB01192,Disease::SARS-CoV2-nsp13)	0.2535
 DRUGBANK::ddi-interactor-in::Compound:Compound(Compound::DB00641,Compound::DB01192) AND Hetionet::CuG::Compound:Gene(Compound::DB00641,Gene::9648) AND bioarx::Covid2_acc_host_gene::Disease:Gene(Disease::SARS-CoV2-nsp13,Gene::9648)=>Merged:Treatment(Compound::DB01192,Disease::SARS-CoV2-nsp13)	0.2535
 DRUGBANK::ddi-interactor-in::Compound:Compound(Compound::DB01192,Compound::DB06595) AND bioarx::DrugHumGen:Compound:Gene(Compound::DB06595,Gene::5566) AND bioarx::Covid2_acc_host_gene::Disease:Gene(Disease::SARS-CoV2-nsp13,Gene::5566)=>Merged:Treatment(Compound::DB01192,Disease::SARS-CoV2-nsp13)	0.2145
 DRUGBANK::ddi-interactor-in::Compound:Compound(Compound::DB00836,Compound::DB01192) AND Hetionet::CdG::Compound:Gene(Compound::DB00836,Gene::7088) AND bioarx::Covid2_acc_host_gene::Disease:Gene(Disease::SARS-CoV2-nsp13,Gene::7088)=>Merged:Treatment(Compound::DB01192,Disease::SARS-CoV2-nsp13)	0.2665
 DRUGBANK::ddi-interactor-in::Compound:Compound(Compound::DB00277,Compound::DB01192) AND DGIDB::OTHER::Gene:Compound(Gene::5577,Compound::DB00277) AND bioarx::Covid2_acc_host_gene::Disease:Gene(Disease::SARS-CoV2-nsp13,Gene::5577)=>Merged:Treatment(Compound::DB01192,Disease::SARS-CoV2-nsp13)	0.1105
 DRUGBANK::ddi-interactor-in::Compound:Compound(Compound::DB00193,Compound::DB01192) AND Hetionet::CdG::Compound:Gene(Compound::DB00193,Gene::7088) AND bioarx::Covid2_acc_host_gene::Disease:Gene(Disease::SARS-CoV2-nsp13,Gene::7088)=>Merged:Treatment(Compound::DB01192,Disease::SARS-CoV2-nsp13)	0.2665
 DRUGBANK::ddi-interactor-in::Compound:Compound(Compound::DB00312,Compound::DB01192) AND Hetionet::CuG::Compound:Gene(Compound::DB00312,Gene::5566) AND bioarx::Covid2_acc_host_gene::Disease:Gene(Disease::SARS-CoV2-nsp13,Gene::5566)=>Merged:Treatment(Compound::DB01192,Disease::SARS-CoV2-nsp13)	0.2535
 DRUGBANK::ddi-interactor-in::Compound:Compound(Compound::DB01177,Compound::DB01192) AND Hetionet::CdG::Compound:Gene(Compound::DB01177,Gene::1063) AND bioarx::Covid2_acc_host_gene::Disease:Gene(Disease::SARS-CoV2-nsp13,Gene::1063)=>Merged:Treatment(Compound::DB01192,Disease::SARS-CoV2-nsp13)	0.2665
 DRUGBANK::ddi-interactor-in::Compound:Compound(Compound::DB01177,Compound::DB01192) AND Hetionet::CdG::Compound:Gene(Compound::DB01177,Gene::7088) AND bioarx::Covid2_acc_host_gene::Disease:Gene(Disease::SARS-CoV2-nsp13,Gene::7088)=>Merged:Treatment(Compound::DB01192,Disease::SARS-CoV2-nsp13)	0.2665
 DRUGBANK::ddi-interactor-in::Compound:Compound(Compound::DB01177,Compound::DB01192) AND Hetionet::CuG::Compound:Gene(Compound::DB01177,Gene::5566) AND bioarx::Covid2_acc_host_gene::Disease:Gene(Disease::SARS-CoV2-nsp13,Gene::5566)=>Merged:Treatment(Compound::DB01192,Disease::SARS-CoV2-nsp13)	0.2535
 DRUGBANK::ddi-interactor-in::Compound:Compound(Compound::DB01095,Compound::DB01192) AND Hetionet::CuG::Compound:Gene(Compound::DB01095,Gene::2804) AND bioarx::Covid2_acc_host_gene::Disease:Gene(Disease::SARS-CoV2-nsp13,Gene::2804)=>Merged:Treatment(Compound::DB01192,Disease::SARS-CoV2-nsp13)	0.2535
 DRUGBANK::ddi-interactor-in::Compound:Compound(Compound::DB01095,Compound::DB01192) AND Hetionet::CuG::Compound:Gene(Compound::DB01095,Gene::9648) AND bioarx::Covid2_acc_host_gene::Disease:Gene(Disease::SARS-CoV2-nsp13,Gene::9648)=>Merged:Treatment(Compound::DB01192,Disease::SARS-CoV2-nsp13)	0.2535
 Merged:Treatment(Compound::DB01192,Disease::MESH:D009369) AND GNBR::L::Gene:Disease(Gene::64689,Disease::MESH:D009369) AND bioarx::Covid2_acc_host_gene::Disease:Gene(Disease::SARS-CoV2-nsp13,Gene::64689)=>Merged:Treatment(Compound::DB01192,Disease::SARS-CoV2-nsp13)	0.117
 Merged:Treatment(Compound::DB01192,Disease::MESH:D009369) AND GNBR::L::Gene:Disease(Gene::5577,Disease::MESH:D009369) AND bioarx::Covid2_acc_host_gene::Disease:Gene(Disease::SARS-CoV2-nsp13,Gene::5577)=>Merged:Treatment(Compound::DB01192,Disease::SARS-CoV2-nsp13)	0.117
 Merged:Treatment(Compound::DB01192,Disease::MESH:D009369) AND GNBR::L::Gene:Disease(Gene::7088,Disease::MESH:D009369) AND bioarx::Covid2_acc_host_gene::Disease:Gene(Disease::SARS-CoV2-nsp13,Gene::7088)=>Merged:Treatment(Compound::DB01192,Disease::SARS-CoV2-nsp13)	0.117
 Merged:Treatment(Compound::DB01192,Disease::MESH:D009369) AND GNBR::L::Gene:Disease(Gene::22981,Disease::MESH:D009369) AND bioarx::Covid2_acc_host_gene::Disease:Gene(Disease::SARS-CoV2-nsp13,Gene::22981)=>Merged:Treatment(Compound::DB01192,Disease::SARS-CoV2-nsp13)	0.117
 Merged:Treatment(Compound::DB01192,Disease::MESH:D009369) AND GNBR::L::Gene:Disease(Gene::5962,Disease::MESH:D009369) AND bioarx::Covid2_acc_host_gene::Disease:Gene(Disease::SARS-CoV2-nsp13,Gene::5962)=>Merged:Treatment(Compound::DB01192,Disease::SARS-CoV2-nsp13)	0.117
 Merged:Treatment(Compound::DB01192,Disease::MESH:D009369) AND GNBR::L::Gene:Disease(Gene::7090,Disease::MESH:D009369) AND bioarx::Covid2_acc_host_gene::Disease:Gene(Disease::SARS-CoV2-nsp13,Gene::7090)=>Merged:Treatment(Compound::DB01192,Disease::SARS-CoV2-nsp13)	0.117
 DRUGBANK::ddi-interactor-in::Compound:Compound(Compound::DB00091,Compound::DB01192) AND Hetionet::CdG::Compound:Gene(Compound::DB00091,Gene::1063) AND bioarx::Covid2_acc_host_gene::Disease:Gene(Disease::SARS-CoV2-nsp13,Gene::1063)=>Merged:Treatment(Compound::DB01192,Disease::SARS-CoV2-nsp13)	0.2665
 DRUGBANK::ddi-interactor-in::Compound:Compound(Compound::DB00091,Compound::DB01192) AND Hetionet::CuG::Compound:Gene(Compound::DB00091,Gene::2802) AND bioarx::Covid2_acc_host_gene::Disease:Gene(Disease::SARS-CoV2-nsp13,Gene::2802)=>Merged:Treatment(Compound::DB01192,Disease::SARS-CoV2-nsp13)	0.2535
 DRUGBANK::ddi-interactor-in::Compound:Compound(Compound::DB00091,Compound::DB01192) AND Hetionet::CuG::Compound:Gene(Compound::DB00091,Gene::2804) AND bioarx::Covid2_acc_host_gene::Disease:Gene(Disease::SARS-CoV2-nsp13,Gene::2804)=>Merged:Treatment(Compound::DB01192,Disease::SARS-CoV2-nsp13)	0.2535
 DRUGBANK::ddi-interactor-in::Compound:Compound(Compound::DB00960,Compound::DB01192) AND Hetionet::CdG::Compound:Gene(Compound::DB00960,Gene::5566) AND bioarx::Covid2_acc_host_gene::Disease:Gene(Disease::SARS-CoV2-nsp13,Gene::5566)=>Merged:Treatment(Compound::DB01192,Disease::SARS-CoV2-nsp13)	0.2665
 DRUGBANK::ddi-interactor-in::Compound:Compound(Compound::DB00810,Compound::DB01192) AND Hetionet::CuG::Compound:Gene(Compound::DB00810,Gene::5566) AND bioarx::Covid2_acc_host_gene::Disease:Gene(Disease::SARS-CoV2-nsp13,Gene::5566)=>Merged:Treatment(Compound::DB01192,Disease::SARS-CoV2-nsp13)	0.2535
 DRUGBANK::ddi-interactor-in::Compound:Compound(Compound::DB00854,Compound::DB01192) AND Hetionet::CdG::Compound:Gene(Compound::DB00854,Gene::7088) AND bioarx::Covid2_acc_host_gene::Disease:Gene(Disease::SARS-CoV2-nsp13,Gene::7088)=>Merged:Treatment(Compound::DB01192,Disease::SARS-CoV2-nsp13)	0.2665
 DRUGBANK::ddi-interactor-in::Compound:Compound(Compound::DB01192,Compound::DB06148) AND Hetionet::CdG::Compound:Gene(Compound::DB06148,Gene::7088) AND bioarx::Covid2_acc_host_gene::Disease:Gene(Disease::SARS-CoV2-nsp13,Gene::7088)=>Merged:Treatment(Compound::DB01192,Disease::SARS-CoV2-nsp13)	0.1625
 DRUGBANK::ddi-interactor-in::Compound:Compound(Compound::DB01192,Compound::DB01199) AND Hetionet::CdG::Compound:Gene(Compound::DB01199,Gene::7088) AND bioarx::Covid2_acc_host_gene::Disease:Gene(Disease::SARS-CoV2-nsp13,Gene::7088)=>Merged:Treatment(Compound::DB01192,Disease::SARS-CoV2-nsp13)	0.1625
 DRUGBANK::ddi-interactor-in::Compound:Compound(Compound::DB01192,Compound::DB06287) AND Hetionet::CuG::Compound:Gene(Compound::DB06287,Gene::2804) AND bioarx::Covid2_acc_host_gene::Disease:Gene(Disease::SARS-CoV2-nsp13,Gene::2804)=>Merged:Treatment(Compound::DB01192,Disease::SARS-CoV2-nsp13)	0.221
 DRUGBANK::ddi-interactor-in::Compound:Compound(Compound::DB01192,Compound::DB06287) AND Hetionet::CuG::Compound:Gene(Compound::DB06287,Gene::10142) AND bioarx::Covid2_acc_host_gene::Disease:Gene(Disease::SARS-CoV2-nsp13,Gene::10142)=>Merged:Treatment(Compound::DB01192,Disease::SARS-CoV2-nsp13)	0.221
 DRUGBANK::ddi-interactor-in::Compound:Compound(Compound::DB01192,Compound::DB06287) AND Hetionet::CuG::Compound:Gene(Compound::DB06287,Gene::79443) AND bioarx::Covid2_acc_host_gene::Disease:Gene(Disease::SARS-CoV2-nsp13,Gene::79443)=>Merged:Treatment(Compound::DB01192,Disease::SARS-CoV2-nsp13)	0.221
 DRUGBANK::ddi-interactor-in::Compound:Compound(Compound::DB01192,Compound::DB09020) AND Hetionet::CuG::Compound:Gene(Compound::DB09020,Gene::5566) AND bioarx::Covid2_acc_host_gene::Disease:Gene(Disease::SARS-CoV2-nsp13,Gene::5566)=>Merged:Treatment(Compound::DB01192,Disease::SARS-CoV2-nsp13)	0.221
 DRUGBANK::ddi-interactor-in::Compound:Compound(Compound::DB01192,Compound::DB09020) AND Hetionet::CuG::Compound:Gene(Compound::DB09020,Gene::9857) AND bioarx::Covid2_acc_host_gene::Disease:Gene(Disease::SARS-CoV2-nsp13,Gene::9857)=>Merged:Treatment(Compound::DB01192,Disease::SARS-CoV2-nsp13)	0.221
 DRUGBANK::ddi-interactor-in::Compound:Compound(Compound::DB01192,Compound::DB08901) AND Hetionet::CuG::Compound:Gene(Compound::DB08901,Gene::5566) AND bioarx::Covid2_acc_host_gene::Disease:Gene(Disease::SARS-CoV2-nsp13,Gene::5566)=>Merged:Treatment(Compound::DB01192,Disease::SARS-CoV2-nsp13)	0.221
 DRUGBANK::ddi-interactor-in::Compound:Compound(Compound::DB01074,Compound::DB01192) AND Hetionet::CuG::Compound:Gene(Compound::DB01074,Gene::2804) AND bioarx::Covid2_acc_host_gene::Disease:Gene(Disease::SARS-CoV2-nsp13,Gene::2804)=>Merged:Treatment(Compound::DB01192,Disease::SARS-CoV2-nsp13)	0.2535
