 Merged:Treatment(Compound::DB00486,Disease::MESH:D009369) AND GNBR::L::Gene:Disease(Gene::3615,Disease::MESH:D009369) AND bioarx::Covid2_acc_host_gene::Disease:Gene(Disease::SARS-CoV2-nsp14,Gene::3615)=>Merged:Treatment(Compound::DB00486,Disease::SARS-CoV2-nsp14)	0.117
 Merged:Treatment(Compound::DB00486,Disease::MESH:D009369) AND GNBR::L::Gene:Disease(Gene::23408,Disease::MESH:D009369) AND bioarx::Covid2_acc_host_gene::Disease:Gene(Disease::SARS-CoV2-nsp14,Gene::23408)=>Merged:Treatment(Compound::DB00486,Disease::SARS-CoV2-nsp14)	0.117
 DRUGBANK::ddi-interactor-in::Compound:Compound(Compound::DB00188,Compound::DB00486) AND Hetionet::CdG::Compound:Gene(Compound::DB00188,Gene::3615) AND bioarx::Covid2_acc_host_gene::Disease:Gene(Disease::SARS-CoV2-nsp14,Gene::3615)=>Merged:Treatment(Compound::DB00486,Disease::SARS-CoV2-nsp14)	0.2665
 DRUGBANK::ddi-interactor-in::Compound:Compound(Compound::DB00486,Compound::DB00688) AND bioarx::DrugHumGen:Compound:Gene(Compound::DB00688,Gene::3615) AND bioarx::Covid2_acc_host_gene::Disease:Gene(Disease::SARS-CoV2-nsp14,Gene::3615)=>Merged:Treatment(Compound::DB00486,Disease::SARS-CoV2-nsp14)	0.2145
 DRUGBANK::ddi-interactor-in::Compound:Compound(Compound::DB00486,Compound::DB00688) AND DRUGBANK::target::Compound:Gene(Compound::DB00688,Gene::3615) AND bioarx::Covid2_acc_host_gene::Disease:Gene(Disease::SARS-CoV2-nsp14,Gene::3615)=>Merged:Treatment(Compound::DB00486,Disease::SARS-CoV2-nsp14)	0.182
 DRUGBANK::ddi-interactor-in::Compound:Compound(Compound::DB00486,Compound::DB00688) AND Hetionet::CbG::Compound:Gene(Compound::DB00688,Gene::3615) AND bioarx::Covid2_acc_host_gene::Disease:Gene(Disease::SARS-CoV2-nsp14,Gene::3615)=>Merged:Treatment(Compound::DB00486,Disease::SARS-CoV2-nsp14)	0.156
 DRUGBANK::ddi-interactor-in::Compound:Compound(Compound::DB00486,Compound::DB01177) AND Hetionet::CuG::Compound:Gene(Compound::DB01177,Gene::23408) AND bioarx::Covid2_acc_host_gene::Disease:Gene(Disease::SARS-CoV2-nsp14,Gene::23408)=>Merged:Treatment(Compound::DB00486,Disease::SARS-CoV2-nsp14)	0.221
 DRUGBANK::ddi-interactor-in::Compound:Compound(Compound::DB00486,Compound::DB08912) AND Hetionet::CuG::Compound:Gene(Compound::DB08912,Gene::23408) AND bioarx::Covid2_acc_host_gene::Disease:Gene(Disease::SARS-CoV2-nsp14,Gene::23408)=>Merged:Treatment(Compound::DB00486,Disease::SARS-CoV2-nsp14)	0.221
