 DRUGBANK::ddi-interactor-in::Compound:Compound(Compound::DB01193,Compound::DB09061) AND bioarx::DrugHumGen:Compound:Gene(Compound::DB09061,Gene::2876) AND bioarx::Covid2_acc_host_gene::Disease:Gene(Disease::SARS-CoV2-nsp5_C145A,Gene::2876)=>Merged:Treatment(Compound::DB01193,Disease::SARS-CoV2-nsp5_C145A)	0.2145
 DRUGBANK::ddi-interactor-in::Compound:Compound(Compound::DB01193,Compound::DB09061) AND DRUGBANK::target::Compound:Gene(Compound::DB09061,Gene::2876) AND bioarx::Covid2_acc_host_gene::Disease:Gene(Disease::SARS-CoV2-nsp5_C145A,Gene::2876)=>Merged:Treatment(Compound::DB01193,Disease::SARS-CoV2-nsp5_C145A)	0.182
 DRUGBANK::ddi-interactor-in::Compound:Compound(Compound::DB01193,Compound::DB14011) AND DRUGBANK::target::Compound:Gene(Compound::DB14011,Gene::2876) AND bioarx::Covid2_acc_host_gene::Disease:Gene(Disease::SARS-CoV2-nsp5_C145A,Gene::2876)=>Merged:Treatment(Compound::DB01193,Disease::SARS-CoV2-nsp5_C145A)	0.182
 DRUGBANK::ddi-interactor-in::Compound:Compound(Compound::DB00762,Compound::DB01193) AND Hetionet::CuG::Compound:Gene(Compound::DB00762,Gene::55621) AND bioarx::Covid2_acc_host_gene::Disease:Gene(Disease::SARS-CoV2-nsp5_C145A,Gene::55621)=>Merged:Treatment(Compound::DB01193,Disease::SARS-CoV2-nsp5_C145A)	0.2535
 DRUGBANK::ddi-interactor-in::Compound:Compound(Compound::DB00305,Compound::DB01193) AND Hetionet::CuG::Compound:Gene(Compound::DB00305,Gene::55621) AND bioarx::Covid2_acc_host_gene::Disease:Gene(Disease::SARS-CoV2-nsp5_C145A,Gene::55621)=>Merged:Treatment(Compound::DB01193,Disease::SARS-CoV2-nsp5_C145A)	0.2535
 DRUGBANK::ddi-interactor-in::Compound:Compound(Compound::DB00374,Compound::DB01193) AND Hetionet::CdG::Compound:Gene(Compound::DB00374,Gene::55621) AND bioarx::Covid2_acc_host_gene::Disease:Gene(Disease::SARS-CoV2-nsp5_C145A,Gene::55621)=>Merged:Treatment(Compound::DB01193,Disease::SARS-CoV2-nsp5_C145A)	0.2665
 DRUGBANK::ddi-interactor-in::Compound:Compound(Compound::DB00227,Compound::DB01193) AND Hetionet::CdG::Compound:Gene(Compound::DB00227,Gene::55621) AND bioarx::Covid2_acc_host_gene::Disease:Gene(Disease::SARS-CoV2-nsp5_C145A,Gene::55621)=>Merged:Treatment(Compound::DB01193,Disease::SARS-CoV2-nsp5_C145A)	0.2665
 DRUGBANK::ddi-interactor-in::Compound:Compound(Compound::DB01193,Compound::DB14009) AND DRUGBANK::target::Compound:Gene(Compound::DB14009,Gene::2876) AND bioarx::Covid2_acc_host_gene::Disease:Gene(Disease::SARS-CoV2-nsp5_C145A,Gene::2876)=>Merged:Treatment(Compound::DB01193,Disease::SARS-CoV2-nsp5_C145A)	0.182
