 Hetionet::CdG::Compound:Gene(Compound::DB00773,Gene::10024) AND Hetionet::Gr>G::Gene:Gene(Gene::27243,Gene::10024) AND bioarx::Covid2_acc_host_gene::Disease:Gene(Disease::SARS-CoV2-orf9b,Gene::27243)=>Merged:Treatment(Compound::DB00773,Disease::SARS-CoV2-orf9b)	0.1495
 Hetionet::CdG::Compound:Gene(Compound::DB00773,Gene::7153) AND Hetionet::Gr>G::Gene:Gene(Gene::27243,Gene::7153) AND bioarx::Covid2_acc_host_gene::Disease:Gene(Disease::SARS-CoV2-orf9b,Gene::27243)=>Merged:Treatment(Compound::DB00773,Disease::SARS-CoV2-orf9b)	0.1495
 Merged:Treatment(Compound::DB00773,Disease::MESH:D007674) AND GNBR::L::Gene:Disease(Gene::9368,Disease::MESH:D007674) AND bioarx::Covid2_acc_host_gene::Disease:Gene(Disease::SARS-CoV2-orf9b,Gene::9368)=>Merged:Treatment(Compound::DB00773,Disease::SARS-CoV2-orf9b)	0.117
 Hetionet::CdG::Compound:Gene(Compound::DB00773,Gene::6192) AND Hetionet::Gr>G::Gene:Gene(Gene::27243,Gene::6192) AND bioarx::Covid2_acc_host_gene::Disease:Gene(Disease::SARS-CoV2-orf9b,Gene::27243)=>Merged:Treatment(Compound::DB00773,Disease::SARS-CoV2-orf9b)	0.1495
 DRUGBANK::ddi-interactor-in::Compound:Compound(Compound::DB00091,Compound::DB00773) AND Hetionet::CdG::Compound:Gene(Compound::DB00091,Gene::79077) AND bioarx::Covid2_acc_host_gene::Disease:Gene(Disease::SARS-CoV2-orf9b,Gene::79077)=>Merged:Treatment(Compound::DB00773,Disease::SARS-CoV2-orf9b)	0.2665
 DRUGBANK::ddi-interactor-in::Compound:Compound(Compound::DB00773,Compound::DB01394) AND Hetionet::CdG::Compound:Gene(Compound::DB01394,Gene::9868) AND bioarx::Covid2_acc_host_gene::Disease:Gene(Disease::SARS-CoV2-orf9b,Gene::9868)=>Merged:Treatment(Compound::DB00773,Disease::SARS-CoV2-orf9b)	0.1625
 Hetionet::CdG::Compound:Gene(Compound::DB00773,Gene::10112) AND Hetionet::Gr>G::Gene:Gene(Gene::27243,Gene::10112) AND bioarx::Covid2_acc_host_gene::Disease:Gene(Disease::SARS-CoV2-orf9b,Gene::27243)=>Merged:Treatment(Compound::DB00773,Disease::SARS-CoV2-orf9b)	0.1495
 Hetionet::CuG::Compound:Gene(Compound::DB00773,Gene::5743) AND Hetionet::Gr>G::Gene:Gene(Gene::27243,Gene::5743) AND bioarx::Covid2_acc_host_gene::Disease:Gene(Disease::SARS-CoV2-orf9b,Gene::27243)=>Merged:Treatment(Compound::DB00773,Disease::SARS-CoV2-orf9b)	0.143
 Hetionet::CuG::Compound:Gene(Compound::DB00773,Gene::291) AND Hetionet::Gr>G::Gene:Gene(Gene::27243,Gene::291) AND bioarx::Covid2_acc_host_gene::Disease:Gene(Disease::SARS-CoV2-orf9b,Gene::27243)=>Merged:Treatment(Compound::DB00773,Disease::SARS-CoV2-orf9b)	0.143
 Hetionet::CdG::Compound:Gene(Compound::DB00773,Gene::9787) AND Hetionet::Gr>G::Gene:Gene(Gene::27243,Gene::9787) AND bioarx::Covid2_acc_host_gene::Disease:Gene(Disease::SARS-CoV2-orf9b,Gene::27243)=>Merged:Treatment(Compound::DB00773,Disease::SARS-CoV2-orf9b)	0.1495
 Hetionet::CuG::Compound:Gene(Compound::DB00773,Gene::4792) AND Hetionet::Gr>G::Gene:Gene(Gene::27243,Gene::4792) AND bioarx::Covid2_acc_host_gene::Disease:Gene(Disease::SARS-CoV2-orf9b,Gene::27243)=>Merged:Treatment(Compound::DB00773,Disease::SARS-CoV2-orf9b)	0.143
 Hetionet::CdG::Compound:Gene(Compound::DB00773,Gene::891) AND Hetionet::Gr>G::Gene:Gene(Gene::9868,Gene::891) AND bioarx::Covid2_acc_host_gene::Disease:Gene(Disease::SARS-CoV2-orf9b,Gene::9868)=>Merged:Treatment(Compound::DB00773,Disease::SARS-CoV2-orf9b)	0.1495
 Hetionet::CdG::Compound:Gene(Compound::DB00773,Gene::891) AND Hetionet::Gr>G::Gene:Gene(Gene::27243,Gene::891) AND bioarx::Covid2_acc_host_gene::Disease:Gene(Disease::SARS-CoV2-orf9b,Gene::27243)=>Merged:Treatment(Compound::DB00773,Disease::SARS-CoV2-orf9b)	0.1495
 DRUGBANK::ddi-interactor-in::Compound:Compound(Compound::DB00773,Compound::DB01248) AND Hetionet::CdG::Compound:Gene(Compound::DB01248,Gene::9868) AND bioarx::Covid2_acc_host_gene::Disease:Gene(Disease::SARS-CoV2-orf9b,Gene::9868)=>Merged:Treatment(Compound::DB00773,Disease::SARS-CoV2-orf9b)	0.1625
 DRUGBANK::ddi-interactor-in::Compound:Compound(Compound::DB00773,Compound::DB01229) AND Hetionet::CdG::Compound:Gene(Compound::DB01229,Gene::9868) AND bioarx::Covid2_acc_host_gene::Disease:Gene(Disease::SARS-CoV2-orf9b,Gene::9868)=>Merged:Treatment(Compound::DB00773,Disease::SARS-CoV2-orf9b)	0.1625
 Hetionet::CdG::Compound:Gene(Compound::DB00773,Gene::57215) AND Hetionet::Gr>G::Gene:Gene(Gene::27243,Gene::57215) AND bioarx::Covid2_acc_host_gene::Disease:Gene(Disease::SARS-CoV2-orf9b,Gene::27243)=>Merged:Treatment(Compound::DB00773,Disease::SARS-CoV2-orf9b)	0.1495
 DRUGBANK::ddi-interactor-in::Compound:Compound(Compound::DB00773,Compound::DB01268) AND Hetionet::CbG::Compound:Gene(Compound::DB01268,Gene::2011) AND bioarx::Covid2_acc_host_gene::Disease:Gene(Disease::SARS-CoV2-orf9b,Gene::2011)=>Merged:Treatment(Compound::DB00773,Disease::SARS-CoV2-orf9b)	0.156
 Hetionet::CdG::Compound:Gene(Compound::DB00773,Gene::57405) AND Hetionet::Gr>G::Gene:Gene(Gene::27243,Gene::57405) AND bioarx::Covid2_acc_host_gene::Disease:Gene(Disease::SARS-CoV2-orf9b,Gene::27243)=>Merged:Treatment(Compound::DB00773,Disease::SARS-CoV2-orf9b)	0.1495
 Hetionet::CdG::Compound:Gene(Compound::DB00773,Gene::9847) AND Hetionet::Gr>G::Gene:Gene(Gene::27243,Gene::9847) AND bioarx::Covid2_acc_host_gene::Disease:Gene(Disease::SARS-CoV2-orf9b,Gene::27243)=>Merged:Treatment(Compound::DB00773,Disease::SARS-CoV2-orf9b)	0.1495
 Hetionet::CdG::Compound:Gene(Compound::DB00773,Gene::9847) AND Hetionet::Gr>G::Gene:Gene(Gene::9868,Gene::9847) AND bioarx::Covid2_acc_host_gene::Disease:Gene(Disease::SARS-CoV2-orf9b,Gene::9868)=>Merged:Treatment(Compound::DB00773,Disease::SARS-CoV2-orf9b)	0.1495
 Merged:Treatment(Compound::DB00773,Disease::MESH:D011471) AND GNBR::L::Gene:Disease(Gene::9529,Disease::MESH:D011471) AND bioarx::Covid2_acc_host_gene::Disease:Gene(Disease::SARS-CoV2-orf9b,Gene::9529)=>Merged:Treatment(Compound::DB00773,Disease::SARS-CoV2-orf9b)	0.117
 Merged:Treatment(Compound::DB00773,Disease::MESH:D011471) AND GNBR::L::Gene:Disease(Gene::79077,Disease::MESH:D011471) AND bioarx::Covid2_acc_host_gene::Disease:Gene(Disease::SARS-CoV2-orf9b,Gene::79077)=>Merged:Treatment(Compound::DB00773,Disease::SARS-CoV2-orf9b)	0.117
 Hetionet::CdG::Compound:Gene(Compound::DB00773,Gene::2305) AND Hetionet::Gr>G::Gene:Gene(Gene::27243,Gene::2305) AND bioarx::Covid2_acc_host_gene::Disease:Gene(Disease::SARS-CoV2-orf9b,Gene::27243)=>Merged:Treatment(Compound::DB00773,Disease::SARS-CoV2-orf9b)	0.1495
 Hetionet::CdG::Compound:Gene(Compound::DB00773,Gene::994) AND Hetionet::Gr>G::Gene:Gene(Gene::27243,Gene::994) AND bioarx::Covid2_acc_host_gene::Disease:Gene(Disease::SARS-CoV2-orf9b,Gene::27243)=>Merged:Treatment(Compound::DB00773,Disease::SARS-CoV2-orf9b)	0.1495
 Hetionet::CuG::Compound:Gene(Compound::DB00773,Gene::4791) AND Hetionet::Gr>G::Gene:Gene(Gene::27243,Gene::4791) AND bioarx::Covid2_acc_host_gene::Disease:Gene(Disease::SARS-CoV2-orf9b,Gene::27243)=>Merged:Treatment(Compound::DB00773,Disease::SARS-CoV2-orf9b)	0.143
 DRUGBANK::ddi-interactor-in::Compound:Compound(Compound::DB00773,Compound::DB08860) AND Hetionet::CdG::Compound:Gene(Compound::DB08860,Gene::79077) AND bioarx::Covid2_acc_host_gene::Disease:Gene(Disease::SARS-CoV2-orf9b,Gene::79077)=>Merged:Treatment(Compound::DB00773,Disease::SARS-CoV2-orf9b)	0.1625
 DRUGBANK::ddi-interactor-in::Compound:Compound(Compound::DB00570,Compound::DB00773) AND Hetionet::CdG::Compound:Gene(Compound::DB00570,Gene::9868) AND bioarx::Covid2_acc_host_gene::Disease:Gene(Disease::SARS-CoV2-orf9b,Gene::9868)=>Merged:Treatment(Compound::DB00773,Disease::SARS-CoV2-orf9b)	0.2665
 DRUGBANK::ddi-interactor-in::Compound:Compound(Compound::DB00570,Compound::DB00773) AND Hetionet::CuG::Compound:Gene(Compound::DB00570,Gene::4140) AND bioarx::Covid2_acc_host_gene::Disease:Gene(Disease::SARS-CoV2-orf9b,Gene::4140)=>Merged:Treatment(Compound::DB00773,Disease::SARS-CoV2-orf9b)	0.2535
 DRUGBANK::ddi-interactor-in::Compound:Compound(Compound::DB00773,Compound::DB01234) AND Hetionet::CdG::Compound:Gene(Compound::DB01234,Gene::58155) AND bioarx::Covid2_acc_host_gene::Disease:Gene(Disease::SARS-CoV2-orf9b,Gene::58155)=>Merged:Treatment(Compound::DB00773,Disease::SARS-CoV2-orf9b)	0.1625
 Hetionet::CdG::Compound:Gene(Compound::DB00773,Gene::9133) AND Hetionet::Gr>G::Gene:Gene(Gene::27243,Gene::9133) AND bioarx::Covid2_acc_host_gene::Disease:Gene(Disease::SARS-CoV2-orf9b,Gene::27243)=>Merged:Treatment(Compound::DB00773,Disease::SARS-CoV2-orf9b)	0.1495
 Merged:Treatment(Compound::DB00773,Disease::MESH:D009369) AND GNBR::L::Gene:Disease(Gene::79077,Disease::MESH:D009369) AND bioarx::Covid2_acc_host_gene::Disease:Gene(Disease::SARS-CoV2-orf9b,Gene::79077)=>Merged:Treatment(Compound::DB00773,Disease::SARS-CoV2-orf9b)	0.117
 Merged:Treatment(Compound::DB00773,Disease::MESH:D009369) AND GNBR::L::Gene:Disease(Gene::27243,Disease::MESH:D009369) AND bioarx::Covid2_acc_host_gene::Disease:Gene(Disease::SARS-CoV2-orf9b,Gene::27243)=>Merged:Treatment(Compound::DB00773,Disease::SARS-CoV2-orf9b)	0.117
 Hetionet::CdG::Compound:Gene(Compound::DB00773,Gene::991) AND Hetionet::Gr>G::Gene:Gene(Gene::4139,Gene::991) AND bioarx::Covid2_acc_host_gene::Disease:Gene(Disease::SARS-CoV2-orf9b,Gene::4139)=>Merged:Treatment(Compound::DB00773,Disease::SARS-CoV2-orf9b)	0.1495
 Hetionet::CdG::Compound:Gene(Compound::DB00773,Gene::991) AND Hetionet::Gr>G::Gene:Gene(Gene::27243,Gene::991) AND bioarx::Covid2_acc_host_gene::Disease:Gene(Disease::SARS-CoV2-orf9b,Gene::27243)=>Merged:Treatment(Compound::DB00773,Disease::SARS-CoV2-orf9b)	0.1495
 Merged:Treatment(Compound::DB00773,Disease::MESH:D015179) AND GNBR::L::Gene:Disease(Gene::9368,Disease::MESH:D015179) AND bioarx::Covid2_acc_host_gene::Disease:Gene(Disease::SARS-CoV2-orf9b,Gene::9368)=>Merged:Treatment(Compound::DB00773,Disease::SARS-CoV2-orf9b)	0.117
 DRUGBANK::ddi-interactor-in::Compound:Compound(Compound::DB00390,Compound::DB00773) AND Hetionet::CdG::Compound:Gene(Compound::DB00390,Gene::9368) AND bioarx::Covid2_acc_host_gene::Disease:Gene(Disease::SARS-CoV2-orf9b,Gene::9368)=>Merged:Treatment(Compound::DB00773,Disease::SARS-CoV2-orf9b)	0.2665
 DRUGBANK::ddi-interactor-in::Compound:Compound(Compound::DB00390,Compound::DB00773) AND Hetionet::CdG::Compound:Gene(Compound::DB00390,Gene::79077) AND bioarx::Covid2_acc_host_gene::Disease:Gene(Disease::SARS-CoV2-orf9b,Gene::79077)=>Merged:Treatment(Compound::DB00773,Disease::SARS-CoV2-orf9b)	0.2665
 DRUGBANK::ddi-interactor-in::Compound:Compound(Compound::DB00390,Compound::DB00773) AND Hetionet::CuG::Compound:Gene(Compound::DB00390,Gene::58155) AND bioarx::Covid2_acc_host_gene::Disease:Gene(Disease::SARS-CoV2-orf9b,Gene::58155)=>Merged:Treatment(Compound::DB00773,Disease::SARS-CoV2-orf9b)	0.2535
 DRUGBANK::ddi-interactor-in::Compound:Compound(Compound::DB00443,Compound::DB00773) AND Hetionet::CdG::Compound:Gene(Compound::DB00443,Gene::58155) AND bioarx::Covid2_acc_host_gene::Disease:Gene(Disease::SARS-CoV2-orf9b,Gene::58155)=>Merged:Treatment(Compound::DB00773,Disease::SARS-CoV2-orf9b)	0.2665
 DRUGBANK::ddi-interactor-in::Compound:Compound(Compound::DB00367,Compound::DB00773) AND Hetionet::CdG::Compound:Gene(Compound::DB00367,Gene::9868) AND bioarx::Covid2_acc_host_gene::Disease:Gene(Disease::SARS-CoV2-orf9b,Gene::9868)=>Merged:Treatment(Compound::DB00773,Disease::SARS-CoV2-orf9b)	0.2665
 Hetionet::CdG::Compound:Gene(Compound::DB00773,Gene::10362) AND Hetionet::Gr>G::Gene:Gene(Gene::27243,Gene::10362) AND bioarx::Covid2_acc_host_gene::Disease:Gene(Disease::SARS-CoV2-orf9b,Gene::27243)=>Merged:Treatment(Compound::DB00773,Disease::SARS-CoV2-orf9b)	0.1495
 Hetionet::CdG::Compound:Gene(Compound::DB00773,Gene::10362) AND Hetionet::Gr>G::Gene:Gene(Gene::4139,Gene::10362) AND bioarx::Covid2_acc_host_gene::Disease:Gene(Disease::SARS-CoV2-orf9b,Gene::4139)=>Merged:Treatment(Compound::DB00773,Disease::SARS-CoV2-orf9b)	0.1495
 Hetionet::CdG::Compound:Gene(Compound::DB00773,Gene::332) AND Hetionet::Gr>G::Gene:Gene(Gene::27243,Gene::332) AND bioarx::Covid2_acc_host_gene::Disease:Gene(Disease::SARS-CoV2-orf9b,Gene::27243)=>Merged:Treatment(Compound::DB00773,Disease::SARS-CoV2-orf9b)	0.1495
 Hetionet::CuG::Compound:Gene(Compound::DB00773,Gene::5971) AND Hetionet::Gr>G::Gene:Gene(Gene::27243,Gene::5971) AND bioarx::Covid2_acc_host_gene::Disease:Gene(Disease::SARS-CoV2-orf9b,Gene::27243)=>Merged:Treatment(Compound::DB00773,Disease::SARS-CoV2-orf9b)	0.143
 Hetionet::CuG::Compound:Gene(Compound::DB00773,Gene::5366) AND Hetionet::Gr>G::Gene:Gene(Gene::27243,Gene::5366) AND bioarx::Covid2_acc_host_gene::Disease:Gene(Disease::SARS-CoV2-orf9b,Gene::27243)=>Merged:Treatment(Compound::DB00773,Disease::SARS-CoV2-orf9b)	0.143
 Hetionet::CuG::Compound:Gene(Compound::DB00773,Gene::355) AND Hetionet::Gr>G::Gene:Gene(Gene::27243,Gene::355) AND bioarx::Covid2_acc_host_gene::Disease:Gene(Disease::SARS-CoV2-orf9b,Gene::27243)=>Merged:Treatment(Compound::DB00773,Disease::SARS-CoV2-orf9b)	0.143
 Hetionet::CdG::Compound:Gene(Compound::DB00773,Gene::4172) AND Hetionet::Gr>G::Gene:Gene(Gene::27243,Gene::4172) AND bioarx::Covid2_acc_host_gene::Disease:Gene(Disease::SARS-CoV2-orf9b,Gene::27243)=>Merged:Treatment(Compound::DB00773,Disease::SARS-CoV2-orf9b)	0.1495
 DRUGBANK::ddi-interactor-in::Compound:Compound(Compound::DB00518,Compound::DB00773) AND Hetionet::CdG::Compound:Gene(Compound::DB00518,Gene::9868) AND bioarx::Covid2_acc_host_gene::Disease:Gene(Disease::SARS-CoV2-orf9b,Gene::9868)=>Merged:Treatment(Compound::DB00773,Disease::SARS-CoV2-orf9b)	0.2665
 DRUGBANK::ddi-interactor-in::Compound:Compound(Compound::DB00773,Compound::DB01092) AND Hetionet::CdG::Compound:Gene(Compound::DB01092,Gene::79077) AND bioarx::Covid2_acc_host_gene::Disease:Gene(Disease::SARS-CoV2-orf9b,Gene::79077)=>Merged:Treatment(Compound::DB00773,Disease::SARS-CoV2-orf9b)	0.1625
 DRUGBANK::ddi-interactor-in::Compound:Compound(Compound::DB00773,Compound::DB01092) AND Hetionet::CuG::Compound:Gene(Compound::DB01092,Gene::58155) AND bioarx::Covid2_acc_host_gene::Disease:Gene(Disease::SARS-CoV2-orf9b,Gene::58155)=>Merged:Treatment(Compound::DB00773,Disease::SARS-CoV2-orf9b)	0.221
 Hetionet::CdG::Compound:Gene(Compound::DB00773,Gene::54908) AND Hetionet::Gr>G::Gene:Gene(Gene::27243,Gene::54908) AND bioarx::Covid2_acc_host_gene::Disease:Gene(Disease::SARS-CoV2-orf9b,Gene::27243)=>Merged:Treatment(Compound::DB00773,Disease::SARS-CoV2-orf9b)	0.1495
 DRUGBANK::ddi-interactor-in::Compound:Compound(Compound::DB00541,Compound::DB00773) AND Hetionet::CdG::Compound:Gene(Compound::DB00541,Gene::9868) AND bioarx::Covid2_acc_host_gene::Disease:Gene(Disease::SARS-CoV2-orf9b,Gene::9868)=>Merged:Treatment(Compound::DB00773,Disease::SARS-CoV2-orf9b)	0.2665
 DRUGBANK::ddi-interactor-in::Compound:Compound(Compound::DB00541,Compound::DB00773) AND Hetionet::CuG::Compound:Gene(Compound::DB00541,Gene::4140) AND bioarx::Covid2_acc_host_gene::Disease:Gene(Disease::SARS-CoV2-orf9b,Gene::4140)=>Merged:Treatment(Compound::DB00773,Disease::SARS-CoV2-orf9b)	0.2535
 DRUGBANK::ddi-interactor-in::Compound:Compound(Compound::DB00316,Compound::DB00773) AND DGIDB::OTHER::Gene:Compound(Gene::2011,Compound::DB00316) AND bioarx::Covid2_acc_host_gene::Disease:Gene(Disease::SARS-CoV2-orf9b,Gene::2011)=>Merged:Treatment(Compound::DB00773,Disease::SARS-CoV2-orf9b)	0.1105
 Hetionet::CuG::Compound:Gene(Compound::DB00773,Gene::1026) AND Hetionet::Gr>G::Gene:Gene(Gene::27243,Gene::1026) AND bioarx::Covid2_acc_host_gene::Disease:Gene(Disease::SARS-CoV2-orf9b,Gene::27243)=>Merged:Treatment(Compound::DB00773,Disease::SARS-CoV2-orf9b)	0.143
 Merged:Treatment(Compound::DB00773,Disease::MESH:D001943) AND GNBR::L::Gene:Disease(Gene::79077,Disease::MESH:D001943) AND bioarx::Covid2_acc_host_gene::Disease:Gene(Disease::SARS-CoV2-orf9b,Gene::79077)=>Merged:Treatment(Compound::DB00773,Disease::SARS-CoV2-orf9b)	0.117
 Merged:Treatment(Compound::DB00773,Disease::MESH:D001943) AND GNBR::L::Gene:Disease(Gene::9368,Disease::MESH:D001943) AND bioarx::Covid2_acc_host_gene::Disease:Gene(Disease::SARS-CoV2-orf9b,Gene::9368)=>Merged:Treatment(Compound::DB00773,Disease::SARS-CoV2-orf9b)	0.117
 Hetionet::CuG::Compound:Gene(Compound::DB00773,Gene::7538) AND Hetionet::Gr>G::Gene:Gene(Gene::27243,Gene::7538) AND bioarx::Covid2_acc_host_gene::Disease:Gene(Disease::SARS-CoV2-orf9b,Gene::27243)=>Merged:Treatment(Compound::DB00773,Disease::SARS-CoV2-orf9b)	0.143
 DRUGBANK::ddi-interactor-in::Compound:Compound(Compound::DB00773,Compound::DB01103) AND Hetionet::CdG::Compound:Gene(Compound::DB01103,Gene::51611) AND bioarx::Covid2_acc_host_gene::Disease:Gene(Disease::SARS-CoV2-orf9b,Gene::51611)=>Merged:Treatment(Compound::DB00773,Disease::SARS-CoV2-orf9b)	0.1625
 DRUGBANK::ddi-interactor-in::Compound:Compound(Compound::DB00481,Compound::DB00773) AND Hetionet::CdG::Compound:Gene(Compound::DB00481,Gene::9868) AND bioarx::Covid2_acc_host_gene::Disease:Gene(Disease::SARS-CoV2-orf9b,Gene::9868)=>Merged:Treatment(Compound::DB00773,Disease::SARS-CoV2-orf9b)	0.2665
 DRUGBANK::ddi-interactor-in::Compound:Compound(Compound::DB00773,Compound::DB06287) AND Hetionet::CdG::Compound:Gene(Compound::DB06287,Gene::9868) AND bioarx::Covid2_acc_host_gene::Disease:Gene(Disease::SARS-CoV2-orf9b,Gene::9868)=>Merged:Treatment(Compound::DB00773,Disease::SARS-CoV2-orf9b)	0.1625
 Hetionet::CdG::Compound:Gene(Compound::DB00773,Gene::3930) AND Hetionet::Gr>G::Gene:Gene(Gene::9868,Gene::3930) AND bioarx::Covid2_acc_host_gene::Disease:Gene(Disease::SARS-CoV2-orf9b,Gene::9868)=>Merged:Treatment(Compound::DB00773,Disease::SARS-CoV2-orf9b)	0.1495
 Hetionet::CuG::Compound:Gene(Compound::DB00773,Gene::1475) AND Hetionet::Gr>G::Gene:Gene(Gene::27243,Gene::1475) AND bioarx::Covid2_acc_host_gene::Disease:Gene(Disease::SARS-CoV2-orf9b,Gene::27243)=>Merged:Treatment(Compound::DB00773,Disease::SARS-CoV2-orf9b)	0.143
 DRUGBANK::ddi-interactor-in::Compound:Compound(Compound::DB00361,Compound::DB00773) AND Hetionet::CdG::Compound:Gene(Compound::DB00361,Gene::9868) AND bioarx::Covid2_acc_host_gene::Disease:Gene(Disease::SARS-CoV2-orf9b,Gene::9868)=>Merged:Treatment(Compound::DB00773,Disease::SARS-CoV2-orf9b)	0.2665
 Hetionet::CdG::Compound:Gene(Compound::DB00773,Gene::23397) AND Hetionet::Gr>G::Gene:Gene(Gene::27243,Gene::23397) AND bioarx::Covid2_acc_host_gene::Disease:Gene(Disease::SARS-CoV2-orf9b,Gene::27243)=>Merged:Treatment(Compound::DB00773,Disease::SARS-CoV2-orf9b)	0.1495
 DRUGBANK::ddi-interactor-in::Compound:Compound(Compound::DB00694,Compound::DB00773) AND Hetionet::CdG::Compound:Gene(Compound::DB00694,Gene::9529) AND bioarx::Covid2_acc_host_gene::Disease:Gene(Disease::SARS-CoV2-orf9b,Gene::9529)=>Merged:Treatment(Compound::DB00773,Disease::SARS-CoV2-orf9b)	0.2665
 DRUGBANK::ddi-interactor-in::Compound:Compound(Compound::DB00441,Compound::DB00773) AND Hetionet::CdG::Compound:Gene(Compound::DB00441,Gene::9868) AND bioarx::Covid2_acc_host_gene::Disease:Gene(Disease::SARS-CoV2-orf9b,Gene::9868)=>Merged:Treatment(Compound::DB00773,Disease::SARS-CoV2-orf9b)	0.2665
 Merged:Treatment(Compound::DB00773,Disease::MESH:D010190) AND GNBR::L::Gene:Disease(Gene::9368,Disease::MESH:D010190) AND bioarx::Covid2_acc_host_gene::Disease:Gene(Disease::SARS-CoV2-orf9b,Gene::9368)=>Merged:Treatment(Compound::DB00773,Disease::SARS-CoV2-orf9b)	0.117
 Hetionet::CdG::Compound:Gene(Compound::DB00773,Gene::9688) AND Hetionet::Gr>G::Gene:Gene(Gene::9868,Gene::9688) AND bioarx::Covid2_acc_host_gene::Disease:Gene(Disease::SARS-CoV2-orf9b,Gene::9868)=>Merged:Treatment(Compound::DB00773,Disease::SARS-CoV2-orf9b)	0.1495
 DRUGBANK::ddi-interactor-in::Compound:Compound(Compound::DB00773,Compound::DB08881) AND Hetionet::CuG::Compound:Gene(Compound::DB08881,Gene::51611) AND bioarx::Covid2_acc_host_gene::Disease:Gene(Disease::SARS-CoV2-orf9b,Gene::51611)=>Merged:Treatment(Compound::DB00773,Disease::SARS-CoV2-orf9b)	0.221
 Merged:Treatment(Compound::DB00773,Disease::MESH:D003110) AND GNBR::L::Gene:Disease(Gene::9368,Disease::MESH:D003110) AND bioarx::Covid2_acc_host_gene::Disease:Gene(Disease::SARS-CoV2-orf9b,Gene::9368)=>Merged:Treatment(Compound::DB00773,Disease::SARS-CoV2-orf9b)	0.117
 DRUGBANK::ddi-interactor-in::Compound:Compound(Compound::DB00773,Compound::DB08877) AND Hetionet::CbG::Compound:Gene(Compound::DB08877,Gene::2011) AND bioarx::Covid2_acc_host_gene::Disease:Gene(Disease::SARS-CoV2-orf9b,Gene::2011)=>Merged:Treatment(Compound::DB00773,Disease::SARS-CoV2-orf9b)	0.156
 Hetionet::CdG::Compound:Gene(Compound::DB00773,Gene::3161) AND Hetionet::Gr>G::Gene:Gene(Gene::27243,Gene::3161) AND bioarx::Covid2_acc_host_gene::Disease:Gene(Disease::SARS-CoV2-orf9b,Gene::27243)=>Merged:Treatment(Compound::DB00773,Disease::SARS-CoV2-orf9b)	0.1495
 DRUGBANK::ddi-interactor-in::Compound:Compound(Compound::DB00773,Compound::DB00928) AND Hetionet::CuG::Compound:Gene(Compound::DB00928,Gene::58155) AND bioarx::Covid2_acc_host_gene::Disease:Gene(Disease::SARS-CoV2-orf9b,Gene::58155)=>Merged:Treatment(Compound::DB00773,Disease::SARS-CoV2-orf9b)	0.221
 Hetionet::CdG::Compound:Gene(Compound::DB00773,Gene::22827) AND Hetionet::Gr>G::Gene:Gene(Gene::27243,Gene::22827) AND bioarx::Covid2_acc_host_gene::Disease:Gene(Disease::SARS-CoV2-orf9b,Gene::27243)=>Merged:Treatment(Compound::DB00773,Disease::SARS-CoV2-orf9b)	0.1495
 DRUGBANK::ddi-interactor-in::Compound:Compound(Compound::DB00773,Compound::DB01396) AND Hetionet::CdG::Compound:Gene(Compound::DB01396,Gene::79077) AND bioarx::Covid2_acc_host_gene::Disease:Gene(Disease::SARS-CoV2-orf9b,Gene::79077)=>Merged:Treatment(Compound::DB00773,Disease::SARS-CoV2-orf9b)	0.1625
 DRUGBANK::ddi-interactor-in::Compound:Compound(Compound::DB00773,Compound::DB01396) AND Hetionet::CuG::Compound:Gene(Compound::DB01396,Gene::58155) AND bioarx::Covid2_acc_host_gene::Disease:Gene(Disease::SARS-CoV2-orf9b,Gene::58155)=>Merged:Treatment(Compound::DB00773,Disease::SARS-CoV2-orf9b)	0.221
 DRUGBANK::ddi-interactor-in::Compound:Compound(Compound::DB00773,Compound::DB01396) AND Hetionet::CdG::Compound:Gene(Compound::DB01396,Gene::9368) AND bioarx::Covid2_acc_host_gene::Disease:Gene(Disease::SARS-CoV2-orf9b,Gene::9368)=>Merged:Treatment(Compound::DB00773,Disease::SARS-CoV2-orf9b)	0.1625
 Hetionet::CuG::Compound:Gene(Compound::DB00773,Gene::63874) AND Hetionet::Gr>G::Gene:Gene(Gene::27243,Gene::63874) AND bioarx::Covid2_acc_host_gene::Disease:Gene(Disease::SARS-CoV2-orf9b,Gene::27243)=>Merged:Treatment(Compound::DB00773,Disease::SARS-CoV2-orf9b)	0.143
 DRUGBANK::ddi-interactor-in::Compound:Compound(Compound::DB00773,Compound::DB01024) AND Hetionet::CdG::Compound:Gene(Compound::DB01024,Gene::4140) AND bioarx::Covid2_acc_host_gene::Disease:Gene(Disease::SARS-CoV2-orf9b,Gene::4140)=>Merged:Treatment(Compound::DB00773,Disease::SARS-CoV2-orf9b)	0.1625
 Hetionet::CuG::Compound:Gene(Compound::DB00773,Gene::2274) AND Hetionet::Gr>G::Gene:Gene(Gene::4139,Gene::2274) AND bioarx::Covid2_acc_host_gene::Disease:Gene(Disease::SARS-CoV2-orf9b,Gene::4139)=>Merged:Treatment(Compound::DB00773,Disease::SARS-CoV2-orf9b)	0.143
 DRUGBANK::ddi-interactor-in::Compound:Compound(Compound::DB00773,Compound::DB12010) AND DRUGBANK::target::Compound:Gene(Compound::DB12010,Gene::2011) AND bioarx::Covid2_acc_host_gene::Disease:Gene(Disease::SARS-CoV2-orf9b,Gene::2011)=>Merged:Treatment(Compound::DB00773,Disease::SARS-CoV2-orf9b)	0.182
 DRUGBANK::ddi-interactor-in::Compound:Compound(Compound::DB00773,Compound::DB12010) AND DRUGBANK::target::Compound:Gene(Compound::DB12010,Gene::4140) AND bioarx::Covid2_acc_host_gene::Disease:Gene(Disease::SARS-CoV2-orf9b,Gene::4140)=>Merged:Treatment(Compound::DB00773,Disease::SARS-CoV2-orf9b)	0.182
 DRUGBANK::ddi-interactor-in::Compound:Compound(Compound::DB00773,Compound::DB12010) AND DRUGBANK::target::Compound:Gene(Compound::DB12010,Gene::4139) AND bioarx::Covid2_acc_host_gene::Disease:Gene(Disease::SARS-CoV2-orf9b,Gene::4139)=>Merged:Treatment(Compound::DB00773,Disease::SARS-CoV2-orf9b)	0.182
 Hetionet::CdG::Compound:Gene(Compound::DB00773,Gene::51203) AND Hetionet::Gr>G::Gene:Gene(Gene::27243,Gene::51203) AND bioarx::Covid2_acc_host_gene::Disease:Gene(Disease::SARS-CoV2-orf9b,Gene::27243)=>Merged:Treatment(Compound::DB00773,Disease::SARS-CoV2-orf9b)	0.1495
 DRUGBANK::ddi-interactor-in::Compound:Compound(Compound::DB00398,Compound::DB00773) AND Hetionet::CuG::Compound:Gene(Compound::DB00398,Gene::51611) AND bioarx::Covid2_acc_host_gene::Disease:Gene(Disease::SARS-CoV2-orf9b,Gene::51611)=>Merged:Treatment(Compound::DB00773,Disease::SARS-CoV2-orf9b)	0.2535
 Hetionet::CuG::Compound:Gene(Compound::DB00773,Gene::1301) AND Hetionet::Gr>G::Gene:Gene(Gene::9868,Gene::1301) AND bioarx::Covid2_acc_host_gene::Disease:Gene(Disease::SARS-CoV2-orf9b,Gene::9868)=>Merged:Treatment(Compound::DB00773,Disease::SARS-CoV2-orf9b)	0.143
 Hetionet::CuG::Compound:Gene(Compound::DB00773,Gene::3383) AND Hetionet::Gr>G::Gene:Gene(Gene::27243,Gene::3383) AND bioarx::Covid2_acc_host_gene::Disease:Gene(Disease::SARS-CoV2-orf9b,Gene::27243)=>Merged:Treatment(Compound::DB00773,Disease::SARS-CoV2-orf9b)	0.143
 DRUGBANK::ddi-interactor-in::Compound:Compound(Compound::DB00773,Compound::DB01590) AND Hetionet::CdG::Compound:Gene(Compound::DB01590,Gene::79077) AND bioarx::Covid2_acc_host_gene::Disease:Gene(Disease::SARS-CoV2-orf9b,Gene::79077)=>Merged:Treatment(Compound::DB00773,Disease::SARS-CoV2-orf9b)	0.1625
 DRUGBANK::ddi-interactor-in::Compound:Compound(Compound::DB00773,Compound::DB00877) AND Hetionet::CdG::Compound:Gene(Compound::DB00877,Gene::79077) AND bioarx::Covid2_acc_host_gene::Disease:Gene(Disease::SARS-CoV2-orf9b,Gene::79077)=>Merged:Treatment(Compound::DB00773,Disease::SARS-CoV2-orf9b)	0.1625
